{"text_format":"1","workbook":"xlsx","n_sheets":77,"sheets":["Welcome and Overview","Terms of Release & Contact Info","THIRA Steps 1-3","Navigation and Progress","Developer Notes","THIRA #1 Planning","SPR #1 Planning","THIRA #2 Public Info Warn","SPR #2 Public Info Warn","THIRA #3 Op Coord","SPR #3 Op Coord","THIRA #4 Forensics Attribution","SPR #4 Forensics Attribution","THIRA #5 Intel Info Sharing","SPR #5 Intel Info Sharing","THIRA #6 Interdict Disrupt","SPR #6 Interdict Disrupt","THIRA #7 Screen Search Detect","SPR #7 Screen Search Detect","THIRA #8 Access Control","SPR #8 Access Control","THIRA #9 Cybersecurity","SPR #9 Cybersecurity","THIRA #10 Phys Protect Meas","SPR #10 Phys Protect Meas","THIRA #11 Risk Mgmt Protect","SPR #11 Risk Mgmt Protect","THIRA #12 Supply Chain","SPR #12 Supply Chain","THIRA #13 Comm Resilience","SPR #13 Comm Resilience","THIRA #14 Long Term Vul Red","SPR #14 Long Term Vul Red","THIRA #15 Risk Resil Assess","SPR #15 Risk Resil Assess","THIRA #16 Threat Haz ID","SPR #16 Threat Haz ID","THIRA #17 Crit Transport","SPR #17 Crit Transport","THIRA #18 Envir Resp Health","SPR #18 Envir Resp Health","THIRA #19 Fatality Mgmt","SPR #19 Fatality Mgmt","THIRA #20 Infrastructure Sys","SPR #20 Infrastructure Sys","THIRA #21 Mass Care","SPR #21 Mass Care","THIRA #22 Mass SAR Ops","SPR #22 Mass SAR Ops","THIRA #23 Security Protection","SPR #23 Security Protection","THIRA #24 Op Comms","SPR #24 Op Comms","THIRA #25 Pub Private Services","SPR #25 Pub Private Services","THIRA #26 Public Health Medical","SPR #26 Public Health Medical","THIRA #27 Sit Assessment","SPR #27 Sit Assessment","THIRA #28 Econ Recovery","SPR #28 Econ Recovery","THIRA #29 Health Soc Services","SPR #29 Health Soc Services","THIRA #30 Housing","SPR #30 Housing","THIRA #31 Nat Cult Resources","SPR #31 Nat Cult Resources","THIRA Post-Assessment","SPR Post-Assessment","Capability Ratings Data","Heat Map","Export Capabilities","Import SPR Contributions","Write Word Document","NIMS Implementation","Lists","Data"],"not_rendered":{"charts":6,"images":9,"macros":1,"external_links":4,"defined_names":362,"comments":1,"pivot_tables":0},"unopened":[],"bounds":{"document_bytes":16777216,"sheet_cells":100000,"rows_first":2000,"rows_last":500,"rows_between":2000,"halvings":0,"cell_chars":16384,"cell_head_chars":4096},"cells_cut":0,"cells_raw":0,"read":"whole","date_system":"1900"}

{"sheet":"Welcome and Overview","index":0,"n_rows":28,"n_cols":41,"rows_kept":28,"cut":false,"hidden":false,"merged":[[20,1,20,2],[23,1,27,1],[21,1,21,2]]}
[]
[]
[]
[]
[]
[]
[]
[]
[]
[]
[]
[]
[]
[]
[]
[]
[]
[]
[]
[]
[null,"Jurisdiction Name",null," "]
[null,"Assessments",null,null,null,null,null,null,null,null,null,null,null,null,null,null,null,null,null,null,null,null,null,null,null,null,null,null,null,null,null,null,null,null,null,null,null,null,true,false,false]
[]
[null,"Point of Contact","Name:"," "]
[null,null,"Title:"," "]
[null,null,"Organization:"," "]
[null,null,"E-mail address:"," "]
[null,null,"Phone number:"," "]

{"sheet":"Terms of Release & Contact Info","index":1,"n_rows":0,"n_cols":0,"rows_kept":0,"cut":false,"hidden":false,"merged":[]}

{"sheet":"THIRA Steps 1-3","index":2,"n_rows":133,"n_cols":3,"rows_kept":133,"cut":false,"hidden":false,"merged":[[8,1,8,2]]}
[]
[]
[]
[null,null,{"$f":"COLUMN()-2","v":1}]
[null,null,false]
[{"$f":"MAX(4:4)","v":1},"Enter Threats and Hazards -->","Natural"]
[{"$f":"COUNTIF(INDIRECT(\"c7:\" &ADDRESS(7,2+A6)),\"<>Click here to select hazard\")","v":0},null,"Click here to select hazard"]
[{"$f":"COUNTIF(INDIRECT(\"c8:\" &ADDRESS(8,2+A6)),\"<>Click here to enter context\")","v":1},"Enter Context Descriptions -->"," "]
[null,"Enter Capability Targets Below"]
[null,"Planning"]
[null,"Desired Outcomes (Optional)"]
[null,"Impacts (Optional)"]
[null,"Capability Target(s)"]
[null,"Public Information and Warning"]
[null,"Desired Outcomes (Optional)"]
[null,"Impacts (Optional)"]
[null,"Capability Target(s)"]
[null,"Operational Coordination"]
[null,"Desired Outcomes (Optional)"]
[null,"Impacts (Optional)"]
[null,"Capability Target(s)"]
[null,"Forensics and Attribution"]
[null,"Desired Outcomes (Optional)"]
[null,"Impacts (Optional)"]
[null,"Capability Target(s)"]
[null,"Intelligence and Information Sharing"]
[null,"Desired Outcomes (Optional)"]
[null,"Impacts (Optional)"]
[null,"Capability Target(s)"]
[null,"Interdiction and Disruption"]
[null,"Desired Outcomes (Optional)"]
[null,"Impacts (Optional)"]
[null,"Capability Target(s)"]
[null,"Screening, Search, and Detection"]
[null,"Desired Outcomes (Optional)"]
[null,"Impacts (Optional)"]
[null,"Capability Target(s)"]
[null,"Access Control and Identity Verification"]
[null,"Desired Outcomes (Optional)"]
[null,"Impacts (Optional)"]
[null,"Capability Target(s)"]
[null,"Cybersecurity"]
[null,"Desired Outcomes (Optional)"]
[null,"Impacts (Optional)"]
[null,"Capability Target(s)"]
[null,"Physical Protective Measures"]
[null,"Desired Outcomes (Optional)"]
[null,"Impacts (Optional)"]
[null,"Capability Target(s)"]
[null,"Risk Management for Protection Programs and Activities"]
[null,"Desired Outcomes (Optional)"]
[null,"Impacts (Optional)"]
[null,"Capability Target(s)"]
[null,"Supply Chain Integrity and Security"]
[null,"Desired Outcomes (Optional)"]
[null,"Impacts (Optional)"]
[null,"Capability Target(s)"]
[null,"Community Resilience"]
[null,"Desired Outcomes (Optional)"]
[null,"Impacts (Optional)"]
[null,"Capability Target(s)"]
[null,"Long-term Vulnerability Reduction"]
[null,"Desired Outcomes (Optional)"]
[null,"Impacts (Optional)"]
[null,"Capability Target(s)"]
[null,"Risk and Disaster Resilience Assessment"]
[null,"Desired Outcomes (Optional)"]
[null,"Impacts (Optional)"]
[null,"Capability Target(s)"]
[null,"Threats and Hazard Identification"]
[null,"Desired Outcomes (Optional)"]
[null,"Impacts (Optional)"]
[null,"Capability Target(s)"]
[null,"Critical Transportation"]
[null,"Desired Outcomes (Optional)"]
[null,"Impacts (Optional)"]
[null,"Capability Target(s)"]
[null,"Environmental Response/Health and Safety"]
[null,"Desired Outcomes (Optional)"]
[null,"Impacts (Optional)"]
[null,"Capability Target(s)"]
[null,"Fatality Management Services"]
[null,"Desired Outcomes (Optional)"]
[null,"Impacts (Optional)"]
[null,"Capability Target(s)"]
[null,"Infrastructure Systems"]
[null,"Desired Outcomes (Optional)"]
[null,"Impacts (Optional)"]
[null,"Capability Target(s)"]
[null,"Mass Care Services"]
[null,"Desired Outcomes (Optional)"]
[null,"Impacts (Optional)"]
[null,"Capability Target(s)"]
[null,"Mass Search and Rescue Operations"]
[null,"Desired Outcomes (Optional)"]
[null,"Impacts (Optional)"]
[null,"Capability Target(s)"]
[null,"On-scene Security and Protection"]
[null,"Desired Outcomes (Optional)"]
[null,"Impacts (Optional)"]
[null,"Capability Target(s)"]
[null,"Operational  Communications"]
[null,"Desired Outcomes (Optional)"]
[null,"Impacts (Optional)"]
[null,"Capability Target(s)"]
[null,"Public and Private Services and Resources"]
[null,"Desired Outcomes (Optional)"]
[null,"Impacts (Optional)"]
[null,"Capability Target(s)"]
[null,"Public Health and Medical Services"]
[null,"Desired Outcomes (Optional)"]
[null,"Impacts (Optional)"]
[null,"Capability Target(s)"]
[null,"Situational Assessment"]
[null,"Desired Outcomes (Optional)"]
[null,"Impacts (Optional)"]
[null,"Capability Target(s)"]
[null,"Economic Recovery"]
[null,"Desired Outcomes (Optional)"]
[null,"Impacts (Optional)"]
[null,"Capability Target(s)"]
[null,"Health and Social Services"]
[null,"Desired Outcomes (Optional)"]
[null,"Impacts (Optional)"]
[null,"Capability Target(s)"]
[null,"Housing"]
[null,"Desired Outcomes (Optional)"]
[null,"Impacts (Optional)"]
[null,"Capability Target(s)"]
[null,"Natural and Cultural Resources"]
[null,"Desired Outcomes (Optional)"]
[null,"Impacts (Optional)"]
[null,"Capability Target(s)"]

{"sheet":"Navigation and Progress","index":3,"n_rows":36,"n_cols":53,"rows_kept":36,"cut":false,"hidden":false,"merged":[[2,12,3,12],[2,14,2,16],[2,18,2,20],[4,10,34,10],[2,13,34,13],[2,21,34,21],[2,25,34,25],[2,29,34,29],[2,33,34,33],[2,30,2,32],[2,35,3,35],[4,35,34,35],[1,12,1,35],[1,1,1,4],[2,22,2,24],[1,6,1,10],[2,6,3,6],[2,7,3,7],[2,8,3,8],[2,10,3,10],[2,26,2,28],[2,9,3,9],[4,6,34,6],[4,7,34,7],[2,34,3,34],[2,17,34,17]]}
[null,null,null,null,null,null,null,null,null,null,null,null,null,null,null,null,null,null,null,null,null,null,null,null,null,null,null,null,null,null,null,null,null,null,null,null,null,null,null,null,null,null,null,null,null,null,null,null,null,null,null,null,0]
[null,"Overall Progress",null,null,null,null,"THIRA",null,null,null,null,null,"SPR Assessment"]
[null,"THIRA",{"$f":"AVERAGE(C5:C35)","v":0.40000000000000019},"SPR Assessment",{"$f":"AVERAGE(E5:E35)","v":3.5842293906810036E-3},null,"Step 1:  Threats and Hazards","Step 2:  Context Statements","Step 3:  Capability Targets","Step 4:  Resource Requirements","Post-Assessment Questions",null,"Priority",null,"Planning",null,null,null,"Organization",null,null,null,"Equipment",null,null,null,"Training",null,null,null,"Exercises",null,null,null,"Gap Responsibility","Post-Assessment Questions"]
[null,null,null,null,null,null,null,null,null,null,null,null,null,null,"Internal Rating","Mutual Aid Rating","Gap Description",null,"Internal Rating","Mutual Aid Rating","Gap Description",null,"Internal Rating","Mutual Aid Rating","Gap Description",null,"Internal Rating","Mutual Aid Rating","Gap Description",null,"Internal Rating","Mutual Aid Rating","Gap Description"]
[1,null,{"$f":"(COUNTIF($G$5:$H$35, \"Y\")+COUNTIF(I5:J5, \"Y\")+COUNTIF($K$5:$K$35,\"Y\"))/5","v":0.4},null,{"$f":"(COUNTIF(M5:AI5, \"Y\")+COUNTIF($AJ$5:$AJ$35,\"Y\"))/18","v":0},"Planning",{"$f":"IF('THIRA Steps 1-3'!$A$7>0,\"Y\",\"\")","v":""},{"$f":"IF('THIRA Steps 1-3'!$A$8>0,\"Y\",\"\")","v":"Y"},{"$f":"IF(INDIRECT(\"'THIRA Steps 1-3'!$C$13\")<>\"Click here to enter capability targets\",\"Y\",\"\")","v":"Y"},{"$f":"IF(OR('THIRA #1 Planning'!T$5>0,'THIRA #1 Planning'!T$8>0),\"Y\",\"\")","v":""},{"$f":"IF('THIRA Post-Assessment'!V1=TRUE,\"Y\",\"\")","v":""},null,{"$f":"IF(INDIRECT(\"'SPR \" & Lists!P1 & \"'!P9\")>0,\"Y\",\"\")","v":""},null,{"$f":"IF(INDIRECT(\"'SPR \" & Lists!P1 & \"'!P14\")>1,\"Y\",\"\")","v":""},{"$f":"IF(INDIRECT(\"'SPR \" & Lists!P1 & \"'!Q14\")>1,\"Y\",\"\")","v":""},{"$f":"IF(OR(INDIRECT(\"'SPR \" & Lists!P1 &\"'!P14\")>=6,INDIRECT(\"'SPR \" & Lists!P1 &\"'!R14\")>=1,INDIRECT(\"'SPR \" & Lists!P1 &\"'!s14\")=1),\"Y\",\"\")","v":""},null,{"$f":"IF(INDIRECT(\"'SPR \" & Lists!P1 & \"'!P18\")>1,\"Y\",\"\")","v":""},{"$f":"IF(INDIRECT(\"'SPR \" & Lists!P1 & \"'!Q18\")>1,\"Y\",\"\")","v":""},{"$f":"IF(OR(INDIRECT(\"'SPR \" & Lists!P1 &\"'!P18\")>=6,INDIRECT(\"'SPR \" & Lists!P1 &\"'!R18\")=1),\"Y\",\"\")","v":""},null,{"$f":"IF(INDIRECT(\"'SPR \" & Lists!P1 & \"'!P21\")>1,\"Y\",\"\")","v":""},{"$f":"IF(INDIRECT(\"'SPR \" & Lists!P1 & \"'!Q21\")>1,\"Y\",\"\")","v":""},{"$f":"IF(OR(INDIRECT(\"'SPR \" & Lists!P1 &\"'!P21\")>=6,INDIRECT(\"'SPR \" & Lists!P1 &\"'!R21\")=1),\"Y\",\"\")","v":""},null,{"$f":"IF(INDIRECT(\"'SPR \" & Lists!P1 & \"'!P24\")>1,\"Y\",\"\")","v":""},{"$f":"IF(INDIRECT(\"'SPR \" & Lists!P1 & \"'!Q24\")>1,\"Y\",\"\")","v":""},{"$f":"IF(OR(INDIRECT(\"'SPR \" & Lists!P1 &\"'!P24\")>=6,INDIRECT(\"'SPR \" & Lists!P1 &\"'!R24\")>=1,INDIRECT(\"'SPR \" & Lists!P1 &\"'!S24\")=1),\"Y\",\"\")","v":""},null,{"$f":"IF(INDIRECT(\"'SPR \" & Lists!P1 & \"'!P28\")>1,\"Y\",\"\")","v":""},{"$f":"IF(INDIRECT(\"'SPR \" & Lists!P1 & \"'!Q28\")>1,\"Y\",\"\")","v":""},{"$f":"IF(OR(INDIRECT(\"'SPR \" & Lists!P1 &\"'!P28\")>=6,INDIRECT(\"'SPR \" & Lists!P1 &\"'!R28\")>=1,INDIRECT(\"'SPR \" & Lists!P1 &\"'!S28\")=1),\"Y\",\"\")","v":""},null,{"$f":"IF(INDIRECT(\"'SPR \" & Lists!P1 & \"'!P34\")>0,\"Y\",\"\")","v":""},{"$f":"IF(AND('SPR Post-Assessment'!W14>0,'SPR Post-Assessment'!W37>0,'SPR Post-Assessment'!W59>0,'SPR Post-Assessment'!W103=3,'SPR Post-Assessment'!W138=3,'SPR Post-Assessment'!W175=1,'SPR Post-Assessment'!W186=1),\"Y\",\"\")","v":""}]
[2,null,{"$f":"(COUNTIF($G$5:$H$35, \"Y\")+COUNTIF(I6:J6, \"Y\")+COUNTIF($K$5:$K$35,\"Y\"))/5","v":0.4},null,{"$f":"(COUNTIF(M6:AI6, \"Y\")+COUNTIF($AJ$5:$AJ$35,\"Y\"))/18","v":0},"Public Information and Warning",null,null,{"$f":"IF(INDIRECT(\"'THIRA Steps 1-3'!$C$17\")<>\"Click here to enter capability targets\",\"Y\",\"\")","v":"Y"},{"$f":"IF(OR('THIRA #2 Public Info Warn'!T$5>0,'THIRA #2 Public Info Warn'!T$8>0),\"Y\",\"\")","v":""},null,null,{"$f":"IF(INDIRECT(\"'SPR \" & Lists!P2 & \"'!P9\")>0,\"Y\",\"\")","v":""},null,{"$f":"IF(INDIRECT(\"'SPR \" & Lists!P2 & \"'!P14\")>1,\"Y\",\"\")","v":""},{"$f":"IF(INDIRECT(\"'SPR \" & Lists!P2 & \"'!Q14\")>1,\"Y\",\"\")","v":""},{"$f":"IF(OR(INDIRECT(\"'SPR \" & Lists!P2 &\"'!P14\")>=6,INDIRECT(\"'SPR \" & Lists!P2 &\"'!R14\")>=1,INDIRECT(\"'SPR \" & Lists!P2 &\"'!s14\")=1),\"Y\",\"\")","v":""},null,{"$f":"IF(INDIRECT(\"'SPR \" & Lists!P2 & \"'!P18\")>1,\"Y\",\"\")","v":""},{"$f":"IF(INDIRECT(\"'SPR \" & Lists!P2 & \"'!Q18\")>1,\"Y\",\"\")","v":""},{"$f":"IF(OR(INDIRECT(\"'SPR \" & Lists!P2 &\"'!P18\")>=6,INDIRECT(\"'SPR \" & Lists!P2 &\"'!R18\")=1),\"Y\",\"\")","v":""},null,{"$f":"IF(INDIRECT(\"'SPR \" & Lists!P2 & \"'!P21\")>1,\"Y\",\"\")","v":""},{"$f":"IF(INDIRECT(\"'SPR \" & Lists!P2 & \"'!Q21\")>1,\"Y\",\"\")","v":""},{"$f":"IF(OR(INDIRECT(\"'SPR \" & Lists!P2 &\"'!P21\")>=6,INDIRECT(\"'SPR \" & Lists!P2 &\"'!R21\")=1),\"Y\",\"\")","v":""},null,{"$f":"IF(INDIRECT(\"'SPR \" & Lists!P2 & \"'!P24\")>1,\"Y\",\"\")","v":""},{"$f":"IF(INDIRECT(\"'SPR \" & Lists!P2 & \"'!Q24\")>1,\"Y\",\"\")","v":""},{"$f":"IF(OR(INDIRECT(\"'SPR \" & Lists!P2 &\"'!P24\")>=6,INDIRECT(\"'SPR \" & Lists!P2 &\"'!R24\")>=1,INDIRECT(\"'SPR \" & Lists!P2 &\"'!S24\")=1),\"Y\",\"\")","v":""},null,{"$f":"IF(INDIRECT(\"'SPR \" & Lists!P2 & \"'!P28\")>1,\"Y\",\"\")","v":""},{"$f":"IF(INDIRECT(\"'SPR \" & Lists!P2 & \"'!Q28\")>1,\"Y\",\"\")","v":""},{"$f":"IF(OR(INDIRECT(\"'SPR \" & Lists!P2 &\"'!P28\")>=6,INDIRECT(\"'SPR \" & Lists!P2 &\"'!R28\")>=1,INDIRECT(\"'SPR \" & Lists!P2 &\"'!S28\")=1),\"Y\",\"\")","v":""},null,{"$f":"IF(INDIRECT(\"'SPR \" & Lists!P2 & \"'!P34\")>0,\"Y\",\"\")","v":""}]
[3,null,0.4,null,0,"Operational Coordination",null,null,{"$f":"IF(INDIRECT(\"'THIRA Steps 1-3'!$C$21\")<>\"Click here to enter capability targets\",\"Y\",\"\")","v":"Y"},{"$f":"IF(OR('THIRA #3 Op Coord'!T$5>0,'THIRA #3 Op Coord'!T$8>0),\"Y\",\"\")","v":""},null,null,{"$f":"IF(INDIRECT(\"'SPR \" & Lists!P3 & \"'!P9\")>0,\"Y\",\"\")","v":""},null,{"$f":"IF(INDIRECT(\"'SPR \" & Lists!P3 & \"'!P14\")>1,\"Y\",\"\")","v":""},{"$f":"IF(INDIRECT(\"'SPR \" & Lists!P3 & \"'!Q14\")>1,\"Y\",\"\")","v":""},{"$f":"IF(OR(INDIRECT(\"'SPR \" & Lists!P3 &\"'!P14\")>=6,INDIRECT(\"'SPR \" & Lists!P3 &\"'!R14\")>=1,INDIRECT(\"'SPR \" & Lists!P3 &\"'!s14\")=1),\"Y\",\"\")","v":""},null,{"$f":"IF(INDIRECT(\"'SPR \" & Lists!P3 & \"'!P18\")>1,\"Y\",\"\")","v":""},{"$f":"IF(INDIRECT(\"'SPR \" & Lists!P3 & \"'!Q18\")>1,\"Y\",\"\")","v":""},{"$f":"IF(OR(INDIRECT(\"'SPR \" & Lists!P3 &\"'!P18\")>=6,INDIRECT(\"'SPR \" & Lists!P3 &\"'!R18\")=1),\"Y\",\"\")","v":""},null,{"$f":"IF(INDIRECT(\"'SPR \" & Lists!P3 & \"'!P21\")>1,\"Y\",\"\")","v":""},{"$f":"IF(INDIRECT(\"'SPR \" & Lists!P3 & \"'!Q21\")>1,\"Y\",\"\")","v":""},{"$f":"IF(OR(INDIRECT(\"'SPR \" & Lists!P3 &\"'!P21\")>=6,INDIRECT(\"'SPR \" & Lists!P3 &\"'!R21\")=1),\"Y\",\"\")","v":""},null,{"$f":"IF(INDIRECT(\"'SPR \" & Lists!P3 & \"'!P24\")>1,\"Y\",\"\")","v":""},{"$f":"IF(INDIRECT(\"'SPR \" & Lists!P3 & \"'!Q24\")>1,\"Y\",\"\")","v":""},{"$f":"IF(OR(INDIRECT(\"'SPR \" & Lists!P3 &\"'!P24\")>=6,INDIRECT(\"'SPR \" & Lists!P3 &\"'!R24\")>=1,INDIRECT(\"'SPR \" & Lists!P3 &\"'!S24\")=1),\"Y\",\"\")","v":""},null,{"$f":"IF(INDIRECT(\"'SPR \" & Lists!P3 & \"'!P28\")>1,\"Y\",\"\")","v":""},{"$f":"IF(INDIRECT(\"'SPR \" & Lists!P3 & \"'!Q28\")>1,\"Y\",\"\")","v":""},{"$f":"IF(OR(INDIRECT(\"'SPR \" & Lists!P3 &\"'!P28\")>=6,INDIRECT(\"'SPR \" & Lists!P3 &\"'!R28\")>=1,INDIRECT(\"'SPR \" & Lists!P3 &\"'!S28\")=1),\"Y\",\"\")","v":""},null,{"$f":"IF(INDIRECT(\"'SPR \" & Lists!P3 & \"'!P34\")>0,\"Y\",\"\")","v":""}]
[4,null,0.4,null,0,"Forensics and Attribution",null,null,{"$f":"IF(INDIRECT(\"'THIRA Steps 1-3'!$C$25\")<>\"Click here to enter capability targets\",\"Y\",\"\")","v":"Y"},{"$f":"IF(OR('THIRA #4 Forensics Attribution'!T$5>0,'THIRA #4 Forensics Attribution'!T$8>0),\"Y\",\"\")","v":""},null,null,{"$f":"IF(INDIRECT(\"'SPR \" & Lists!P4 & \"'!P9\")>0,\"Y\",\"\")","v":""},null,{"$f":"IF(INDIRECT(\"'SPR \" & Lists!P4 & \"'!P14\")>1,\"Y\",\"\")","v":""},{"$f":"IF(INDIRECT(\"'SPR \" & Lists!P4 & \"'!Q14\")>1,\"Y\",\"\")","v":""},{"$f":"IF(OR(INDIRECT(\"'SPR \" & Lists!P4 &\"'!P14\")>=6,INDIRECT(\"'SPR \" & Lists!P4 &\"'!R14\")>=1,INDIRECT(\"'SPR \" & Lists!P4 &\"'!s14\")=1),\"Y\",\"\")","v":""},null,{"$f":"IF(INDIRECT(\"'SPR \" & Lists!P4 & \"'!P18\")>1,\"Y\",\"\")","v":""},{"$f":"IF(INDIRECT(\"'SPR \" & Lists!P4 & \"'!Q18\")>1,\"Y\",\"\")","v":""},{"$f":"IF(OR(INDIRECT(\"'SPR \" & Lists!P4 &\"'!P18\")>=6,INDIRECT(\"'SPR \" & Lists!P4 &\"'!R18\")=1),\"Y\",\"\")","v":""},null,{"$f":"IF(INDIRECT(\"'SPR \" & Lists!P4 & \"'!P21\")>1,\"Y\",\"\")","v":""},{"$f":"IF(INDIRECT(\"'SPR \" & Lists!P4 & \"'!Q21\")>1,\"Y\",\"\")","v":""},{"$f":"IF(OR(INDIRECT(\"'SPR \" & Lists!P4 &\"'!P21\")>=6,INDIRECT(\"'SPR \" & Lists!P4 &\"'!R21\")=1),\"Y\",\"\")","v":""},null,{"$f":"IF(INDIRECT(\"'SPR \" & Lists!P4 & \"'!P24\")>1,\"Y\",\"\")","v":""},{"$f":"IF(INDIRECT(\"'SPR \" & Lists!P4 & \"'!Q24\")>1,\"Y\",\"\")","v":""},{"$f":"IF(OR(INDIRECT(\"'SPR \" & Lists!P4 &\"'!P24\")>=6,INDIRECT(\"'SPR \" & Lists!P4 &\"'!R24\")>=1,INDIRECT(\"'SPR \" & Lists!P4 &\"'!S24\")=1),\"Y\",\"\")","v":""},null,{"$f":"IF(INDIRECT(\"'SPR \" & Lists!P4 & \"'!P28\")>1,\"Y\",\"\")","v":""},{"$f":"IF(INDIRECT(\"'SPR \" & Lists!P4 & \"'!Q28\")>1,\"Y\",\"\")","v":""},{"$f":"IF(OR(INDIRECT(\"'SPR \" & Lists!P4 &\"'!P28\")>=6,INDIRECT(\"'SPR \" & Lists!P4 &\"'!R28\")>=1,INDIRECT(\"'SPR \" & Lists!P4 &\"'!S28\")=1),\"Y\",\"\")","v":""},null,{"$f":"IF(INDIRECT(\"'SPR \" & Lists!P4 & \"'!P34\")>0,\"Y\",\"\")","v":""}]
[5,null,0.4,null,5.5555555555555552E-2,"Intelligence and Information Sharing",null,null,{"$f":"IF(INDIRECT(\"'THIRA Steps 1-3'!$C$29\")<>\"Click here to enter capability targets\",\"Y\",\"\")","v":"Y"},{"$f":"IF(OR('THIRA #5 Intel Info Sharing'!T$5>0,'THIRA #5 Intel Info Sharing'!T$8>0),\"Y\",\"\")","v":""},null,null,{"$f":"IF(INDIRECT(\"'SPR \" & Lists!P5 & \"'!P9\")>0,\"Y\",\"\")","v":""},null,{"$f":"IF(INDIRECT(\"'SPR \" & Lists!P5 & \"'!P14\")>1,\"Y\",\"\")","v":""},{"$f":"IF(INDIRECT(\"'SPR \" & Lists!P5 & \"'!Q14\")>1,\"Y\",\"\")","v":""},{"$f":"IF(OR(INDIRECT(\"'SPR \" & Lists!P5 &\"'!P14\")>=6,INDIRECT(\"'SPR \" & Lists!P5 &\"'!R14\")>=1,INDIRECT(\"'SPR \" & Lists!P5 &\"'!s14\")=1),\"Y\",\"\")","v":""},null,{"$f":"IF(INDIRECT(\"'SPR \" & Lists!P5 & \"'!P18\")>1,\"Y\",\"\")","v":""},{"$f":"IF(INDIRECT(\"'SPR \" & Lists!P5 & \"'!Q18\")>1,\"Y\",\"\")","v":""},{"$f":"IF(OR(INDIRECT(\"'SPR \" & Lists!P5 &\"'!P18\")>=6,INDIRECT(\"'SPR \" & Lists!P5 &\"'!R18\")=1),\"Y\",\"\")","v":""},null,{"$f":"IF(INDIRECT(\"'SPR \" & Lists!P5 & \"'!P21\")>1,\"Y\",\"\")","v":""},{"$f":"IF(INDIRECT(\"'SPR \" & Lists!P5 & \"'!Q21\")>1,\"Y\",\"\")","v":""},{"$f":"IF(OR(INDIRECT(\"'SPR \" & Lists!P5 &\"'!P21\")>=6,INDIRECT(\"'SPR \" & Lists!P5 &\"'!R21\")=1),\"Y\",\"\")","v":""},null,{"$f":"IF(INDIRECT(\"'SPR \" & Lists!P5 & \"'!P24\")>1,\"Y\",\"\")","v":""},{"$f":"IF(INDIRECT(\"'SPR \" & Lists!P5 & \"'!Q24\")>1,\"Y\",\"\")","v":""},{"$f":"IF(OR(INDIRECT(\"'SPR \" & Lists!P5 &\"'!P24\")>=6,INDIRECT(\"'SPR \" & Lists!P5 &\"'!R24\")>=1,INDIRECT(\"'SPR \" & Lists!P5 &\"'!S24\")=1),\"Y\",\"\")","v":"Y"},null,{"$f":"IF(INDIRECT(\"'SPR \" & Lists!P5 & \"'!P28\")>1,\"Y\",\"\")","v":""},{"$f":"IF(INDIRECT(\"'SPR \" & Lists!P5 & \"'!Q28\")>1,\"Y\",\"\")","v":""},{"$f":"IF(OR(INDIRECT(\"'SPR \" & Lists!P5 &\"'!P28\")>=6,INDIRECT(\"'SPR \" & Lists!P5 &\"'!R28\")>=1,INDIRECT(\"'SPR \" & Lists!P5 &\"'!S28\")=1),\"Y\",\"\")","v":""},null,{"$f":"IF(INDIRECT(\"'SPR \" & Lists!P5 & \"'!P34\")>0,\"Y\",\"\")","v":""}]
[6,null,0.4,null,0,"Interdiction and Disruption",null,null,{"$f":"IF(INDIRECT(\"'THIRA Steps 1-3'!$C$33\")<>\"Click here to enter capability targets\",\"Y\",\"\")","v":"Y"},{"$f":"IF(OR('THIRA #6 Interdict Disrupt'!T$5>0,'THIRA #6 Interdict Disrupt'!T$8>0),\"Y\",\"\")","v":""},null,null,{"$f":"IF(INDIRECT(\"'SPR \" & Lists!P6 & \"'!P9\")>0,\"Y\",\"\")","v":""},null,{"$f":"IF(INDIRECT(\"'SPR \" & Lists!P6 & \"'!P14\")>1,\"Y\",\"\")","v":""},{"$f":"IF(INDIRECT(\"'SPR \" & Lists!P6 & \"'!Q14\")>1,\"Y\",\"\")","v":""},{"$f":"IF(OR(INDIRECT(\"'SPR \" & Lists!P6 &\"'!P14\")>=6,INDIRECT(\"'SPR \" & Lists!P6 &\"'!R14\")>=1,INDIRECT(\"'SPR \" & Lists!P6 &\"'!s14\")=1),\"Y\",\"\")","v":""},null,{"$f":"IF(INDIRECT(\"'SPR \" & Lists!P6 & \"'!P18\")>1,\"Y\",\"\")","v":""},{"$f":"IF(INDIRECT(\"'SPR \" & Lists!P6 & \"'!Q18\")>1,\"Y\",\"\")","v":""},{"$f":"IF(OR(INDIRECT(\"'SPR \" & Lists!P6 &\"'!P18\")>=6,INDIRECT(\"'SPR \" & Lists!P6 &\"'!R18\")=1),\"Y\",\"\")","v":""},null,{"$f":"IF(INDIRECT(\"'SPR \" & Lists!P6 & \"'!P21\")>1,\"Y\",\"\")","v":""},{"$f":"IF(INDIRECT(\"'SPR \" & Lists!P6 & \"'!Q21\")>1,\"Y\",\"\")","v":""},{"$f":"IF(OR(INDIRECT(\"'SPR \" & Lists!P6 &\"'!P21\")>=6,INDIRECT(\"'SPR \" & Lists!P6 &\"'!R21\")=1),\"Y\",\"\")","v":""},null,{"$f":"IF(INDIRECT(\"'SPR \" & Lists!P6 & \"'!P24\")>1,\"Y\",\"\")","v":""},{"$f":"IF(INDIRECT(\"'SPR \" & Lists!P6 & \"'!Q24\")>1,\"Y\",\"\")","v":""},{"$f":"IF(OR(INDIRECT(\"'SPR \" & Lists!P6 &\"'!P24\")>=6,INDIRECT(\"'SPR \" & Lists!P6 &\"'!R24\")>=1,INDIRECT(\"'SPR \" & Lists!P6 &\"'!S24\")=1),\"Y\",\"\")","v":""},null,{"$f":"IF(INDIRECT(\"'SPR \" & Lists!P6 & \"'!P28\")>1,\"Y\",\"\")","v":""},{"$f":"IF(INDIRECT(\"'SPR \" & Lists!P6 & \"'!Q28\")>1,\"Y\",\"\")","v":""},{"$f":"IF(OR(INDIRECT(\"'SPR \" & Lists!P6 &\"'!P28\")>=6,INDIRECT(\"'SPR \" & Lists!P6 &\"'!R28\")>=1,INDIRECT(\"'SPR \" & Lists!P6 &\"'!S28\")=1),\"Y\",\"\")","v":""},null,{"$f":"IF(INDIRECT(\"'SPR \" & Lists!P6 & \"'!P34\")>0,\"Y\",\"\")","v":""}]
[7,null,0.4,null,0,"Screening, Search, and Detection",null,null,{"$f":"IF(INDIRECT(\"'THIRA Steps 1-3'!$C$37\")<>\"Click here to enter capability targets\",\"Y\",\"\")","v":"Y"},{"$f":"IF(OR('THIRA #7 Screen Search Detect'!T$5>0,'THIRA #7 Screen Search Detect'!T$8>0),\"Y\",\"\")","v":""},null,null,{"$f":"IF(INDIRECT(\"'SPR \" & Lists!P7 & \"'!P9\")>0,\"Y\",\"\")","v":""},null,{"$f":"IF(INDIRECT(\"'SPR \" & Lists!P7 & \"'!P14\")>1,\"Y\",\"\")","v":""},{"$f":"IF(INDIRECT(\"'SPR \" & Lists!P7 & \"'!Q14\")>1,\"Y\",\"\")","v":""},{"$f":"IF(OR(INDIRECT(\"'SPR \" & Lists!P7 &\"'!P14\")>=6,INDIRECT(\"'SPR \" & Lists!P7 &\"'!R14\")>=1,INDIRECT(\"'SPR \" & Lists!P7 &\"'!s14\")=1),\"Y\",\"\")","v":""},null,{"$f":"IF(INDIRECT(\"'SPR \" & Lists!P7 & \"'!P18\")>1,\"Y\",\"\")","v":""},{"$f":"IF(INDIRECT(\"'SPR \" & Lists!P7 & \"'!Q18\")>1,\"Y\",\"\")","v":""},{"$f":"IF(OR(INDIRECT(\"'SPR \" & Lists!P7 &\"'!P18\")>=6,INDIRECT(\"'SPR \" & Lists!P7 &\"'!R18\")=1),\"Y\",\"\")","v":""},null,{"$f":"IF(INDIRECT(\"'SPR \" & Lists!P7 & \"'!P21\")>1,\"Y\",\"\")","v":""},{"$f":"IF(INDIRECT(\"'SPR \" & Lists!P7 & \"'!Q21\")>1,\"Y\",\"\")","v":""},{"$f":"IF(OR(INDIRECT(\"'SPR \" & Lists!P7 &\"'!P21\")>=6,INDIRECT(\"'SPR \" & Lists!P7 &\"'!R21\")=1),\"Y\",\"\")","v":""},null,{"$f":"IF(INDIRECT(\"'SPR \" & Lists!P7 & \"'!P24\")>1,\"Y\",\"\")","v":""},{"$f":"IF(INDIRECT(\"'SPR \" & Lists!P7 & \"'!Q24\")>1,\"Y\",\"\")","v":""},{"$f":"IF(OR(INDIRECT(\"'SPR \" & Lists!P7 &\"'!P24\")>=6,INDIRECT(\"'SPR \" & Lists!P7 &\"'!R24\")>=1,INDIRECT(\"'SPR \" & Lists!P7 &\"'!S24\")=1),\"Y\",\"\")","v":""},null,{"$f":"IF(INDIRECT(\"'SPR \" & Lists!P7 & \"'!P28\")>1,\"Y\",\"\")","v":""},{"$f":"IF(INDIRECT(\"'SPR \" & Lists!P7 & \"'!Q28\")>1,\"Y\",\"\")","v":""},{"$f":"IF(OR(INDIRECT(\"'SPR \" & Lists!P7 &\"'!P28\")>=6,INDIRECT(\"'SPR \" & Lists!P7 &\"'!R28\")>=1,INDIRECT(\"'SPR \" & Lists!P7 &\"'!S28\")=1),\"Y\",\"\")","v":""},null,{"$f":"IF(INDIRECT(\"'SPR \" & Lists!P7 & \"'!P34\")>0,\"Y\",\"\")","v":""}]
[8,null,0.4,null,5.5555555555555552E-2,"Access Control and Identity Verification",null,null,{"$f":"IF(INDIRECT(\"'THIRA Steps 1-3'!$C$41\")<>\"Click here to enter capability targets\",\"Y\",\"\")","v":"Y"},{"$f":"IF(OR('THIRA #8 Access Control'!T$5>0,'THIRA #8 Access Control'!T$8>0),\"Y\",\"\")","v":""},null,null,{"$f":"IF(INDIRECT(\"'SPR \" & Lists!P8 & \"'!P9\")>0,\"Y\",\"\")","v":""},null,{"$f":"IF(INDIRECT(\"'SPR \" & Lists!P8 & \"'!P14\")>1,\"Y\",\"\")","v":""},{"$f":"IF(INDIRECT(\"'SPR \" & Lists!P8 & \"'!Q14\")>1,\"Y\",\"\")","v":""},{"$f":"IF(OR(INDIRECT(\"'SPR \" & Lists!P8 &\"'!P14\")>=6,INDIRECT(\"'SPR \" & Lists!P8 &\"'!R14\")>=1,INDIRECT(\"'SPR \" & Lists!P8 &\"'!s14\")=1),\"Y\",\"\")","v":""},null,{"$f":"IF(INDIRECT(\"'SPR \" & Lists!P8 & \"'!P18\")>1,\"Y\",\"\")","v":""},{"$f":"IF(INDIRECT(\"'SPR \" & Lists!P8 & \"'!Q18\")>1,\"Y\",\"\")","v":""},{"$f":"IF(OR(INDIRECT(\"'SPR \" & Lists!P8 &\"'!P18\")>=6,INDIRECT(\"'SPR \" & Lists!P8 &\"'!R18\")=1),\"Y\",\"\")","v":""},null,{"$f":"IF(INDIRECT(\"'SPR \" & Lists!P8 & \"'!P21\")>1,\"Y\",\"\")","v":""},{"$f":"IF(INDIRECT(\"'SPR \" & Lists!P8 & \"'!Q21\")>1,\"Y\",\"\")","v":""},{"$f":"IF(OR(INDIRECT(\"'SPR \" & Lists!P8 &\"'!P21\")>=6,INDIRECT(\"'SPR \" & Lists!P8 &\"'!R21\")=1),\"Y\",\"\")","v":"Y"},null,{"$f":"IF(INDIRECT(\"'SPR \" & Lists!P8 & \"'!P24\")>1,\"Y\",\"\")","v":""},{"$f":"IF(INDIRECT(\"'SPR \" & Lists!P8 & \"'!Q24\")>1,\"Y\",\"\")","v":""},{"$f":"IF(OR(INDIRECT(\"'SPR \" & Lists!P8 &\"'!P24\")>=6,INDIRECT(\"'SPR \" & Lists!P8 &\"'!R24\")>=1,INDIRECT(\"'SPR \" & Lists!P8 &\"'!S24\")=1),\"Y\",\"\")","v":""},null,{"$f":"IF(INDIRECT(\"'SPR \" & Lists!P8 & \"'!P28\")>1,\"Y\",\"\")","v":""},{"$f":"IF(INDIRECT(\"'SPR \" & Lists!P8 & \"'!Q28\")>1,\"Y\",\"\")","v":""},{"$f":"IF(OR(INDIRECT(\"'SPR \" & Lists!P8 &\"'!P28\")>=6,INDIRECT(\"'SPR \" & Lists!P8 &\"'!R28\")>=1,INDIRECT(\"'SPR \" & Lists!P8 &\"'!S28\")=1),\"Y\",\"\")","v":""},null,{"$f":"IF(INDIRECT(\"'SPR \" & Lists!P8 & \"'!P34\")>0,\"Y\",\"\")","v":""}]
[9,null,0.4,null,0,"Cybersecurity",null,null,{"$f":"IF(INDIRECT(\"'THIRA Steps 1-3'!$C$45\")<>\"Click here to enter capability targets\",\"Y\",\"\")","v":"Y"},{"$f":"IF(OR('THIRA #9 Cybersecurity'!T$5>0,'THIRA #9 Cybersecurity'!T$8>0),\"Y\",\"\")","v":""},null,null,{"$f":"IF(INDIRECT(\"'SPR \" & Lists!P9 & \"'!P9\")>0,\"Y\",\"\")","v":""},null,{"$f":"IF(INDIRECT(\"'SPR \" & Lists!P9 & \"'!P14\")>1,\"Y\",\"\")","v":""},{"$f":"IF(INDIRECT(\"'SPR \" & Lists!P9 & \"'!Q14\")>1,\"Y\",\"\")","v":""},{"$f":"IF(OR(INDIRECT(\"'SPR \" & Lists!P9 &\"'!P14\")>=6,INDIRECT(\"'SPR \" & Lists!P9 &\"'!R14\")>=1,INDIRECT(\"'SPR \" & Lists!P9 &\"'!s14\")=1),\"Y\",\"\")","v":""},null,{"$f":"IF(INDIRECT(\"'SPR \" & Lists!P9 & \"'!P18\")>1,\"Y\",\"\")","v":""},{"$f":"IF(INDIRECT(\"'SPR \" & Lists!P9 & \"'!Q18\")>1,\"Y\",\"\")","v":""},{"$f":"IF(OR(INDIRECT(\"'SPR \" & Lists!P9 &\"'!P18\")>=6,INDIRECT(\"'SPR \" & Lists!P9 &\"'!R18\")=1),\"Y\",\"\")","v":""},null,{"$f":"IF(INDIRECT(\"'SPR \" & Lists!P9 & \"'!P21\")>1,\"Y\",\"\")","v":""},{"$f":"IF(INDIRECT(\"'SPR \" & Lists!P9 & \"'!Q21\")>1,\"Y\",\"\")","v":""},{"$f":"IF(OR(INDIRECT(\"'SPR \" & Lists!P9 &\"'!P21\")>=6,INDIRECT(\"'SPR \" & Lists!P9 &\"'!R21\")=1),\"Y\",\"\")","v":""},null,{"$f":"IF(INDIRECT(\"'SPR \" & Lists!P9 & \"'!P24\")>1,\"Y\",\"\")","v":""},{"$f":"IF(INDIRECT(\"'SPR \" & Lists!P9 & \"'!Q24\")>1,\"Y\",\"\")","v":""},{"$f":"IF(OR(INDIRECT(\"'SPR \" & Lists!P9 &\"'!P24\")>=6,INDIRECT(\"'SPR \" & Lists!P9 &\"'!R24\")>=1,INDIRECT(\"'SPR \" & Lists!P9 &\"'!S24\")=1),\"Y\",\"\")","v":""},null,{"$f":"IF(INDIRECT(\"'SPR \" & Lists!P9 & \"'!P28\")>1,\"Y\",\"\")","v":""},{"$f":"IF(INDIRECT(\"'SPR \" & Lists!P9 & \"'!Q28\")>1,\"Y\",\"\")","v":""},{"$f":"IF(OR(INDIRECT(\"'SPR \" & Lists!P9 &\"'!P28\")>=6,INDIRECT(\"'SPR \" & Lists!P9 &\"'!R28\")>=1,INDIRECT(\"'SPR \" & Lists!P9 &\"'!S28\")=1),\"Y\",\"\")","v":""},null,{"$f":"IF(INDIRECT(\"'SPR \" & Lists!P9 & \"'!P34\")>0,\"Y\",\"\")","v":""}]
[10,null,0.4,null,0,"Physical Protective Measures",null,null,{"$f":"IF(INDIRECT(\"'THIRA Steps 1-3'!$C$49\")<>\"Click here to enter capability targets\",\"Y\",\"\")","v":"Y"},{"$f":"IF(OR('THIRA #10 Phys Protect Meas'!T$5>0,'THIRA #10 Phys Protect Meas'!T$8>0),\"Y\",\"\")","v":""},null,null,{"$f":"IF(INDIRECT(\"'SPR \" & Lists!P10 & \"'!P9\")>0,\"Y\",\"\")","v":""},null,{"$f":"IF(INDIRECT(\"'SPR \" & Lists!P10 & \"'!P14\")>1,\"Y\",\"\")","v":""},{"$f":"IF(INDIRECT(\"'SPR \" & Lists!P10 & \"'!Q14\")>1,\"Y\",\"\")","v":""},{"$f":"IF(OR(INDIRECT(\"'SPR \" & Lists!P10 &\"'!P14\")>=6,INDIRECT(\"'SPR \" & Lists!P10 &\"'!R14\")>=1,INDIRECT(\"'SPR \" & Lists!P10 &\"'!s14\")=1),\"Y\",\"\")","v":""},null,{"$f":"IF(INDIRECT(\"'SPR \" & Lists!P10 & \"'!P18\")>1,\"Y\",\"\")","v":""},{"$f":"IF(INDIRECT(\"'SPR \" & Lists!P10 & \"'!Q18\")>1,\"Y\",\"\")","v":""},{"$f":"IF(OR(INDIRECT(\"'SPR \" & Lists!P10 &\"'!P18\")>=6,INDIRECT(\"'SPR \" & Lists!P10 &\"'!R18\")=1),\"Y\",\"\")","v":""},null,{"$f":"IF(INDIRECT(\"'SPR \" & Lists!P10 & \"'!P21\")>1,\"Y\",\"\")","v":""},{"$f":"IF(INDIRECT(\"'SPR \" & Lists!P10 & \"'!Q21\")>1,\"Y\",\"\")","v":""},{"$f":"IF(OR(INDIRECT(\"'SPR \" & Lists!P10 &\"'!P21\")>=6,INDIRECT(\"'SPR \" & Lists!P10 &\"'!R21\")=1),\"Y\",\"\")","v":""},null,{"$f":"IF(INDIRECT(\"'SPR \" & Lists!P10 & \"'!P24\")>1,\"Y\",\"\")","v":""},{"$f":"IF(INDIRECT(\"'SPR \" & Lists!P10 & \"'!Q24\")>1,\"Y\",\"\")","v":""},{"$f":"IF(OR(INDIRECT(\"'SPR \" & Lists!P10 &\"'!P24\")>=6,INDIRECT(\"'SPR \" & Lists!P10 &\"'!R24\")>=1,INDIRECT(\"'SPR \" & Lists!P10 &\"'!S24\")=1),\"Y\",\"\")","v":""},null,{"$f":"IF(INDIRECT(\"'SPR \" & Lists!P10 & \"'!P28\")>1,\"Y\",\"\")","v":""},{"$f":"IF(INDIRECT(\"'SPR \" & Lists!P10 & \"'!Q28\")>1,\"Y\",\"\")","v":""},{"$f":"IF(OR(INDIRECT(\"'SPR \" & Lists!P10 &\"'!P28\")>=6,INDIRECT(\"'SPR \" & Lists!P10 &\"'!R28\")>=1,INDIRECT(\"'SPR \" & Lists!P10 &\"'!S28\")=1),\"Y\",\"\")","v":""},null,{"$f":"IF(INDIRECT(\"'SPR \" & Lists!P10 & \"'!P34\")>0,\"Y\",\"\")","v":""}]
[11,null,0.4,null,0,"Risk Management for Protection Programs and Activities",null,null,{"$f":"IF(INDIRECT(\"'THIRA Steps 1-3'!$C$53\")<>\"Click here to enter capability targets\",\"Y\",\"\")","v":"Y"},{"$f":"IF(OR('THIRA #11 Risk Mgmt Protect'!T$5>0,'THIRA #11 Risk Mgmt Protect'!T$8>0),\"Y\",\"\")","v":""},null,null,{"$f":"IF(INDIRECT(\"'SPR \" & Lists!P11 & \"'!P9\")>0,\"Y\",\"\")","v":""},null,{"$f":"IF(INDIRECT(\"'SPR \" & Lists!P11 & \"'!P14\")>1,\"Y\",\"\")","v":""},{"$f":"IF(INDIRECT(\"'SPR \" & Lists!P11 & \"'!Q14\")>1,\"Y\",\"\")","v":""},{"$f":"IF(OR(INDIRECT(\"'SPR \" & Lists!P11 &\"'!P14\")>=6,INDIRECT(\"'SPR \" & Lists!P11 &\"'!R14\")>=1,INDIRECT(\"'SPR \" & Lists!P11 &\"'!s14\")=1),\"Y\",\"\")","v":""},null,{"$f":"IF(INDIRECT(\"'SPR \" & Lists!P11 & \"'!P18\")>1,\"Y\",\"\")","v":""},{"$f":"IF(INDIRECT(\"'SPR \" & Lists!P11 & \"'!Q18\")>1,\"Y\",\"\")","v":""},{"$f":"IF(OR(INDIRECT(\"'SPR \" & Lists!P11 &\"'!P18\")>=6,INDIRECT(\"'SPR \" & Lists!P11 &\"'!R18\")=1),\"Y\",\"\")","v":""},null,{"$f":"IF(INDIRECT(\"'SPR \" & Lists!P11 & \"'!P21\")>1,\"Y\",\"\")","v":""},{"$f":"IF(INDIRECT(\"'SPR \" & Lists!P11 & \"'!Q21\")>1,\"Y\",\"\")","v":""},{"$f":"IF(OR(INDIRECT(\"'SPR \" & Lists!P11 &\"'!P21\")>=6,INDIRECT(\"'SPR \" & Lists!P11 &\"'!R21\")=1),\"Y\",\"\")","v":""},null,{"$f":"IF(INDIRECT(\"'SPR \" & Lists!P11 & \"'!P24\")>1,\"Y\",\"\")","v":""},{"$f":"IF(INDIRECT(\"'SPR \" & Lists!P11 & \"'!Q24\")>1,\"Y\",\"\")","v":""},{"$f":"IF(OR(INDIRECT(\"'SPR \" & Lists!P11 &\"'!P24\")>=6,INDIRECT(\"'SPR \" & Lists!P11 &\"'!R24\")>=1,INDIRECT(\"'SPR \" & Lists!P11 &\"'!S24\")=1),\"Y\",\"\")","v":""},null,{"$f":"IF(INDIRECT(\"'SPR \" & Lists!P11 & \"'!P28\")>1,\"Y\",\"\")","v":""},{"$f":"IF(INDIRECT(\"'SPR \" & Lists!P11 & \"'!Q28\")>1,\"Y\",\"\")","v":""},{"$f":"IF(OR(INDIRECT(\"'SPR \" & Lists!P11 &\"'!P28\")>=6,INDIRECT(\"'SPR \" & Lists!P11 &\"'!R28\")>=1,INDIRECT(\"'SPR \" & Lists!P11 &\"'!S28\")=1),\"Y\",\"\")","v":""},null,{"$f":"IF(INDIRECT(\"'SPR \" & Lists!P11 & \"'!P34\")>0,\"Y\",\"\")","v":""}]
[12,null,0.4,null,0,"Supply Chain Integrity and Security",null,null,{"$f":"IF(INDIRECT(\"'THIRA Steps 1-3'!$C$57\")<>\"Click here to enter capability targets\",\"Y\",\"\")","v":"Y"},{"$f":"IF(OR('THIRA #12 Supply Chain'!T$5>0,'THIRA #12 Supply Chain'!T$8>0),\"Y\",\"\")","v":""},null,null,{"$f":"IF(INDIRECT(\"'SPR \" & Lists!P12 & \"'!P9\")>0,\"Y\",\"\")","v":""},null,{"$f":"IF(INDIRECT(\"'SPR \" & Lists!P12 & \"'!P14\")>1,\"Y\",\"\")","v":""},{"$f":"IF(INDIRECT(\"'SPR \" & Lists!P12 & \"'!Q14\")>1,\"Y\",\"\")","v":""},{"$f":"IF(OR(INDIRECT(\"'SPR \" & Lists!P12 &\"'!P14\")>=6,INDIRECT(\"'SPR \" & Lists!P12 &\"'!R14\")>=1,INDIRECT(\"'SPR \" & Lists!P12 &\"'!s14\")=1),\"Y\",\"\")","v":""},null,{"$f":"IF(INDIRECT(\"'SPR \" & Lists!P12 & \"'!P18\")>1,\"Y\",\"\")","v":""},{"$f":"IF(INDIRECT(\"'SPR \" & Lists!P12 & \"'!Q18\")>1,\"Y\",\"\")","v":""},{"$f":"IF(OR(INDIRECT(\"'SPR \" & Lists!P12 &\"'!P18\")>=6,INDIRECT(\"'SPR \" & Lists!P12 &\"'!R18\")=1),\"Y\",\"\")","v":""},null,{"$f":"IF(INDIRECT(\"'SPR \" & Lists!P12 & \"'!P21\")>1,\"Y\",\"\")","v":""},{"$f":"IF(INDIRECT(\"'SPR \" & Lists!P12 & \"'!Q21\")>1,\"Y\",\"\")","v":""},{"$f":"IF(OR(INDIRECT(\"'SPR \" & Lists!P12 &\"'!P21\")>=6,INDIRECT(\"'SPR \" & Lists!P12 &\"'!R21\")=1),\"Y\",\"\")","v":""},null,{"$f":"IF(INDIRECT(\"'SPR \" & Lists!P12 & \"'!P24\")>1,\"Y\",\"\")","v":""},{"$f":"IF(INDIRECT(\"'SPR \" & Lists!P12 & \"'!Q24\")>1,\"Y\",\"\")","v":""},{"$f":"IF(OR(INDIRECT(\"'SPR \" & Lists!P12 &\"'!P24\")>=6,INDIRECT(\"'SPR \" & Lists!P12 &\"'!R24\")>=1,INDIRECT(\"'SPR \" & Lists!P12 &\"'!S24\")=1),\"Y\",\"\")","v":""},null,{"$f":"IF(INDIRECT(\"'SPR \" & Lists!P12 & \"'!P28\")>1,\"Y\",\"\")","v":""},{"$f":"IF(INDIRECT(\"'SPR \" & Lists!P12 & \"'!Q28\")>1,\"Y\",\"\")","v":""},{"$f":"IF(OR(INDIRECT(\"'SPR \" & Lists!P12 &\"'!P28\")>=6,INDIRECT(\"'SPR \" & Lists!P12 &\"'!R28\")>=1,INDIRECT(\"'SPR \" & Lists!P12 &\"'!S28\")=1),\"Y\",\"\")","v":""},null,{"$f":"IF(INDIRECT(\"'SPR \" & Lists!P12 & \"'!P34\")>0,\"Y\",\"\")","v":""}]
[13,null,0.4,null,0,"Community Resilience",null,null,{"$f":"IF(INDIRECT(\"'THIRA Steps 1-3'!$C$61\")<>\"Click here to enter capability targets\",\"Y\",\"\")","v":"Y"},{"$f":"IF(OR('THIRA #13 Comm Resilience'!T$5>0,'THIRA #13 Comm Resilience'!T$8>0),\"Y\",\"\")","v":""},null,null,{"$f":"IF(INDIRECT(\"'SPR \" & Lists!P13 & \"'!P9\")>0,\"Y\",\"\")","v":""},null,{"$f":"IF(INDIRECT(\"'SPR \" & Lists!P13 & \"'!P14\")>1,\"Y\",\"\")","v":""},{"$f":"IF(INDIRECT(\"'SPR \" & Lists!P13 & \"'!Q14\")>1,\"Y\",\"\")","v":""},{"$f":"IF(OR(INDIRECT(\"'SPR \" & Lists!P13 &\"'!P14\")>=6,INDIRECT(\"'SPR \" & Lists!P13 &\"'!R14\")>=1,INDIRECT(\"'SPR \" & Lists!P13 &\"'!s14\")=1),\"Y\",\"\")","v":""},null,{"$f":"IF(INDIRECT(\"'SPR \" & Lists!P13 & \"'!P18\")>1,\"Y\",\"\")","v":""},{"$f":"IF(INDIRECT(\"'SPR \" & Lists!P13 & \"'!Q18\")>1,\"Y\",\"\")","v":""},{"$f":"IF(OR(INDIRECT(\"'SPR \" & Lists!P13 &\"'!P18\")>=6,INDIRECT(\"'SPR \" & Lists!P13 &\"'!R18\")=1),\"Y\",\"\")","v":""},null,{"$f":"IF(INDIRECT(\"'SPR \" & Lists!P13 & \"'!P21\")>1,\"Y\",\"\")","v":""},{"$f":"IF(INDIRECT(\"'SPR \" & Lists!P13 & \"'!Q21\")>1,\"Y\",\"\")","v":""},{"$f":"IF(OR(INDIRECT(\"'SPR \" & Lists!P13 &\"'!P21\")>=6,INDIRECT(\"'SPR \" & Lists!P13 &\"'!R21\")=1),\"Y\",\"\")","v":""},null,{"$f":"IF(INDIRECT(\"'SPR \" & Lists!P13 & \"'!P24\")>1,\"Y\",\"\")","v":""},{"$f":"IF(INDIRECT(\"'SPR \" & Lists!P13 & \"'!Q24\")>1,\"Y\",\"\")","v":""},{"$f":"IF(OR(INDIRECT(\"'SPR \" & Lists!P13 &\"'!P24\")>=6,INDIRECT(\"'SPR \" & Lists!P13 &\"'!R24\")>=1,INDIRECT(\"'SPR \" & Lists!P13 &\"'!S24\")=1),\"Y\",\"\")","v":""},null,{"$f":"IF(INDIRECT(\"'SPR \" & Lists!P13 & \"'!P28\")>1,\"Y\",\"\")","v":""},{"$f":"IF(INDIRECT(\"'SPR \" & Lists!P13 & \"'!Q28\")>1,\"Y\",\"\")","v":""},{"$f":"IF(OR(INDIRECT(\"'SPR \" & Lists!P13 &\"'!P28\")>=6,INDIRECT(\"'SPR \" & Lists!P13 &\"'!R28\")>=1,INDIRECT(\"'SPR \" & Lists!P13 &\"'!S28\")=1),\"Y\",\"\")","v":""},null,{"$f":"IF(INDIRECT(\"'SPR \" & Lists!P13 & \"'!P34\")>0,\"Y\",\"\")","v":""}]
[14,null,0.4,null,0,"Long-term Vulnerability Reduction",null,null,{"$f":"IF(INDIRECT(\"'THIRA Steps 1-3'!$C$65\")<>\"Click here to enter capability targets\",\"Y\",\"\")","v":"Y"},{"$f":"IF(OR('THIRA #14 Long Term Vul Red'!T$5>0,'THIRA #14 Long Term Vul Red'!T$8>0),\"Y\",\"\")","v":""},null,null,{"$f":"IF(INDIRECT(\"'SPR \" & Lists!P14 & \"'!P9\")>0,\"Y\",\"\")","v":""},null,{"$f":"IF(INDIRECT(\"'SPR \" & Lists!P14 & \"'!P14\")>1,\"Y\",\"\")","v":""},{"$f":"IF(INDIRECT(\"'SPR \" & Lists!P14 & \"'!Q14\")>1,\"Y\",\"\")","v":""},{"$f":"IF(OR(INDIRECT(\"'SPR \" & Lists!P14 &\"'!P14\")>=6,INDIRECT(\"'SPR \" & Lists!P14 &\"'!R14\")>=1,INDIRECT(\"'SPR \" & Lists!P14 &\"'!s14\")=1),\"Y\",\"\")","v":""},null,{"$f":"IF(INDIRECT(\"'SPR \" & Lists!P14 & \"'!P18\")>1,\"Y\",\"\")","v":""},{"$f":"IF(INDIRECT(\"'SPR \" & Lists!P14 & \"'!Q18\")>1,\"Y\",\"\")","v":""},{"$f":"IF(OR(INDIRECT(\"'SPR \" & Lists!P14 &\"'!P18\")>=6,INDIRECT(\"'SPR \" & Lists!P14 &\"'!R18\")=1),\"Y\",\"\")","v":""},null,{"$f":"IF(INDIRECT(\"'SPR \" & Lists!P14 & \"'!P21\")>1,\"Y\",\"\")","v":""},{"$f":"IF(INDIRECT(\"'SPR \" & Lists!P14 & \"'!Q21\")>1,\"Y\",\"\")","v":""},{"$f":"IF(OR(INDIRECT(\"'SPR \" & Lists!P14 &\"'!P21\")>=6,INDIRECT(\"'SPR \" & Lists!P14 &\"'!R21\")=1),\"Y\",\"\")","v":""},null,{"$f":"IF(INDIRECT(\"'SPR \" & Lists!P14 & \"'!P24\")>1,\"Y\",\"\")","v":""},{"$f":"IF(INDIRECT(\"'SPR \" & Lists!P14 & \"'!Q24\")>1,\"Y\",\"\")","v":""},{"$f":"IF(OR(INDIRECT(\"'SPR \" & Lists!P14 &\"'!P24\")>=6,INDIRECT(\"'SPR \" & Lists!P14 &\"'!R24\")>=1,INDIRECT(\"'SPR \" & Lists!P14 &\"'!S24\")=1),\"Y\",\"\")","v":""},null,{"$f":"IF(INDIRECT(\"'SPR \" & Lists!P14 & \"'!P28\")>1,\"Y\",\"\")","v":""},{"$f":"IF(INDIRECT(\"'SPR \" & Lists!P14 & \"'!Q28\")>1,\"Y\",\"\")","v":""},{"$f":"IF(OR(INDIRECT(\"'SPR \" & Lists!P14 &\"'!P28\")>=6,INDIRECT(\"'SPR \" & Lists!P14 &\"'!R28\")>=1,INDIRECT(\"'SPR \" & Lists!P14 &\"'!S28\")=1),\"Y\",\"\")","v":""},null,{"$f":"IF(INDIRECT(\"'SPR \" & Lists!P14 & \"'!P34\")>0,\"Y\",\"\")","v":""}]
[15,null,0.4,null,0,"Risk and Disaster Resilience Assessment",null,null,{"$f":"IF(INDIRECT(\"'THIRA Steps 1-3'!$C$69\")<>\"Click here to enter capability targets\",\"Y\",\"\")","v":"Y"},{"$f":"IF(OR('THIRA #15 Risk Resil Assess'!T$5>0,'THIRA #15 Risk Resil Assess'!T$8>0),\"Y\",\"\")","v":""},null,null,{"$f":"IF(INDIRECT(\"'SPR \" & Lists!P15 & \"'!P9\")>0,\"Y\",\"\")","v":""},null,{"$f":"IF(INDIRECT(\"'SPR \" & Lists!P15 & \"'!P14\")>1,\"Y\",\"\")","v":""},{"$f":"IF(INDIRECT(\"'SPR \" & Lists!P15 & \"'!Q14\")>1,\"Y\",\"\")","v":""},{"$f":"IF(OR(INDIRECT(\"'SPR \" & Lists!P15 &\"'!P14\")>=6,INDIRECT(\"'SPR \" & Lists!P15 &\"'!R14\")>=1,INDIRECT(\"'SPR \" & Lists!P15 &\"'!s14\")=1),\"Y\",\"\")","v":""},null,{"$f":"IF(INDIRECT(\"'SPR \" & Lists!P15 & \"'!P18\")>1,\"Y\",\"\")","v":""},{"$f":"IF(INDIRECT(\"'SPR \" & Lists!P15 & \"'!Q18\")>1,\"Y\",\"\")","v":""},{"$f":"IF(OR(INDIRECT(\"'SPR \" & Lists!P15 &\"'!P18\")>=6,INDIRECT(\"'SPR \" & Lists!P15 &\"'!R18\")=1),\"Y\",\"\")","v":""},null,{"$f":"IF(INDIRECT(\"'SPR \" & Lists!P15 & \"'!P21\")>1,\"Y\",\"\")","v":""},{"$f":"IF(INDIRECT(\"'SPR \" & Lists!P15 & \"'!Q21\")>1,\"Y\",\"\")","v":""},{"$f":"IF(OR(INDIRECT(\"'SPR \" & Lists!P15 &\"'!P21\")>=6,INDIRECT(\"'SPR \" & Lists!P15 &\"'!R21\")=1),\"Y\",\"\")","v":""},null,{"$f":"IF(INDIRECT(\"'SPR \" & Lists!P15 & \"'!P24\")>1,\"Y\",\"\")","v":""},{"$f":"IF(INDIRECT(\"'SPR \" & Lists!P15 & \"'!Q24\")>1,\"Y\",\"\")","v":""},{"$f":"IF(OR(INDIRECT(\"'SPR \" & Lists!P15 &\"'!P24\")>=6,INDIRECT(\"'SPR \" & Lists!P15 &\"'!R24\")>=1,INDIRECT(\"'SPR \" & Lists!P15 &\"'!S24\")=1),\"Y\",\"\")","v":""},null,{"$f":"IF(INDIRECT(\"'SPR \" & Lists!P15 & \"'!P28\")>1,\"Y\",\"\")","v":""},{"$f":"IF(INDIRECT(\"'SPR \" & Lists!P15 & \"'!Q28\")>1,\"Y\",\"\")","v":""},{"$f":"IF(OR(INDIRECT(\"'SPR \" & Lists!P15 &\"'!P28\")>=6,INDIRECT(\"'SPR \" & Lists!P15 &\"'!R28\")>=1,INDIRECT(\"'SPR \" & Lists!P15 &\"'!S28\")=1),\"Y\",\"\")","v":""},null,{"$f":"IF(INDIRECT(\"'SPR \" & Lists!P15 & \"'!P34\")>0,\"Y\",\"\")","v":""}]
[16,null,0.4,null,0,"Threats and Hazard Identification",null,null,{"$f":"IF(INDIRECT(\"'THIRA Steps 1-3'!$C$73\")<>\"Click here to enter capability targets\",\"Y\",\"\")","v":"Y"},{"$f":"IF(OR('THIRA #16 Threat Haz ID'!T$5>0,'THIRA #16 Threat Haz ID'!T$8>0),\"Y\",\"\")","v":""},null,null,{"$f":"IF(INDIRECT(\"'SPR \" & Lists!P16 & \"'!P9\")>0,\"Y\",\"\")","v":""},null,{"$f":"IF(INDIRECT(\"'SPR \" & Lists!P16 & \"'!P14\")>1,\"Y\",\"\")","v":""},{"$f":"IF(INDIRECT(\"'SPR \" & Lists!P16 & \"'!Q14\")>1,\"Y\",\"\")","v":""},{"$f":"IF(OR(INDIRECT(\"'SPR \" & Lists!P16 &\"'!P14\")>=6,INDIRECT(\"'SPR \" & Lists!P16 &\"'!R14\")>=1,INDIRECT(\"'SPR \" & Lists!P16 &\"'!s14\")=1),\"Y\",\"\")","v":""},null,{"$f":"IF(INDIRECT(\"'SPR \" & Lists!P16 & \"'!P18\")>1,\"Y\",\"\")","v":""},{"$f":"IF(INDIRECT(\"'SPR \" & Lists!P16 & \"'!Q18\")>1,\"Y\",\"\")","v":""},{"$f":"IF(OR(INDIRECT(\"'SPR \" & Lists!P16 &\"'!P18\")>=6,INDIRECT(\"'SPR \" & Lists!P16 &\"'!R18\")=1),\"Y\",\"\")","v":""},null,{"$f":"IF(INDIRECT(\"'SPR \" & Lists!P16 & \"'!P21\")>1,\"Y\",\"\")","v":""},{"$f":"IF(INDIRECT(\"'SPR \" & Lists!P16 & \"'!Q21\")>1,\"Y\",\"\")","v":""},{"$f":"IF(OR(INDIRECT(\"'SPR \" & Lists!P16 &\"'!P21\")>=6,INDIRECT(\"'SPR \" & Lists!P16 &\"'!R21\")=1),\"Y\",\"\")","v":""},null,{"$f":"IF(INDIRECT(\"'SPR \" & Lists!P16 & \"'!P24\")>1,\"Y\",\"\")","v":""},{"$f":"IF(INDIRECT(\"'SPR \" & Lists!P16 & \"'!Q24\")>1,\"Y\",\"\")","v":""},{"$f":"IF(OR(INDIRECT(\"'SPR \" & Lists!P16 &\"'!P24\")>=6,INDIRECT(\"'SPR \" & Lists!P16 &\"'!R24\")>=1,INDIRECT(\"'SPR \" & Lists!P16 &\"'!S24\")=1),\"Y\",\"\")","v":""},null,{"$f":"IF(INDIRECT(\"'SPR \" & Lists!P16 & \"'!P28\")>1,\"Y\",\"\")","v":""},{"$f":"IF(INDIRECT(\"'SPR \" & Lists!P16 & \"'!Q28\")>1,\"Y\",\"\")","v":""},{"$f":"IF(OR(INDIRECT(\"'SPR \" & Lists!P16 &\"'!P28\")>=6,INDIRECT(\"'SPR \" & Lists!P16 &\"'!R28\")>=1,INDIRECT(\"'SPR \" & Lists!P16 &\"'!S28\")=1),\"Y\",\"\")","v":""},null,{"$f":"IF(INDIRECT(\"'SPR \" & Lists!P16 & \"'!P34\")>0,\"Y\",\"\")","v":""}]
[17,null,0.4,null,0,"Critical Transportation",null,null,{"$f":"IF(INDIRECT(\"'THIRA Steps 1-3'!$C$77\")<>\"Click here to enter capability targets\",\"Y\",\"\")","v":"Y"},{"$f":"IF(OR('THIRA #17 Crit Transport'!T$5>0,'THIRA #17 Crit Transport'!T$8>0),\"Y\",\"\")","v":""},null,null,{"$f":"IF(INDIRECT(\"'SPR \" & Lists!P17 & \"'!P9\")>0,\"Y\",\"\")","v":""},null,{"$f":"IF(INDIRECT(\"'SPR \" & Lists!P17 & \"'!P14\")>1,\"Y\",\"\")","v":""},{"$f":"IF(INDIRECT(\"'SPR \" & Lists!P17 & \"'!Q14\")>1,\"Y\",\"\")","v":""},{"$f":"IF(OR(INDIRECT(\"'SPR \" & Lists!P17 &\"'!P14\")>=6,INDIRECT(\"'SPR \" & Lists!P17 &\"'!R14\")>=1,INDIRECT(\"'SPR \" & Lists!P17 &\"'!s14\")=1),\"Y\",\"\")","v":""},null,{"$f":"IF(INDIRECT(\"'SPR \" & Lists!P17 & \"'!P18\")>1,\"Y\",\"\")","v":""},{"$f":"IF(INDIRECT(\"'SPR \" & Lists!P17 & \"'!Q18\")>1,\"Y\",\"\")","v":""},{"$f":"IF(OR(INDIRECT(\"'SPR \" & Lists!P17 &\"'!P18\")>=6,INDIRECT(\"'SPR \" & Lists!P17 &\"'!R18\")=1),\"Y\",\"\")","v":""},null,{"$f":"IF(INDIRECT(\"'SPR \" & Lists!P17 & \"'!P21\")>1,\"Y\",\"\")","v":""},{"$f":"IF(INDIRECT(\"'SPR \" & Lists!P17 & \"'!Q21\")>1,\"Y\",\"\")","v":""},{"$f":"IF(OR(INDIRECT(\"'SPR \" & Lists!P17 &\"'!P21\")>=6,INDIRECT(\"'SPR \" & Lists!P17 &\"'!R21\")=1),\"Y\",\"\")","v":""},null,{"$f":"IF(INDIRECT(\"'SPR \" & Lists!P17 & \"'!P24\")>1,\"Y\",\"\")","v":""},{"$f":"IF(INDIRECT(\"'SPR \" & Lists!P17 & \"'!Q24\")>1,\"Y\",\"\")","v":""},{"$f":"IF(OR(INDIRECT(\"'SPR \" & Lists!P17 &\"'!P24\")>=6,INDIRECT(\"'SPR \" & Lists!P17 &\"'!R24\")>=1,INDIRECT(\"'SPR \" & Lists!P17 &\"'!S24\")=1),\"Y\",\"\")","v":""},null,{"$f":"IF(INDIRECT(\"'SPR \" & Lists!P17 & \"'!P28\")>1,\"Y\",\"\")","v":""},{"$f":"IF(INDIRECT(\"'SPR \" & Lists!P17 & \"'!Q28\")>1,\"Y\",\"\")","v":""},{"$f":"IF(OR(INDIRECT(\"'SPR \" & Lists!P17 &\"'!P28\")>=6,INDIRECT(\"'SPR \" & Lists!P17 &\"'!R28\")>=1,INDIRECT(\"'SPR \" & Lists!P17 &\"'!S28\")=1),\"Y\",\"\")","v":""},null,{"$f":"IF(INDIRECT(\"'SPR \" & Lists!P17 & \"'!P34\")>0,\"Y\",\"\")","v":""}]
[18,null,0.4,null,0,"Environmental Response/Health and Safety",null,null,{"$f":"IF(INDIRECT(\"'THIRA Steps 1-3'!$C$81\")<>\"Click here to enter capability targets\",\"Y\",\"\")","v":"Y"},{"$f":"IF(OR('THIRA #18 Envir Resp Health'!T$5>0,'THIRA #18 Envir Resp Health'!T$8>0),\"Y\",\"\")","v":""},null,null,{"$f":"IF(INDIRECT(\"'SPR \" & Lists!P18 & \"'!P9\")>0,\"Y\",\"\")","v":""},null,{"$f":"IF(INDIRECT(\"'SPR \" & Lists!P18 & \"'!P14\")>1,\"Y\",\"\")","v":""},{"$f":"IF(INDIRECT(\"'SPR \" & Lists!P18 & \"'!Q14\")>1,\"Y\",\"\")","v":""},{"$f":"IF(OR(INDIRECT(\"'SPR \" & Lists!P18 &\"'!P14\")>=6,INDIRECT(\"'SPR \" & Lists!P18 &\"'!R14\")>=1,INDIRECT(\"'SPR \" & Lists!P18 &\"'!s14\")=1),\"Y\",\"\")","v":""},null,{"$f":"IF(INDIRECT(\"'SPR \" & Lists!P18 & \"'!P18\")>1,\"Y\",\"\")","v":""},{"$f":"IF(INDIRECT(\"'SPR \" & Lists!P18 & \"'!Q18\")>1,\"Y\",\"\")","v":""},{"$f":"IF(OR(INDIRECT(\"'SPR \" & Lists!P18 &\"'!P18\")>=6,INDIRECT(\"'SPR \" & Lists!P18 &\"'!R18\")=1),\"Y\",\"\")","v":""},null,{"$f":"IF(INDIRECT(\"'SPR \" & Lists!P18 & \"'!P21\")>1,\"Y\",\"\")","v":""},{"$f":"IF(INDIRECT(\"'SPR \" & Lists!P18 & \"'!Q21\")>1,\"Y\",\"\")","v":""},{"$f":"IF(OR(INDIRECT(\"'SPR \" & Lists!P18 &\"'!P21\")>=6,INDIRECT(\"'SPR \" & Lists!P18 &\"'!R21\")=1),\"Y\",\"\")","v":""},null,{"$f":"IF(INDIRECT(\"'SPR \" & Lists!P18 & \"'!P24\")>1,\"Y\",\"\")","v":""},{"$f":"IF(INDIRECT(\"'SPR \" & Lists!P18 & \"'!Q24\")>1,\"Y\",\"\")","v":""},{"$f":"IF(OR(INDIRECT(\"'SPR \" & Lists!P18 &\"'!P24\")>=6,INDIRECT(\"'SPR \" & Lists!P18 &\"'!R24\")>=1,INDIRECT(\"'SPR \" & Lists!P18 &\"'!S24\")=1),\"Y\",\"\")","v":""},null,{"$f":"IF(INDIRECT(\"'SPR \" & Lists!P18 & \"'!P28\")>1,\"Y\",\"\")","v":""},{"$f":"IF(INDIRECT(\"'SPR \" & Lists!P18 & \"'!Q28\")>1,\"Y\",\"\")","v":""},{"$f":"IF(OR(INDIRECT(\"'SPR \" & Lists!P18 &\"'!P28\")>=6,INDIRECT(\"'SPR \" & Lists!P18 &\"'!R28\")>=1,INDIRECT(\"'SPR \" & Lists!P18 &\"'!S28\")=1),\"Y\",\"\")","v":""},null,{"$f":"IF(INDIRECT(\"'SPR \" & Lists!P18 & \"'!P34\")>0,\"Y\",\"\")","v":""}]
[19,null,0.4,null,0,"Fatality Management Services",null,null,{"$f":"IF(INDIRECT(\"'THIRA Steps 1-3'!$C$85\")<>\"Click here to enter capability targets\",\"Y\",\"\")","v":"Y"},{"$f":"IF(OR('THIRA #19 Fatality Mgmt'!T$5>0,'THIRA #19 Fatality Mgmt'!T$8>0),\"Y\",\"\")","v":""},null,null,{"$f":"IF(INDIRECT(\"'SPR \" & Lists!P19 & \"'!P9\")>0,\"Y\",\"\")","v":""},null,{"$f":"IF(INDIRECT(\"'SPR \" & Lists!P19 & \"'!P14\")>1,\"Y\",\"\")","v":""},{"$f":"IF(INDIRECT(\"'SPR \" & Lists!P19 & \"'!Q14\")>1,\"Y\",\"\")","v":""},{"$f":"IF(OR(INDIRECT(\"'SPR \" & Lists!P19 &\"'!P14\")>=6,INDIRECT(\"'SPR \" & Lists!P19 &\"'!R14\")>=1,INDIRECT(\"'SPR \" & Lists!P19 &\"'!s14\")=1),\"Y\",\"\")","v":""},null,{"$f":"IF(INDIRECT(\"'SPR \" & Lists!P19 & \"'!P18\")>1,\"Y\",\"\")","v":""},{"$f":"IF(INDIRECT(\"'SPR \" & Lists!P19 & \"'!Q18\")>1,\"Y\",\"\")","v":""},{"$f":"IF(OR(INDIRECT(\"'SPR \" & Lists!P19 &\"'!P18\")>=6,INDIRECT(\"'SPR \" & Lists!P19 &\"'!R18\")=1),\"Y\",\"\")","v":""},null,{"$f":"IF(INDIRECT(\"'SPR \" & Lists!P19 & \"'!P21\")>1,\"Y\",\"\")","v":""},{"$f":"IF(INDIRECT(\"'SPR \" & Lists!P19 & \"'!Q21\")>1,\"Y\",\"\")","v":""},{"$f":"IF(OR(INDIRECT(\"'SPR \" & Lists!P19 &\"'!P21\")>=6,INDIRECT(\"'SPR \" & Lists!P19 &\"'!R21\")=1),\"Y\",\"\")","v":""},null,{"$f":"IF(INDIRECT(\"'SPR \" & Lists!P19 & \"'!P24\")>1,\"Y\",\"\")","v":""},{"$f":"IF(INDIRECT(\"'SPR \" & Lists!P19 & \"'!Q24\")>1,\"Y\",\"\")","v":""},{"$f":"IF(OR(INDIRECT(\"'SPR \" & Lists!P19 &\"'!P24\")>=6,INDIRECT(\"'SPR \" & Lists!P19 &\"'!R24\")>=1,INDIRECT(\"'SPR \" & Lists!P19 &\"'!S24\")=1),\"Y\",\"\")","v":""},null,{"$f":"IF(INDIRECT(\"'SPR \" & Lists!P19 & \"'!P28\")>1,\"Y\",\"\")","v":""},{"$f":"IF(INDIRECT(\"'SPR \" & Lists!P19 & \"'!Q28\")>1,\"Y\",\"\")","v":""},{"$f":"IF(OR(INDIRECT(\"'SPR \" & Lists!P19 &\"'!P28\")>=6,INDIRECT(\"'SPR \" & Lists!P19 &\"'!R28\")>=1,INDIRECT(\"'SPR \" & Lists!P19 &\"'!S28\")=1),\"Y\",\"\")","v":""},null,{"$f":"IF(INDIRECT(\"'SPR \" & Lists!P19 & \"'!P34\")>0,\"Y\",\"\")","v":""}]
[20,null,0.4,null,0,"Infrastructure Systems",null,null,{"$f":"IF(INDIRECT(\"'THIRA Steps 1-3'!$C$89\")<>\"Click here to enter capability targets\",\"Y\",\"\")","v":"Y"},{"$f":"IF(OR('THIRA #20 Infrastructure Sys'!T$5>0,'THIRA #20 Infrastructure Sys'!T$8>0),\"Y\",\"\")","v":""},null,null,{"$f":"IF(INDIRECT(\"'SPR \" & Lists!P20 & \"'!P9\")>0,\"Y\",\"\")","v":""},null,{"$f":"IF(INDIRECT(\"'SPR \" & Lists!P20 & \"'!P14\")>1,\"Y\",\"\")","v":""},{"$f":"IF(INDIRECT(\"'SPR \" & Lists!P20 & \"'!Q14\")>1,\"Y\",\"\")","v":""},{"$f":"IF(OR(INDIRECT(\"'SPR \" & Lists!P20 &\"'!P14\")>=6,INDIRECT(\"'SPR \" & Lists!P20 &\"'!R14\")>=1,INDIRECT(\"'SPR \" & Lists!P20 &\"'!s14\")=1),\"Y\",\"\")","v":""},null,{"$f":"IF(INDIRECT(\"'SPR \" & Lists!P20 & \"'!P18\")>1,\"Y\",\"\")","v":""},{"$f":"IF(INDIRECT(\"'SPR \" & Lists!P20 & \"'!Q18\")>1,\"Y\",\"\")","v":""},{"$f":"IF(OR(INDIRECT(\"'SPR \" & Lists!P20 &\"'!P18\")>=6,INDIRECT(\"'SPR \" & Lists!P20 &\"'!R18\")=1),\"Y\",\"\")","v":""},null,{"$f":"IF(INDIRECT(\"'SPR \" & Lists!P20 & \"'!P21\")>1,\"Y\",\"\")","v":""},{"$f":"IF(INDIRECT(\"'SPR \" & Lists!P20 & \"'!Q21\")>1,\"Y\",\"\")","v":""},{"$f":"IF(OR(INDIRECT(\"'SPR \" & Lists!P20 &\"'!P21\")>=6,INDIRECT(\"'SPR \" & Lists!P20 &\"'!R21\")=1),\"Y\",\"\")","v":""},null,{"$f":"IF(INDIRECT(\"'SPR \" & Lists!P20 & \"'!P24\")>1,\"Y\",\"\")","v":""},{"$f":"IF(INDIRECT(\"'SPR \" & Lists!P20 & \"'!Q24\")>1,\"Y\",\"\")","v":""},{"$f":"IF(OR(INDIRECT(\"'SPR \" & Lists!P20 &\"'!P24\")>=6,INDIRECT(\"'SPR \" & Lists!P20 &\"'!R24\")>=1,INDIRECT(\"'SPR \" & Lists!P20 &\"'!S24\")=1),\"Y\",\"\")","v":""},null,{"$f":"IF(INDIRECT(\"'SPR \" & Lists!P20 & \"'!P28\")>1,\"Y\",\"\")","v":""},{"$f":"IF(INDIRECT(\"'SPR \" & Lists!P20 & \"'!Q28\")>1,\"Y\",\"\")","v":""},{"$f":"IF(OR(INDIRECT(\"'SPR \" & Lists!P20 &\"'!P28\")>=6,INDIRECT(\"'SPR \" & Lists!P20 &\"'!R28\")>=1,INDIRECT(\"'SPR \" & Lists!P20 &\"'!S28\")=1),\"Y\",\"\")","v":""},null,{"$f":"IF(INDIRECT(\"'SPR \" & Lists!P20 & \"'!P34\")>0,\"Y\",\"\")","v":""}]
[21,null,0.4,null,0,"Mass Care Services",null,null,{"$f":"IF(INDIRECT(\"'THIRA Steps 1-3'!$C$93\")<>\"Click here to enter capability targets\",\"Y\",\"\")","v":"Y"},{"$f":"IF(OR('THIRA #21 Mass Care'!T$5>0,'THIRA #21 Mass Care'!T$8>0),\"Y\",\"\")","v":""},null,null,{"$f":"IF(INDIRECT(\"'SPR \" & Lists!P21 & \"'!P9\")>0,\"Y\",\"\")","v":""},null,{"$f":"IF(INDIRECT(\"'SPR \" & Lists!P21 & \"'!P14\")>1,\"Y\",\"\")","v":""},{"$f":"IF(INDIRECT(\"'SPR \" & Lists!P21 & \"'!Q14\")>1,\"Y\",\"\")","v":""},{"$f":"IF(OR(INDIRECT(\"'SPR \" & Lists!P21 &\"'!P14\")>=6,INDIRECT(\"'SPR \" & Lists!P21 &\"'!R14\")>=1,INDIRECT(\"'SPR \" & Lists!P21 &\"'!s14\")=1),\"Y\",\"\")","v":""},null,{"$f":"IF(INDIRECT(\"'SPR \" & Lists!P21 & \"'!P18\")>1,\"Y\",\"\")","v":""},{"$f":"IF(INDIRECT(\"'SPR \" & Lists!P21 & \"'!Q18\")>1,\"Y\",\"\")","v":""},{"$f":"IF(OR(INDIRECT(\"'SPR \" & Lists!P21 &\"'!P18\")>=6,INDIRECT(\"'SPR \" & Lists!P21 &\"'!R18\")=1),\"Y\",\"\")","v":""},null,{"$f":"IF(INDIRECT(\"'SPR \" & Lists!P21 & \"'!P21\")>1,\"Y\",\"\")","v":""},{"$f":"IF(INDIRECT(\"'SPR \" & Lists!P21 & \"'!Q21\")>1,\"Y\",\"\")","v":""},{"$f":"IF(OR(INDIRECT(\"'SPR \" & Lists!P21 &\"'!P21\")>=6,INDIRECT(\"'SPR \" & Lists!P21 &\"'!R21\")=1),\"Y\",\"\")","v":""},null,{"$f":"IF(INDIRECT(\"'SPR \" & Lists!P21 & \"'!P24\")>1,\"Y\",\"\")","v":""},{"$f":"IF(INDIRECT(\"'SPR \" & Lists!P21 & \"'!Q24\")>1,\"Y\",\"\")","v":""},{"$f":"IF(OR(INDIRECT(\"'SPR \" & Lists!P21 &\"'!P24\")>=6,INDIRECT(\"'SPR \" & Lists!P21 &\"'!R24\")>=1,INDIRECT(\"'SPR \" & Lists!P21 &\"'!S24\")=1),\"Y\",\"\")","v":""},null,{"$f":"IF(INDIRECT(\"'SPR \" & Lists!P21 & \"'!P28\")>1,\"Y\",\"\")","v":""},{"$f":"IF(INDIRECT(\"'SPR \" & Lists!P21 & \"'!Q28\")>1,\"Y\",\"\")","v":""},{"$f":"IF(OR(INDIRECT(\"'SPR \" & Lists!P21 &\"'!P28\")>=6,INDIRECT(\"'SPR \" & Lists!P21 &\"'!R28\")>=1,INDIRECT(\"'SPR \" & Lists!P21 &\"'!S28\")=1),\"Y\",\"\")","v":""},null,{"$f":"IF(INDIRECT(\"'SPR \" & Lists!P21 & \"'!P34\")>0,\"Y\",\"\")","v":""}]
[22,null,0.4,null,0,"Mass Search and Rescue Operations",null,null,{"$f":"IF(INDIRECT(\"'THIRA Steps 1-3'!$C$97\")<>\"Click here to enter capability targets\",\"Y\",\"\")","v":"Y"},{"$f":"IF(OR('THIRA #22 Mass SAR Ops'!T$5>0,'THIRA #22 Mass SAR Ops'!T$8>0),\"Y\",\"\")","v":""},null,null,{"$f":"IF(INDIRECT(\"'SPR \" & Lists!P22 & \"'!P9\")>0,\"Y\",\"\")","v":""},null,{"$f":"IF(INDIRECT(\"'SPR \" & Lists!P22 & \"'!P14\")>1,\"Y\",\"\")","v":""},{"$f":"IF(INDIRECT(\"'SPR \" & Lists!P22 & \"'!Q14\")>1,\"Y\",\"\")","v":""},{"$f":"IF(OR(INDIRECT(\"'SPR \" & Lists!P22 &\"'!P14\")>=6,INDIRECT(\"'SPR \" & Lists!P22 &\"'!R14\")>=1,INDIRECT(\"'SPR \" & Lists!P22 &\"'!s14\")=1),\"Y\",\"\")","v":""},null,{"$f":"IF(INDIRECT(\"'SPR \" & Lists!P22 & \"'!P18\")>1,\"Y\",\"\")","v":""},{"$f":"IF(INDIRECT(\"'SPR \" & Lists!P22 & \"'!Q18\")>1,\"Y\",\"\")","v":""},{"$f":"IF(OR(INDIRECT(\"'SPR \" & Lists!P22 &\"'!P18\")>=6,INDIRECT(\"'SPR \" & Lists!P22 &\"'!R18\")=1),\"Y\",\"\")","v":""},null,{"$f":"IF(INDIRECT(\"'SPR \" & Lists!P22 & \"'!P21\")>1,\"Y\",\"\")","v":""},{"$f":"IF(INDIRECT(\"'SPR \" & Lists!P22 & \"'!Q21\")>1,\"Y\",\"\")","v":""},{"$f":"IF(OR(INDIRECT(\"'SPR \" & Lists!P22 &\"'!P21\")>=6,INDIRECT(\"'SPR \" & Lists!P22 &\"'!R21\")=1),\"Y\",\"\")","v":""},null,{"$f":"IF(INDIRECT(\"'SPR \" & Lists!P22 & \"'!P24\")>1,\"Y\",\"\")","v":""},{"$f":"IF(INDIRECT(\"'SPR \" & Lists!P22 & \"'!Q24\")>1,\"Y\",\"\")","v":""},{"$f":"IF(OR(INDIRECT(\"'SPR \" & Lists!P22 &\"'!P24\")>=6,INDIRECT(\"'SPR \" & Lists!P22 &\"'!R24\")>=1,INDIRECT(\"'SPR \" & Lists!P22 &\"'!S24\")=1),\"Y\",\"\")","v":""},null,{"$f":"IF(INDIRECT(\"'SPR \" & Lists!P22 & \"'!P28\")>1,\"Y\",\"\")","v":""},{"$f":"IF(INDIRECT(\"'SPR \" & Lists!P22 & \"'!Q28\")>1,\"Y\",\"\")","v":""},{"$f":"IF(OR(INDIRECT(\"'SPR \" & Lists!P22 &\"'!P28\")>=6,INDIRECT(\"'SPR \" & Lists!P22 &\"'!R28\")>=1,INDIRECT(\"'SPR \" & Lists!P22 &\"'!S28\")=1),\"Y\",\"\")","v":""},null,{"$f":"IF(INDIRECT(\"'SPR \" & Lists!P22 & \"'!P34\")>0,\"Y\",\"\")","v":""}]
[23,null,0.4,null,0,"On-scene Security and Protection",null,null,{"$f":"IF(INDIRECT(\"'THIRA Steps 1-3'!$C$101\")<>\"Click here to enter capability targets\",\"Y\",\"\")","v":"Y"},{"$f":"IF(OR('THIRA #23 Security Protection'!T$5>0,'THIRA #23 Security Protection'!T$8>0),\"Y\",\"\")","v":""},null,null,{"$f":"IF(INDIRECT(\"'SPR \" & Lists!P23 & \"'!P9\")>0,\"Y\",\"\")","v":""},null,{"$f":"IF(INDIRECT(\"'SPR \" & Lists!P23 & \"'!P14\")>1,\"Y\",\"\")","v":""},{"$f":"IF(INDIRECT(\"'SPR \" & Lists!P23 & \"'!Q14\")>1,\"Y\",\"\")","v":""},{"$f":"IF(OR(INDIRECT(\"'SPR \" & Lists!P23 &\"'!P14\")>=6,INDIRECT(\"'SPR \" & Lists!P23 &\"'!R14\")>=1,INDIRECT(\"'SPR \" & Lists!P23 &\"'!s14\")=1),\"Y\",\"\")","v":""},null,{"$f":"IF(INDIRECT(\"'SPR \" & Lists!P23 & \"'!P18\")>1,\"Y\",\"\")","v":""},{"$f":"IF(INDIRECT(\"'SPR \" & Lists!P23 & \"'!Q18\")>1,\"Y\",\"\")","v":""},{"$f":"IF(OR(INDIRECT(\"'SPR \" & Lists!P23 &\"'!P18\")>=6,INDIRECT(\"'SPR \" & Lists!P23 &\"'!R18\")=1),\"Y\",\"\")","v":""},null,{"$f":"IF(INDIRECT(\"'SPR \" & Lists!P23 & \"'!P21\")>1,\"Y\",\"\")","v":""},{"$f":"IF(INDIRECT(\"'SPR \" & Lists!P23 & \"'!Q21\")>1,\"Y\",\"\")","v":""},{"$f":"IF(OR(INDIRECT(\"'SPR \" & Lists!P23 &\"'!P21\")>=6,INDIRECT(\"'SPR \" & Lists!P23 &\"'!R21\")=1),\"Y\",\"\")","v":""},null,{"$f":"IF(INDIRECT(\"'SPR \" & Lists!P23 & \"'!P24\")>1,\"Y\",\"\")","v":""},{"$f":"IF(INDIRECT(\"'SPR \" & Lists!P23 & \"'!Q24\")>1,\"Y\",\"\")","v":""},{"$f":"IF(OR(INDIRECT(\"'SPR \" & Lists!P23 &\"'!P24\")>=6,INDIRECT(\"'SPR \" & Lists!P23 &\"'!R24\")>=1,INDIRECT(\"'SPR \" & Lists!P23 &\"'!S24\")=1),\"Y\",\"\")","v":""},null,{"$f":"IF(INDIRECT(\"'SPR \" & Lists!P23 & \"'!P28\")>1,\"Y\",\"\")","v":""},{"$f":"IF(INDIRECT(\"'SPR \" & Lists!P23 & \"'!Q28\")>1,\"Y\",\"\")","v":""},{"$f":"IF(OR(INDIRECT(\"'SPR \" & Lists!P23 &\"'!P28\")>=6,INDIRECT(\"'SPR \" & Lists!P23 &\"'!R28\")>=1,INDIRECT(\"'SPR \" & Lists!P23 &\"'!S28\")=1),\"Y\",\"\")","v":""},null,{"$f":"IF(INDIRECT(\"'SPR \" & Lists!P23 & \"'!P34\")>0,\"Y\",\"\")","v":""}]
[24,null,0.4,null,0,"Operational  Communications",null,null,{"$f":"IF(INDIRECT(\"'THIRA Steps 1-3'!$C$105\")<>\"Click here to enter capability targets\",\"Y\",\"\")","v":"Y"},{"$f":"IF(OR('THIRA #24 Op Comms'!T$5>0,'THIRA #24 Op Comms'!T$8>0),\"Y\",\"\")","v":""},null,null,{"$f":"IF(INDIRECT(\"'SPR \" & Lists!P24 & \"'!P9\")>0,\"Y\",\"\")","v":""},null,{"$f":"IF(INDIRECT(\"'SPR \" & Lists!P24 & \"'!P14\")>1,\"Y\",\"\")","v":""},{"$f":"IF(INDIRECT(\"'SPR \" & Lists!P24 & \"'!Q14\")>1,\"Y\",\"\")","v":""},{"$f":"IF(OR(INDIRECT(\"'SPR \" & Lists!P24 &\"'!P14\")>=6,INDIRECT(\"'SPR \" & Lists!P24 &\"'!R14\")>=1,INDIRECT(\"'SPR \" & Lists!P24 &\"'!s14\")=1),\"Y\",\"\")","v":""},null,{"$f":"IF(INDIRECT(\"'SPR \" & Lists!P24 & \"'!P18\")>1,\"Y\",\"\")","v":""},{"$f":"IF(INDIRECT(\"'SPR \" & Lists!P24 & \"'!Q18\")>1,\"Y\",\"\")","v":""},{"$f":"IF(OR(INDIRECT(\"'SPR \" & Lists!P24 &\"'!P18\")>=6,INDIRECT(\"'SPR \" & Lists!P24 &\"'!R18\")=1),\"Y\",\"\")","v":""},null,{"$f":"IF(INDIRECT(\"'SPR \" & Lists!P24 & \"'!P21\")>1,\"Y\",\"\")","v":""},{"$f":"IF(INDIRECT(\"'SPR \" & Lists!P24 & \"'!Q21\")>1,\"Y\",\"\")","v":""},{"$f":"IF(OR(INDIRECT(\"'SPR \" & Lists!P24 &\"'!P21\")>=6,INDIRECT(\"'SPR \" & Lists!P24 &\"'!R21\")=1),\"Y\",\"\")","v":""},null,{"$f":"IF(INDIRECT(\"'SPR \" & Lists!P24 & \"'!P24\")>1,\"Y\",\"\")","v":""},{"$f":"IF(INDIRECT(\"'SPR \" & Lists!P24 & \"'!Q24\")>1,\"Y\",\"\")","v":""},{"$f":"IF(OR(INDIRECT(\"'SPR \" & Lists!P24 &\"'!P24\")>=6,INDIRECT(\"'SPR \" & Lists!P24 &\"'!R24\")>=1,INDIRECT(\"'SPR \" & Lists!P24 &\"'!S24\")=1),\"Y\",\"\")","v":""},null,{"$f":"IF(INDIRECT(\"'SPR \" & Lists!P24 & \"'!P28\")>1,\"Y\",\"\")","v":""},{"$f":"IF(INDIRECT(\"'SPR \" & Lists!P24 & \"'!Q28\")>1,\"Y\",\"\")","v":""},{"$f":"IF(OR(INDIRECT(\"'SPR \" & Lists!P24 &\"'!P28\")>=6,INDIRECT(\"'SPR \" & Lists!P24 &\"'!R28\")>=1,INDIRECT(\"'SPR \" & Lists!P24 &\"'!S28\")=1),\"Y\",\"\")","v":""},null,{"$f":"IF(INDIRECT(\"'SPR \" & Lists!P24 & \"'!P34\")>0,\"Y\",\"\")","v":""}]
[25,null,0.4,null,0,"Public and Private Services and Resources",null,null,{"$f":"IF(INDIRECT(\"'THIRA Steps 1-3'!$C$109\")<>\"Click here to enter capability targets\",\"Y\",\"\")","v":"Y"},{"$f":"IF(OR('THIRA #25 Pub Private Services'!T$5>0,'THIRA #25 Pub Private Services'!T$8>0),\"Y\",\"\")","v":""},null,null,{"$f":"IF(INDIRECT(\"'SPR \" & Lists!P25 & \"'!P9\")>0,\"Y\",\"\")","v":""},null,{"$f":"IF(INDIRECT(\"'SPR \" & Lists!P25 & \"'!P14\")>1,\"Y\",\"\")","v":""},{"$f":"IF(INDIRECT(\"'SPR \" & Lists!P25 & \"'!Q14\")>1,\"Y\",\"\")","v":""},{"$f":"IF(OR(INDIRECT(\"'SPR \" & Lists!P25 &\"'!P14\")>=6,INDIRECT(\"'SPR \" & Lists!P25 &\"'!R14\")>=1,INDIRECT(\"'SPR \" & Lists!P25 &\"'!s14\")=1),\"Y\",\"\")","v":""},null,{"$f":"IF(INDIRECT(\"'SPR \" & Lists!P25 & \"'!P18\")>1,\"Y\",\"\")","v":""},{"$f":"IF(INDIRECT(\"'SPR \" & Lists!P25 & \"'!Q18\")>1,\"Y\",\"\")","v":""},{"$f":"IF(OR(INDIRECT(\"'SPR \" & Lists!P25 &\"'!P18\")>=6,INDIRECT(\"'SPR \" & Lists!P25 &\"'!R18\")=1),\"Y\",\"\")","v":""},null,{"$f":"IF(INDIRECT(\"'SPR \" & Lists!P25 & \"'!P21\")>1,\"Y\",\"\")","v":""},{"$f":"IF(INDIRECT(\"'SPR \" & Lists!P25 & \"'!Q21\")>1,\"Y\",\"\")","v":""},{"$f":"IF(OR(INDIRECT(\"'SPR \" & Lists!P25 &\"'!P21\")>=6,INDIRECT(\"'SPR \" & Lists!P25 &\"'!R21\")=1),\"Y\",\"\")","v":""},null,{"$f":"IF(INDIRECT(\"'SPR \" & Lists!P25 & \"'!P24\")>1,\"Y\",\"\")","v":""},{"$f":"IF(INDIRECT(\"'SPR \" & Lists!P25 & \"'!Q24\")>1,\"Y\",\"\")","v":""},{"$f":"IF(OR(INDIRECT(\"'SPR \" & Lists!P25 &\"'!P24\")>=6,INDIRECT(\"'SPR \" & Lists!P25 &\"'!R24\")>=1,INDIRECT(\"'SPR \" & Lists!P25 &\"'!S24\")=1),\"Y\",\"\")","v":""},null,{"$f":"IF(INDIRECT(\"'SPR \" & Lists!P25 & \"'!P28\")>1,\"Y\",\"\")","v":""},{"$f":"IF(INDIRECT(\"'SPR \" & Lists!P25 & \"'!Q28\")>1,\"Y\",\"\")","v":""},{"$f":"IF(OR(INDIRECT(\"'SPR \" & Lists!P25 &\"'!P28\")>=6,INDIRECT(\"'SPR \" & Lists!P25 &\"'!R28\")>=1,INDIRECT(\"'SPR \" & Lists!P25 &\"'!S28\")=1),\"Y\",\"\")","v":""},null,{"$f":"IF(INDIRECT(\"'SPR \" & Lists!P25 & \"'!P34\")>0,\"Y\",\"\")","v":""}]
[26,null,0.4,null,0,"Public Health and Medical Services",null,null,{"$f":"IF(INDIRECT(\"'THIRA Steps 1-3'!$C$113\")<>\"Click here to enter capability targets\",\"Y\",\"\")","v":"Y"},{"$f":"IF(OR('THIRA #26 Public Health Medical'!T$5>0,'THIRA #26 Public Health Medical'!T$8>0),\"Y\",\"\")","v":""},null,null,{"$f":"IF(INDIRECT(\"'SPR \" & Lists!P26 & \"'!P9\")>0,\"Y\",\"\")","v":""},null,{"$f":"IF(INDIRECT(\"'SPR \" & Lists!P26 & \"'!P14\")>1,\"Y\",\"\")","v":""},{"$f":"IF(INDIRECT(\"'SPR \" & Lists!P26 & \"'!Q14\")>1,\"Y\",\"\")","v":""},{"$f":"IF(OR(INDIRECT(\"'SPR \" & Lists!P26 &\"'!P14\")>=6,INDIRECT(\"'SPR \" & Lists!P26 &\"'!R14\")>=1,INDIRECT(\"'SPR \" & Lists!P26 &\"'!s14\")=1),\"Y\",\"\")","v":""},null,{"$f":"IF(INDIRECT(\"'SPR \" & Lists!P26 & \"'!P18\")>1,\"Y\",\"\")","v":""},{"$f":"IF(INDIRECT(\"'SPR \" & Lists!P26 & \"'!Q18\")>1,\"Y\",\"\")","v":""},{"$f":"IF(OR(INDIRECT(\"'SPR \" & Lists!P26 &\"'!P18\")>=6,INDIRECT(\"'SPR \" & Lists!P26 &\"'!R18\")=1),\"Y\",\"\")","v":""},null,{"$f":"IF(INDIRECT(\"'SPR \" & Lists!P26 & \"'!P21\")>1,\"Y\",\"\")","v":""},{"$f":"IF(INDIRECT(\"'SPR \" & Lists!P26 & \"'!Q21\")>1,\"Y\",\"\")","v":""},{"$f":"IF(OR(INDIRECT(\"'SPR \" & Lists!P26 &\"'!P21\")>=6,INDIRECT(\"'SPR \" & Lists!P26 &\"'!R21\")=1),\"Y\",\"\")","v":""},null,{"$f":"IF(INDIRECT(\"'SPR \" & Lists!P26 & \"'!P24\")>1,\"Y\",\"\")","v":""},{"$f":"IF(INDIRECT(\"'SPR \" & Lists!P26 & \"'!Q24\")>1,\"Y\",\"\")","v":""},{"$f":"IF(OR(INDIRECT(\"'SPR \" & Lists!P26 &\"'!P24\")>=6,INDIRECT(\"'SPR \" & Lists!P26 &\"'!R24\")>=1,INDIRECT(\"'SPR \" & Lists!P26 &\"'!S24\")=1),\"Y\",\"\")","v":""},null,{"$f":"IF(INDIRECT(\"'SPR \" & Lists!P26 & \"'!P28\")>1,\"Y\",\"\")","v":""},{"$f":"IF(INDIRECT(\"'SPR \" & Lists!P26 & \"'!Q28\")>1,\"Y\",\"\")","v":""},{"$f":"IF(OR(INDIRECT(\"'SPR \" & Lists!P26 &\"'!P28\")>=6,INDIRECT(\"'SPR \" & Lists!P26 &\"'!R28\")>=1,INDIRECT(\"'SPR \" & Lists!P26 &\"'!S28\")=1),\"Y\",\"\")","v":""},null,{"$f":"IF(INDIRECT(\"'SPR \" & Lists!P26 & \"'!P34\")>0,\"Y\",\"\")","v":""}]
[27,null,0.4,null,0,"Situational Assessment",null,null,{"$f":"IF(INDIRECT(\"'THIRA Steps 1-3'!$C$117\")<>\"Click here to enter capability targets\",\"Y\",\"\")","v":"Y"},{"$f":"IF(OR('THIRA #27 Sit Assessment'!T$5>0,'THIRA #27 Sit Assessment'!T$8>0),\"Y\",\"\")","v":""},null,null,{"$f":"IF(INDIRECT(\"'SPR \" & Lists!P27 & \"'!P9\")>0,\"Y\",\"\")","v":""},null,{"$f":"IF(INDIRECT(\"'SPR \" & Lists!P27 & \"'!P14\")>1,\"Y\",\"\")","v":""},{"$f":"IF(INDIRECT(\"'SPR \" & Lists!P27 & \"'!Q14\")>1,\"Y\",\"\")","v":""},{"$f":"IF(OR(INDIRECT(\"'SPR \" & Lists!P27 &\"'!P14\")>=6,INDIRECT(\"'SPR \" & Lists!P27 &\"'!R14\")>=1,INDIRECT(\"'SPR \" & Lists!P27 &\"'!s14\")=1),\"Y\",\"\")","v":""},null,{"$f":"IF(INDIRECT(\"'SPR \" & Lists!P27 & \"'!P18\")>1,\"Y\",\"\")","v":""},{"$f":"IF(INDIRECT(\"'SPR \" & Lists!P27 & \"'!Q18\")>1,\"Y\",\"\")","v":""},{"$f":"IF(OR(INDIRECT(\"'SPR \" & Lists!P27 &\"'!P18\")>=6,INDIRECT(\"'SPR \" & Lists!P27 &\"'!R18\")=1),\"Y\",\"\")","v":""},null,{"$f":"IF(INDIRECT(\"'SPR \" & Lists!P27 & \"'!P21\")>1,\"Y\",\"\")","v":""},{"$f":"IF(INDIRECT(\"'SPR \" & Lists!P27 & \"'!Q21\")>1,\"Y\",\"\")","v":""},{"$f":"IF(OR(INDIRECT(\"'SPR \" & Lists!P27 &\"'!P21\")>=6,INDIRECT(\"'SPR \" & Lists!P27 &\"'!R21\")=1),\"Y\",\"\")","v":""},null,{"$f":"IF(INDIRECT(\"'SPR \" & Lists!P27 & \"'!P24\")>1,\"Y\",\"\")","v":""},{"$f":"IF(INDIRECT(\"'SPR \" & Lists!P27 & \"'!Q24\")>1,\"Y\",\"\")","v":""},{"$f":"IF(OR(INDIRECT(\"'SPR \" & Lists!P27 &\"'!P24\")>=6,INDIRECT(\"'SPR \" & Lists!P27 &\"'!R24\")>=1,INDIRECT(\"'SPR \" & Lists!P27 &\"'!S24\")=1),\"Y\",\"\")","v":""},null,{"$f":"IF(INDIRECT(\"'SPR \" & Lists!P27 & \"'!P28\")>1,\"Y\",\"\")","v":""},{"$f":"IF(INDIRECT(\"'SPR \" & Lists!P27 & \"'!Q28\")>1,\"Y\",\"\")","v":""},{"$f":"IF(OR(INDIRECT(\"'SPR \" & Lists!P27 &\"'!P28\")>=6,INDIRECT(\"'SPR \" & Lists!P27 &\"'!R28\")>=1,INDIRECT(\"'SPR \" & Lists!P27 &\"'!S28\")=1),\"Y\",\"\")","v":""},null,{"$f":"IF(INDIRECT(\"'SPR \" & Lists!P27 & \"'!P34\")>0,\"Y\",\"\")","v":""}]
[28,null,0.4,null,0,"Economic Recovery",null,null,{"$f":"IF(INDIRECT(\"'THIRA Steps 1-3'!$C$121\")<>\"Click here to enter capability targets\",\"Y\",\"\")","v":"Y"},{"$f":"IF(OR('THIRA #28 Econ Recovery'!T$5>0,'THIRA #28 Econ Recovery'!T$8>0),\"Y\",\"\")","v":""},null,null,{"$f":"IF(INDIRECT(\"'SPR \" & Lists!P28 & \"'!P9\")>0,\"Y\",\"\")","v":""},null,{"$f":"IF(INDIRECT(\"'SPR \" & Lists!P28 & \"'!P14\")>1,\"Y\",\"\")","v":""},{"$f":"IF(INDIRECT(\"'SPR \" & Lists!P28 & \"'!Q14\")>1,\"Y\",\"\")","v":""},{"$f":"IF(OR(INDIRECT(\"'SPR \" & Lists!P28 &\"'!P14\")>=6,INDIRECT(\"'SPR \" & Lists!P28 &\"'!R14\")>=1,INDIRECT(\"'SPR \" & Lists!P28 &\"'!s14\")=1),\"Y\",\"\")","v":""},null,{"$f":"IF(INDIRECT(\"'SPR \" & Lists!P28 & \"'!P18\")>1,\"Y\",\"\")","v":""},{"$f":"IF(INDIRECT(\"'SPR \" & Lists!P28 & \"'!Q18\")>1,\"Y\",\"\")","v":""},{"$f":"IF(OR(INDIRECT(\"'SPR \" & Lists!P28 &\"'!P18\")>=6,INDIRECT(\"'SPR \" & Lists!P28 &\"'!R18\")=1),\"Y\",\"\")","v":""},null,{"$f":"IF(INDIRECT(\"'SPR \" & Lists!P28 & \"'!P21\")>1,\"Y\",\"\")","v":""},{"$f":"IF(INDIRECT(\"'SPR \" & Lists!P28 & \"'!Q21\")>1,\"Y\",\"\")","v":""},{"$f":"IF(OR(INDIRECT(\"'SPR \" & Lists!P28 &\"'!P21\")>=6,INDIRECT(\"'SPR \" & Lists!P28 &\"'!R21\")=1),\"Y\",\"\")","v":""},null,{"$f":"IF(INDIRECT(\"'SPR \" & Lists!P28 & \"'!P24\")>1,\"Y\",\"\")","v":""},{"$f":"IF(INDIRECT(\"'SPR \" & Lists!P28 & \"'!Q24\")>1,\"Y\",\"\")","v":""},{"$f":"IF(OR(INDIRECT(\"'SPR \" & Lists!P28 &\"'!P24\")>=6,INDIRECT(\"'SPR \" & Lists!P28 &\"'!R24\")>=1,INDIRECT(\"'SPR \" & Lists!P28 &\"'!S24\")=1),\"Y\",\"\")","v":""},null,{"$f":"IF(INDIRECT(\"'SPR \" & Lists!P28 & \"'!P28\")>1,\"Y\",\"\")","v":""},{"$f":"IF(INDIRECT(\"'SPR \" & Lists!P28 & \"'!Q28\")>1,\"Y\",\"\")","v":""},{"$f":"IF(OR(INDIRECT(\"'SPR \" & Lists!P28 &\"'!P28\")>=6,INDIRECT(\"'SPR \" & Lists!P28 &\"'!R28\")>=1,INDIRECT(\"'SPR \" & Lists!P28 &\"'!S28\")=1),\"Y\",\"\")","v":""},null,{"$f":"IF(INDIRECT(\"'SPR \" & Lists!P28 & \"'!P34\")>0,\"Y\",\"\")","v":""}]
[29,null,0.4,null,0,"Health and Social Services",null,null,{"$f":"IF(INDIRECT(\"'THIRA Steps 1-3'!$C$125\")<>\"Click here to enter capability targets\",\"Y\",\"\")","v":"Y"},{"$f":"IF(OR('THIRA #29 Health Soc Services'!T$5>0,'THIRA #29 Health Soc Services'!T$8>0),\"Y\",\"\")","v":""},null,null,{"$f":"IF(INDIRECT(\"'SPR \" & Lists!P29 & \"'!P9\")>0,\"Y\",\"\")","v":""},null,{"$f":"IF(INDIRECT(\"'SPR \" & Lists!P29 & \"'!P14\")>1,\"Y\",\"\")","v":""},{"$f":"IF(INDIRECT(\"'SPR \" & Lists!P29 & \"'!Q14\")>1,\"Y\",\"\")","v":""},{"$f":"IF(OR(INDIRECT(\"'SPR \" & Lists!P29 &\"'!P14\")>=6,INDIRECT(\"'SPR \" & Lists!P29 &\"'!R14\")>=1,INDIRECT(\"'SPR \" & Lists!P29 &\"'!s14\")=1),\"Y\",\"\")","v":""},null,{"$f":"IF(INDIRECT(\"'SPR \" & Lists!P29 & \"'!P18\")>1,\"Y\",\"\")","v":""},{"$f":"IF(INDIRECT(\"'SPR \" & Lists!P29 & \"'!Q18\")>1,\"Y\",\"\")","v":""},{"$f":"IF(OR(INDIRECT(\"'SPR \" & Lists!P29 &\"'!P18\")>=6,INDIRECT(\"'SPR \" & Lists!P29 &\"'!R18\")=1),\"Y\",\"\")","v":""},null,{"$f":"IF(INDIRECT(\"'SPR \" & Lists!P29 & \"'!P21\")>1,\"Y\",\"\")","v":""},{"$f":"IF(INDIRECT(\"'SPR \" & Lists!P29 & \"'!Q21\")>1,\"Y\",\"\")","v":""},{"$f":"IF(OR(INDIRECT(\"'SPR \" & Lists!P29 &\"'!P21\")>=6,INDIRECT(\"'SPR \" & Lists!P29 &\"'!R21\")=1),\"Y\",\"\")","v":""},null,{"$f":"IF(INDIRECT(\"'SPR \" & Lists!P29 & \"'!P24\")>1,\"Y\",\"\")","v":""},{"$f":"IF(INDIRECT(\"'SPR \" & Lists!P29 & \"'!Q24\")>1,\"Y\",\"\")","v":""},{"$f":"IF(OR(INDIRECT(\"'SPR \" & Lists!P29 &\"'!P24\")>=6,INDIRECT(\"'SPR \" & Lists!P29 &\"'!R24\")>=1,INDIRECT(\"'SPR \" & Lists!P29 &\"'!S24\")=1),\"Y\",\"\")","v":""},null,{"$f":"IF(INDIRECT(\"'SPR \" & Lists!P29 & \"'!P28\")>1,\"Y\",\"\")","v":""},{"$f":"IF(INDIRECT(\"'SPR \" & Lists!P29 & \"'!Q28\")>1,\"Y\",\"\")","v":""},{"$f":"IF(OR(INDIRECT(\"'SPR \" & Lists!P29 &\"'!P28\")>=6,INDIRECT(\"'SPR \" & Lists!P29 &\"'!R28\")>=1,INDIRECT(\"'SPR \" & Lists!P29 &\"'!S28\")=1),\"Y\",\"\")","v":""},null,{"$f":"IF(INDIRECT(\"'SPR \" & Lists!P29 & \"'!P34\")>0,\"Y\",\"\")","v":""}]
[30,null,0.4,null,0,"Housing",null,null,{"$f":"IF(INDIRECT(\"'THIRA Steps 1-3'!$C$129\")<>\"Click here to enter capability targets\",\"Y\",\"\")","v":"Y"},{"$f":"IF(OR('THIRA #30 Housing'!T$5>0,'THIRA #30 Housing'!T$8>0),\"Y\",\"\")","v":""},null,null,{"$f":"IF(INDIRECT(\"'SPR \" & Lists!P30 & \"'!P9\")>0,\"Y\",\"\")","v":""},null,{"$f":"IF(INDIRECT(\"'SPR \" & Lists!P30 & \"'!P14\")>1,\"Y\",\"\")","v":""},{"$f":"IF(INDIRECT(\"'SPR \" & Lists!P30 & \"'!Q14\")>1,\"Y\",\"\")","v":""},{"$f":"IF(OR(INDIRECT(\"'SPR \" & Lists!P30 &\"'!P14\")>=6,INDIRECT(\"'SPR \" & Lists!P30 &\"'!R14\")>=1,INDIRECT(\"'SPR \" & Lists!P30 &\"'!s14\")=1),\"Y\",\"\")","v":""},null,{"$f":"IF(INDIRECT(\"'SPR \" & Lists!P30 & \"'!P18\")>1,\"Y\",\"\")","v":""},{"$f":"IF(INDIRECT(\"'SPR \" & Lists!P30 & \"'!Q18\")>1,\"Y\",\"\")","v":""},{"$f":"IF(OR(INDIRECT(\"'SPR \" & Lists!P30 &\"'!P18\")>=6,INDIRECT(\"'SPR \" & Lists!P30 &\"'!R18\")=1),\"Y\",\"\")","v":""},null,{"$f":"IF(INDIRECT(\"'SPR \" & Lists!P30 & \"'!P21\")>1,\"Y\",\"\")","v":""},{"$f":"IF(INDIRECT(\"'SPR \" & Lists!P30 & \"'!Q21\")>1,\"Y\",\"\")","v":""},{"$f":"IF(OR(INDIRECT(\"'SPR \" & Lists!P30 &\"'!P21\")>=6,INDIRECT(\"'SPR \" & Lists!P30 &\"'!R21\")=1),\"Y\",\"\")","v":""},null,{"$f":"IF(INDIRECT(\"'SPR \" & Lists!P30 & \"'!P24\")>1,\"Y\",\"\")","v":""},{"$f":"IF(INDIRECT(\"'SPR \" & Lists!P30 & \"'!Q24\")>1,\"Y\",\"\")","v":""},{"$f":"IF(OR(INDIRECT(\"'SPR \" & Lists!P30 &\"'!P24\")>=6,INDIRECT(\"'SPR \" & Lists!P30 &\"'!R24\")>=1,INDIRECT(\"'SPR \" & Lists!P30 &\"'!S24\")=1),\"Y\",\"\")","v":""},null,{"$f":"IF(INDIRECT(\"'SPR \" & Lists!P30 & \"'!P28\")>1,\"Y\",\"\")","v":""},{"$f":"IF(INDIRECT(\"'SPR \" & Lists!P30 & \"'!Q28\")>1,\"Y\",\"\")","v":""},{"$f":"IF(OR(INDIRECT(\"'SPR \" & Lists!P30 &\"'!P28\")>=6,INDIRECT(\"'SPR \" & Lists!P30 &\"'!R28\")>=1,INDIRECT(\"'SPR \" & Lists!P30 &\"'!S28\")=1),\"Y\",\"\")","v":""},null,{"$f":"IF(INDIRECT(\"'SPR \" & Lists!P30 & \"'!P34\")>0,\"Y\",\"\")","v":""}]
[31,null,0.4,null,0,"Natural and Cultural Resources",null,null,{"$f":"IF(INDIRECT(\"'THIRA Steps 1-3'!$C$133\")<>\"Click here to enter capability targets\",\"Y\",\"\")","v":"Y"},{"$f":"IF(OR('THIRA #31 Nat Cult Resources'!T$5>0,'THIRA #31 Nat Cult Resources'!T$8>0),\"Y\",\"\")","v":""},null,null,{"$f":"IF(INDIRECT(\"'SPR \" & Lists!P31 & \"'!P9\")>0,\"Y\",\"\")","v":""},null,{"$f":"IF(INDIRECT(\"'SPR \" & Lists!P31 & \"'!P14\")>1,\"Y\",\"\")","v":""},{"$f":"IF(INDIRECT(\"'SPR \" & Lists!P31 & \"'!Q14\")>1,\"Y\",\"\")","v":""},{"$f":"IF(OR(INDIRECT(\"'SPR \" & Lists!P31 &\"'!P14\")>=6,INDIRECT(\"'SPR \" & Lists!P31 &\"'!R14\")>=1,INDIRECT(\"'SPR \" & Lists!P31 &\"'!s14\")=1),\"Y\",\"\")","v":""},null,{"$f":"IF(INDIRECT(\"'SPR \" & Lists!P31 & \"'!P18\")>1,\"Y\",\"\")","v":""},{"$f":"IF(INDIRECT(\"'SPR \" & Lists!P31 & \"'!Q18\")>1,\"Y\",\"\")","v":""},{"$f":"IF(OR(INDIRECT(\"'SPR \" & Lists!P31 &\"'!P18\")>=6,INDIRECT(\"'SPR \" & Lists!P31 &\"'!R18\")=1),\"Y\",\"\")","v":""},null,{"$f":"IF(INDIRECT(\"'SPR \" & Lists!P31 & \"'!P21\")>1,\"Y\",\"\")","v":""},{"$f":"IF(INDIRECT(\"'SPR \" & Lists!P31 & \"'!Q21\")>1,\"Y\",\"\")","v":""},{"$f":"IF(OR(INDIRECT(\"'SPR \" & Lists!P31 &\"'!P21\")>=6,INDIRECT(\"'SPR \" & Lists!P31 &\"'!R21\")=1),\"Y\",\"\")","v":""},null,{"$f":"IF(INDIRECT(\"'SPR \" & Lists!P31 & \"'!P24\")>1,\"Y\",\"\")","v":""},{"$f":"IF(INDIRECT(\"'SPR \" & Lists!P31 & \"'!Q24\")>1,\"Y\",\"\")","v":""},{"$f":"IF(OR(INDIRECT(\"'SPR \" & Lists!P31 &\"'!P24\")>=6,INDIRECT(\"'SPR \" & Lists!P31 &\"'!R24\")>=1,INDIRECT(\"'SPR \" & Lists!P31 &\"'!S24\")=1),\"Y\",\"\")","v":""},null,{"$f":"IF(INDIRECT(\"'SPR \" & Lists!P31 & \"'!P28\")>1,\"Y\",\"\")","v":""},{"$f":"IF(INDIRECT(\"'SPR \" & Lists!P31 & \"'!Q28\")>1,\"Y\",\"\")","v":""},{"$f":"IF(OR(INDIRECT(\"'SPR \" & Lists!P31 &\"'!P28\")>=6,INDIRECT(\"'SPR \" & Lists!P31 &\"'!R28\")>=1,INDIRECT(\"'SPR \" & Lists!P31 &\"'!S28\")=1),\"Y\",\"\")","v":""},null,{"$f":"IF(INDIRECT(\"'SPR \" & Lists!P31 & \"'!P34\")>0,\"Y\",\"\")","v":""}]
[null,null,null,null,null,null,{"$f":"G5","v":""},{"$f":"H5","v":"Y"},null,null,{"$f":"K5","v":""}]

{"sheet":"Developer Notes","index":4,"n_rows":15,"n_cols":1,"rows_kept":15,"cut":false,"hidden":true,"merged":[]}
["Add macro for additional NIMS resources"]
["Add macro for additional other resources"]
["What does save do on the THIRA/SPR sheet? Validate?"]
["Refine opening slides. Resize and rethink button logic and move any buttons to top."]
[]
["Heat Map"]
["Fill in remaining NIMS types; create worksheets and validation"]
["Run macro on TH save that validates category and TH"]
[]
["Adjust Save macro to add formula on desired outcome side"]
[]
["Assessment Save button write text box gaps to column R"]
[]
[]
["Write macro to autosize row. (copy contents to dummy cell, set row height to auto, detect row height, delete and apply height)"]

{"sheet":"THIRA #1 Planning","index":5,"n_rows":16,"n_cols":20,"rows_kept":16,"cut":false,"hidden":false,"merged":[[11,3,15,3],[2,3,2,7],[3,3,3,7],[3,13,3,14],[5,3,5,7],[6,3,10,3],[12,4,12,5],[13,4,13,5],[15,4,15,5],[14,4,14,5],[11,4,11,5]]}
[21]
[]
[{"$f":"MAX(B:B)","v":1},null,null,"Capability Target",null,null,null,null,null,null,null,null,null,null,null,null,null,null,"# NIMS Rows",{"$f":"MAX(J:J)","v":4}]
[null,{"$f":"ROW()-3","v":1},null,{"$f":"INDIRECT(\"'THIRA Steps 1-3'!$C$13\")","v":0},null,null,null,null,null,null,null,null,null,null,null,null,null,null,"# NIMS Started",{"$f":"SUM(K:K)","v":0}]
[null,null,null,null,null,null,null,null,null,null,null,null,null,null,null,null,null,null,"# NIMS Complete",{"$f":"SUM(L:L)","v":0}]
[null,null,null,"Resource Requirements",null,null,null,null,null,null,null,null,null,null,null,null,null,null,"# Other Rows",{"$f":"MAX(M:M)","v":4}]
[null,null,null,"NIMS-typed Resources","Category","Resource","Type","Number Required",null,null,null,null,null,null,null,null,null,null,"# Other Rows",{"$f":"SUM(N:N)","v":0}]
[{"$f":"LOOKUP(E8, Lists!A$236:A$245, Lists!B$236:B$245)","v":{"$error":"#N/A"}},null,{"$f":"VLOOKUP(F8, INDIRECT(\"Lists!$A$140:$B$\" & Lists!$C$245), 2, FALSE)","v":{"$error":"#N/A"}},null,null,null,null,null,null,1,{"$f":"IF(OR(E8<>\"\", F8<>\"\", G8<>\"\", H8<>\"\"), 1, 0)","v":0},{"$f":"IF(AND(E8<>\"\", F8<>\"\", G8<>\"\", H8<>\"\"), 1, 0)","v":0},null,null,null,null,null,null,"# Other",{"$f":"SUM(O:O)","v":0}]
[{"$f":"LOOKUP(E9, Lists!A$236:A$245, Lists!B$236:B$245)","v":{"$error":"#N/A"}},null,{"$f":"VLOOKUP(F9, INDIRECT(\"Lists!$A$140:$B$\" & Lists!$C$245), 2, FALSE)","v":{"$error":"#N/A"}},null,null,null,null,null,null,{"$f":"J8+1","v":2},{"$f":"IF(OR(E9<>\"\", F9<>\"\", G9<>\"\", H9<>\"\"), 1, 0)","v":0},{"$f":"IF(AND(E9<>\"\", F9<>\"\", G9<>\"\", H9<>\"\"), 1, 0)","v":0}]
[{"$f":"LOOKUP(E10, Lists!A$236:A$245, Lists!B$236:B$245)","v":{"$error":"#N/A"}},null,{"$f":"VLOOKUP(F10, INDIRECT(\"Lists!$A$140:$B$\" & Lists!$C$245), 2, FALSE)","v":{"$error":"#N/A"}},null,null,null,null,null,null,{"$f":"J9+1","v":3},{"$f":"IF(OR(E10<>\"\", F10<>\"\", G10<>\"\", H10<>\"\"), 1, 0)","v":0},{"$f":"IF(AND(E10<>\"\", F10<>\"\", G10<>\"\", H10<>\"\"), 1, 0)","v":0}]
[{"$f":"LOOKUP(E11, Lists!A$236:A$245, Lists!B$236:B$245)","v":{"$error":"#N/A"}},null,{"$f":"VLOOKUP(F11, INDIRECT(\"Lists!$A$140:$B$\" & Lists!$C$245), 2, FALSE)","v":{"$error":"#N/A"}},null,null,null,null,null,null,{"$f":"J10+1","v":4},{"$f":"IF(OR(E11<>\"\", F11<>\"\", G11<>\"\", H11<>\"\"), 1, 0)","v":0},{"$f":"IF(AND(E11<>\"\", F11<>\"\", G11<>\"\", H11<>\"\"), 1, 0)","v":0}]
[null,null,null,"Other\nResources","Resource\n(Example:  Case Management Team)",null,"Team/POETE\n","Number Required\n"]
[null,null,null,null,null,null,null,null,null,null,null,null,1,{"$f":"IF(OR(E13<>\"\", H13<>\"\"), 1, 0)","v":0},{"$f":"IF(AND(E13<>\"\", H13<>\"\"), 1, 0)","v":0}]
[null,null,null,null,null,null,null,null,null,null,null,null,{"$f":"M13+1","v":2},{"$f":"IF(OR(E14<>\"\", H14<>\"\"), 1, 0)","v":0},{"$f":"IF(AND(E14<>\"\", H14<>\"\"), 1, 0)","v":0}]
[null,null,null,null,null,null,null,null,null,null,null,null,{"$f":"M14+1","v":3},{"$f":"IF(OR(E15<>\"\", H15<>\"\"), 1, 0)","v":0},{"$f":"IF(AND(E15<>\"\", H15<>\"\"), 1, 0)","v":0}]
[null,null,null,null,null,null,null,null,null,null,null,null,{"$f":"M15+1","v":4},{"$f":"IF(OR(E16<>\"\", H16<>\"\"), 1, 0)","v":0},{"$f":"IF(AND(E16<>\"\", H16<>\"\"), 1, 0)","v":0}]

{"sheet":"SPR #1 Planning","index":6,"n_rows":41,"n_cols":19,"rows_kept":41,"cut":false,"hidden":true,"merged":[[40,3,40,7],[22,3,24,3],[24,4,24,7],[33,3,33,7],[12,3,14,3],[14,4,14,7],[16,3,17,3],[19,3,20,3],[30,3,30,7],[31,3,31,7],[7,3,7,7],[5,3,5,7],[2,3,2,7],[3,3,3,7],[26,3,28,3],[28,4,28,7],[8,4,8,7],[9,4,9,7],[10,4,10,7]]}
[21]
[]
[{"$f":"MAX(B:B)","v":1},null,null,"Capability Target"]
[null,{"$f":"ROW()-3","v":1},null,{"$f":"INDIRECT(\"'THIRA Steps 1-3'!$C$13\")","v":0}]
[]
[null,null,null,"Capability Assessment"]
[]
[null,null,null,"Priority"]
[null,null,null,null,"Relative to the other core capabilities, efforts to build and/or sustain this core capability are of high importance to my jurisdiction’s preparedness activities.",null,null,null,null,null,null,null,null,null,null,0]
[null,null,null,null,"Relative to the other core capabilities, efforts to build and/or sustain this core capability are of medium importance to my jurisdiction’s preparedness activities."]
[null,null,null,null,"Relative to the other core capabilities, efforts to build and/or sustain this core capability are of low importance to my jurisdiction’s preparedness activities."]
[]
[null,null,null,"Planning","Rating\nInternal Capability","Rating\nInternal Capability + Mutual Aid","Gap Description","Recent Advances (optional)"]
[null,null,null,null,{"$f":"LOOKUP(P14, Lists!$C$2:$C$8, Lists!D2:D8)","v":"No selection made"},null,null,null,null,null,null,null,null,null,null,1,1,{"$f":"COUNTIF(I15:AC15, \"TRUE\")","v":0},0]
[null,null,null,null,"Gap Description\nWhich of the following best represent your community's primary planning gaps?",null,null,null,false,false,false,false,false,false,false,false,false]
[]
[null,null,null,"Organization","Rating\nInternal Capability","Rating\nInternal Capability + Mutual Aid","Gap Description","Recent Advances (optional)"]
[null,null,null,null,{"$f":"LOOKUP(P18, Lists!$C$2:$C$8, Lists!E2:E8)","v":"No selection made"},{"$f":"LOOKUP(Q18, Lists!$C$2:$C$8, Lists!E2:E8)","v":"No selection made"},null,null,null,null,null,null,null,null,null,1,1,0]
[]
[null,null,null,"Equipment","Rating\nInternal Capability","Rating\nInternal Capability + Mutual Aid","Gap Description","Recent Advances (optional)"]
[null,null,null,null,{"$f":"LOOKUP(P21, Lists!$C$2:$C$8, Lists!F2:F8)","v":"No selection made"},{"$f":"LOOKUP(Q21, Lists!$C$2:$C$8, Lists!F2:F8)","v":"No selection made"},null,null,null,null,null,null,null,null,null,1,1,0]
[]
[null,null,null,"Training","Rating\nInternal Capability","Rating\nInternal Capability + Mutual Aid","Gap Description","Recent Advances (optional)"]
[null,null,null,null,{"$f":"LOOKUP(P24, Lists!$C$2:$C$8, Lists!G2:G8)","v":"No selection made"},{"$f":"LOOKUP(Q24, Lists!$C$2:$C$8, Lists!G2:G8)","v":"No selection made"},null,null,null,null,null,null,null,null,null,1,1,{"$f":"COUNTIF(I25:S25, \"TRUE\")","v":0},0]
[null,null,null,null,"Gap Description\nWhich of the following best represent your community's primary training gaps?",null,null,null,false,false,false,false,false,false,false,false,false,false,false]
[]
[null,null,null,"Exercises","Rating\nInternal Capability","Rating\nInternal Capability + Mutual Aid","Gap Description","Recent Advances (optional)"]
[null,null,null,null,{"$f":"LOOKUP(P28, Lists!$C$2:$C$8, Lists!H2:H8)","v":"No selection made"},{"$f":"LOOKUP(Q28, Lists!$C$2:$C$8, Lists!H2:H8)","v":"No selection made"},null,null,null,null,null,null,null,null,null,1,1,{"$f":"COUNTIF(I29:AA29, \"TRUE\")","v":0},0]
[null,null,null,null,"Gap Description\nWhich of the following best represent your community's primary exercises gaps?",null,null,null,false,false,false,false,false,false,false,false]
[]
[null,null,null,"Assessment Corroboration"]
[null,null,null,null,null,null,null,null,{"$f":"IF(J32=2,TRUE,IF(J32=3,FALSE,\"\"))","v":""},1]
[]
[null,null,null,"Responsibility for Filling Gap",null,null,null,null,null,null,null,null,null,null,null,0]
[]
[]
[]
[]
[]
[]
[null,null,null,"Journal Notes/Process Narrative (optional)"]

{"sheet":"THIRA #2 Public Info Warn","index":7,"n_rows":17,"n_cols":20,"rows_kept":17,"cut":false,"hidden":false,"merged":[[16,4,16,5],[2,3,2,7],[3,3,3,7],[3,13,3,14],[5,3,5,7],[6,3,11,3],[12,3,16,3],[12,4,12,5],[13,4,13,5],[14,4,14,5],[15,4,15,5]]}
[21]
[]
[{"$f":"MAX(B:B)","v":1},null,null,"Capability Target",null,null,null,null,null,null,null,null,null,null,null,null,null,null,"# NIMS Rows",{"$f":"MAX(J:J)","v":5}]
[null,{"$f":"ROW()-3","v":1},null,{"$f":"INDIRECT(\"'THIRA Steps 1-3'!$C$17\")","v":0},null,null,null,null,null,null,null,null,null,null,null,null,null,null,"# NIMS Started",{"$f":"SUM(K:K)","v":0}]
[null,null,null,null,null,null,null,null,null,null,null,null,null,null,null,null,null,null,"# NIMS Complete",{"$f":"SUM(L:L)","v":0}]
[null,null,null,"Resource Requirements",null,null,null,null,null,null,null,null,null,null,null,null,null,null,"# Other Rows",{"$f":"MAX(M:M)","v":4}]
[null,null,null,"NIMS-typed Resources","Category","Resource","Type","Number Required",null,null,null,null,null,null,null,null,null,null,"# Other Rows",{"$f":"SUM(N:N)","v":0}]
[{"$f":"LOOKUP(E8, Lists!A$236:A$245, Lists!B$236:B$245)","v":{"$error":"#N/A"}},null,{"$f":"VLOOKUP(F8, INDIRECT(\"Lists!$A$140:$B$\" & Lists!$C$245), 2, FALSE)","v":{"$error":"#N/A"}},null,null,null,null,null,null,1,{"$f":"IF(OR(E8<>\"\", F8<>\"\", G8<>\"\", H8<>\"\"), 1, 0)","v":0},{"$f":"IF(AND(E8<>\"\", F8<>\"\", G8<>\"\", H8<>\"\"), 1, 0)","v":0},null,null,null,null,null,null,"# Other",{"$f":"SUM(O:O)","v":0}]
[{"$f":"LOOKUP(E9, Lists!A$236:A$245, Lists!B$236:B$245)","v":{"$error":"#N/A"}},null,{"$f":"VLOOKUP(F9, INDIRECT(\"Lists!$A$140:$B$\" & Lists!$C$245), 2, FALSE)","v":{"$error":"#N/A"}},null,null,null,null,null,null,{"$f":"J8+1","v":2},{"$f":"IF(OR(E9<>\"\", F9<>\"\", G9<>\"\", H9<>\"\"), 1, 0)","v":0},{"$f":"IF(AND(E9<>\"\", F9<>\"\", G9<>\"\", H9<>\"\"), 1, 0)","v":0}]
[{"$f":"LOOKUP(E10, Lists!A$236:A$245, Lists!B$236:B$245)","v":{"$error":"#N/A"}},null,{"$f":"VLOOKUP(F10, INDIRECT(\"Lists!$A$140:$B$\" & Lists!$C$245), 2, FALSE)","v":{"$error":"#N/A"}},null,null,null,null,null,null,{"$f":"J9+1","v":3},{"$f":"IF(OR(E10<>\"\", F10<>\"\", G10<>\"\", H10<>\"\"), 1, 0)","v":0},{"$f":"IF(AND(E10<>\"\", F10<>\"\", G10<>\"\", H10<>\"\"), 1, 0)","v":0}]
[{"$f":"LOOKUP(E11, Lists!A$236:A$245, Lists!B$236:B$245)","v":{"$error":"#N/A"}},null,{"$f":"VLOOKUP(F11, INDIRECT(\"Lists!$A$140:$B$\" & Lists!$C$245), 2, FALSE)","v":{"$error":"#N/A"}},null,null,null,null,null,null,{"$f":"J10+1","v":4},{"$f":"IF(OR(E11<>\"\", F11<>\"\", G11<>\"\", H11<>\"\"), 1, 0)","v":0},{"$f":"IF(AND(E11<>\"\", F11<>\"\", G11<>\"\", H11<>\"\"), 1, 0)","v":0}]
[{"$f":"LOOKUP(E12, Lists!A$236:A$245, Lists!B$236:B$245)","v":{"$error":"#N/A"}},null,{"$f":"VLOOKUP(F12, INDIRECT(\"Lists!$A$140:$B$\" & Lists!$C$245), 2, FALSE)","v":{"$error":"#N/A"}},null,null,null,null,null,null,5,0,0]
[null,null,null,"Other\nResources","Resource\n(Example:  Case Management Team)",null,"Team/POETE\n","Number Required\n"]
[null,null,null,null,null,null,null,null,null,null,null,null,1,{"$f":"IF(OR(E14<>\"\", H14<>\"\"), 1, 0)","v":0},{"$f":"IF(AND(E14<>\"\", H14<>\"\"), 1, 0)","v":0}]
[null,null,null,null,null,null,null,null,null,null,null,null,{"$f":"M14+1","v":2},{"$f":"IF(OR(E15<>\"\", H15<>\"\"), 1, 0)","v":0},{"$f":"IF(AND(E15<>\"\", H15<>\"\"), 1, 0)","v":0}]
[null,null,null,null,null,null,null,null,null,null,null,null,{"$f":"M15+1","v":3},{"$f":"IF(OR(E16<>\"\", H16<>\"\"), 1, 0)","v":0},{"$f":"IF(AND(E16<>\"\", H16<>\"\"), 1, 0)","v":0}]
[null,null,null,null,null,null,null,null,null,null,null,null,{"$f":"M16+1","v":4},{"$f":"IF(OR(E17<>\"\", H17<>\"\"), 1, 0)","v":0},{"$f":"IF(AND(E17<>\"\", H17<>\"\"), 1, 0)","v":0}]

{"sheet":"SPR #2 Public Info Warn","index":8,"n_rows":41,"n_cols":19,"rows_kept":41,"cut":false,"hidden":true,"merged":[[2,3,2,7],[3,3,3,7],[5,3,5,7],[7,3,7,7],[12,3,14,3],[14,4,14,7],[8,4,8,7],[9,4,9,7],[10,4,10,7],[30,3,30,7],[31,3,31,7],[33,3,33,7],[40,3,40,7],[16,3,17,3],[19,3,20,3],[22,3,24,3],[24,4,24,7],[26,3,28,3],[28,4,28,7]]}
[21]
[]
[{"$f":"MAX(B:B)","v":1},null,null,"Capability Target"]
[null,{"$f":"ROW()-3","v":1},null,{"$f":"INDIRECT(\"'THIRA Steps 1-3'!$C$17\")","v":0}]
[]
[null,null,null,"Capability Assessment"]
[]
[null,null,null,"Priority"]
[null,null,null,null,"Relative to the other core capabilities, efforts to build and/or sustain this core capability are of high importance to my jurisdiction’s preparedness activities.",null,null,null,null,null,null,null,null,null,null,0]
[null,null,null,null,"Relative to the other core capabilities, efforts to build and/or sustain this core capability are of medium importance to my jurisdiction’s preparedness activities."]
[null,null,null,null,"Relative to the other core capabilities, efforts to build and/or sustain this core capability are of low importance to my jurisdiction’s preparedness activities."]
[]
[null,null,null,"Planning","Rating\nInternal Capability","Rating\nInternal Capability + Mutual Aid","Gap Description","Recent Advances (optional)"]
[null,null,null,null,{"$f":"LOOKUP(P14, Lists!$C$2:$C$8, Lists!D2:D8)","v":"No selection made"},{"$f":"LOOKUP(Q14, Lists!$C$2:$C$8, Lists!D2:D8)","v":"No selection made"},null,null,null,null,null,null,null,null,null,1,1,{"$f":"COUNTIF(I15:AC15, \"TRUE\")","v":0},0]
[null,null,null,null,"Gap Description\nWhich of the following best represent your community's primary planning gaps?",null,null,null,false,false,false,false,false,false,false,false,false]
[]
[null,null,null,"Organization","Rating\nInternal Capability","Rating\nInternal Capability + Mutual Aid","Gap Description","Recent Advances (optional)"]
[null,null,null,null,{"$f":"LOOKUP(P18, Lists!$C$2:$C$8, Lists!E2:E8)","v":"No selection made"},{"$f":"LOOKUP(Q18, Lists!$C$2:$C$8, Lists!E2:E8)","v":"No selection made"},null,null,null,null,null,null,null,null,null,1,1,0]
[]
[null,null,null,"Equipment","Rating\nInternal Capability","Rating\nInternal Capability + Mutual Aid","Gap Description","Recent Advances (optional)"]
[null,null,null,null,{"$f":"LOOKUP(P21, Lists!$C$2:$C$8, Lists!F2:F8)","v":"No selection made"},{"$f":"LOOKUP(Q21, Lists!$C$2:$C$8, Lists!F2:F8)","v":"No selection made"},null,null,null,null,null,null,null,null,null,1,1,0]
[]
[null,null,null,"Training","Rating\nInternal Capability","Rating\nInternal Capability + Mutual Aid","Gap Description","Recent Advances (optional)"]
[null,null,null,null,{"$f":"LOOKUP(P24, Lists!$C$2:$C$8, Lists!G2:G8)","v":"No selection made"},{"$f":"LOOKUP(Q24, Lists!$C$2:$C$8, Lists!G2:G8)","v":"No selection made"},null,null,null,null,null,null,null,null,null,1,1,{"$f":"COUNTIF(I25:S25, \"TRUE\")","v":0},0]
[null,null,null,null,"Gap Description\nWhich of the following best represent your community's primary training gaps?",null,null,null,false,false,false,false,false,false,false,false,false,false,false]
[]
[null,null,null,"Exercises","Rating\nInternal Capability","Rating\nInternal Capability + Mutual Aid","Gap Description","Recent Advances (optional)"]
[null,null,null,null,{"$f":"LOOKUP(P28, Lists!$C$2:$C$8, Lists!H2:H8)","v":"No selection made"},{"$f":"LOOKUP(Q28, Lists!$C$2:$C$8, Lists!H2:H8)","v":"No selection made"},null,null,null,null,null,null,null,null,null,1,1,{"$f":"COUNTIF(I29:AA29, \"TRUE\")","v":0},0]
[null,null,null,null,"Gap Description\nWhich of the following best represent your community's primary exercises gaps?",null,null,null,false,false,false,false,false,false,false,false]
[]
[null,null,null,"Assessment Corroboration"]
[null,null,null,null,null,null,null,null,{"$f":"IF(J32=2,TRUE,IF(J32=3,FALSE,\"\"))","v":""},1]
[]
[null,null,null,"Responsibility for Filling Gap",null,null,null,null,null,null,null,null,null,null,null,0]
[]
[]
[]
[]
[]
[]
[null,null,null,"Journal Notes/Process Narrative (optional)"]

{"sheet":"THIRA #3 Op Coord","index":9,"n_rows":16,"n_cols":20,"rows_kept":16,"cut":false,"hidden":false,"merged":[[15,4,15,5],[2,3,2,7],[3,3,3,7],[3,13,3,14],[5,3,5,7],[6,3,10,3],[11,3,15,3],[11,4,11,5],[12,4,12,5],[13,4,13,5],[14,4,14,5]]}
[21]
[]
[{"$f":"MAX(B:B)","v":1},null,null,"Capability Target",null,null,null,null,null,null,null,null,null,null,null,null,null,null,"# NIMS Rows",{"$f":"MAX(J:J)","v":4}]
[null,{"$f":"ROW()-3","v":1},null,{"$f":"INDIRECT(\"'THIRA Steps 1-3'!$C$21\")","v":0},null,null,null,null,null,null,null,null,null,null,null,null,null,null,"# NIMS Started",{"$f":"SUM(K:K)","v":0}]
[null,null,null,null,null,null,null,null,null,null,null,null,null,null,null,null,null,null,"# NIMS Complete",{"$f":"SUM(L:L)","v":0}]
[null,null,null,"Resource Requirements",null,null,null,null,null,null,null,null,null,null,null,null,null,null,"# Other Rows",{"$f":"MAX(M:M)","v":4}]
[null,null,null,"NIMS-typed Resources","Category","Resource","Type","Number Required",null,null,null,null,null,null,null,null,null,null,"# Other Rows",{"$f":"SUM(N:N)","v":0}]
[{"$f":"LOOKUP(E8, Lists!A$236:A$245, Lists!B$236:B$245)","v":{"$error":"#N/A"}},null,{"$f":"VLOOKUP(F8, INDIRECT(\"Lists!$A$140:$B$\" & Lists!$C$245), 2, FALSE)","v":{"$error":"#N/A"}},null,null,null,null,null,null,1,{"$f":"IF(OR(E8<>\"\", F8<>\"\", G8<>\"\", H8<>\"\"), 1, 0)","v":0},{"$f":"IF(AND(E8<>\"\", F8<>\"\", G8<>\"\", H8<>\"\"), 1, 0)","v":0},null,null,null,null,null,null,"# Other",{"$f":"SUM(O:O)","v":0}]
[{"$f":"LOOKUP(E9, Lists!A$236:A$245, Lists!B$236:B$245)","v":{"$error":"#N/A"}},null,{"$f":"VLOOKUP(F9, INDIRECT(\"Lists!$A$140:$B$\" & Lists!$C$245), 2, FALSE)","v":{"$error":"#N/A"}},null,null,null,null,null,null,{"$f":"J8+1","v":2},{"$f":"IF(OR(E9<>\"\", F9<>\"\", G9<>\"\", H9<>\"\"), 1, 0)","v":0},{"$f":"IF(AND(E9<>\"\", F9<>\"\", G9<>\"\", H9<>\"\"), 1, 0)","v":0}]
[{"$f":"LOOKUP(E10, Lists!A$236:A$245, Lists!B$236:B$245)","v":{"$error":"#N/A"}},null,{"$f":"VLOOKUP(F10, INDIRECT(\"Lists!$A$140:$B$\" & Lists!$C$245), 2, FALSE)","v":{"$error":"#N/A"}},null,null,null,null,null,null,{"$f":"J9+1","v":3},{"$f":"IF(OR(E10<>\"\", F10<>\"\", G10<>\"\", H10<>\"\"), 1, 0)","v":0},{"$f":"IF(AND(E10<>\"\", F10<>\"\", G10<>\"\", H10<>\"\"), 1, 0)","v":0}]
[{"$f":"LOOKUP(E11, Lists!A$236:A$245, Lists!B$236:B$245)","v":{"$error":"#N/A"}},null,{"$f":"VLOOKUP(F11, INDIRECT(\"Lists!$A$140:$B$\" & Lists!$C$245), 2, FALSE)","v":{"$error":"#N/A"}},null,null,null,null,null,null,{"$f":"J10+1","v":4},{"$f":"IF(OR(E11<>\"\", F11<>\"\", G11<>\"\", H11<>\"\"), 1, 0)","v":0},{"$f":"IF(AND(E11<>\"\", F11<>\"\", G11<>\"\", H11<>\"\"), 1, 0)","v":0}]
[null,null,null,"Other\nResources","Resource\n(Example:  Case Management Team)",null,"Team/POETE\n","Number Required\n"]
[null,null,null,null,null,null,null,null,null,null,null,null,1,{"$f":"IF(OR(E13<>\"\", H13<>\"\"), 1, 0)","v":0},{"$f":"IF(AND(E13<>\"\", H13<>\"\"), 1, 0)","v":0}]
[null,null,null,null,null,null,null,null,null,null,null,null,{"$f":"M13+1","v":2},{"$f":"IF(OR(E14<>\"\", H14<>\"\"), 1, 0)","v":0},{"$f":"IF(AND(E14<>\"\", H14<>\"\"), 1, 0)","v":0}]
[null,null,null,null,null,null,null,null,null,null,null,null,{"$f":"M14+1","v":3},{"$f":"IF(OR(E15<>\"\", H15<>\"\"), 1, 0)","v":0},{"$f":"IF(AND(E15<>\"\", H15<>\"\"), 1, 0)","v":0}]
[null,null,null,null,null,null,null,null,null,null,null,null,{"$f":"M15+1","v":4},{"$f":"IF(OR(E16<>\"\", H16<>\"\"), 1, 0)","v":0},{"$f":"IF(AND(E16<>\"\", H16<>\"\"), 1, 0)","v":0}]

{"sheet":"SPR #3 Op Coord","index":10,"n_rows":41,"n_cols":19,"rows_kept":41,"cut":false,"hidden":true,"merged":[[2,3,2,7],[3,3,3,7],[5,3,5,7],[7,3,7,7],[12,3,14,3],[14,4,14,7],[8,4,8,7],[9,4,9,7],[10,4,10,7],[30,3,30,7],[31,3,31,7],[33,3,33,7],[40,3,40,7],[16,3,17,3],[19,3,20,3],[22,3,24,3],[24,4,24,7],[26,3,28,3],[28,4,28,7]]}
[21]
[]
[{"$f":"MAX(B:B)","v":1},null,null,"Capability Target"]
[null,{"$f":"ROW()-3","v":1},null,{"$f":"INDIRECT(\"'THIRA Steps 1-3'!$C$21\")","v":0}]
[]
[null,null,null,"Capability Assessment"]
[]
[null,null,null,"Priority"]
[null,null,null,null,"Relative to the other core capabilities, efforts to build and/or sustain this core capability are of high importance to my jurisdiction’s preparedness activities.",null,null,null,null,null,null,null,null,null,null,0]
[null,null,null,null,"Relative to the other core capabilities, efforts to build and/or sustain this core capability are of medium importance to my jurisdiction’s preparedness activities."]
[null,null,null,null,"Relative to the other core capabilities, efforts to build and/or sustain this core capability are of low importance to my jurisdiction’s preparedness activities."]
[]
[null,null,null,"Planning","Rating\nInternal Capability","Rating\nInternal Capability + Mutual Aid","Gap Description","Recent Advances (optional)"]
[null,null,null,null,{"$f":"LOOKUP(P14, Lists!$C$2:$C$8, Lists!D2:D8)","v":"No selection made"},{"$f":"LOOKUP(Q14, Lists!$C$2:$C$8, Lists!D2:D8)","v":"No selection made"},null,null,null,null,null,null,null,null,null,1,1,{"$f":"COUNTIF(I15:AC15, \"TRUE\")","v":0},0]
[null,null,null,null,"Gap Description\nWhich of the following best represent your community's primary planning gaps?",null,null,null,false,false,false,false,false,false,false,false,false]
[]
[null,null,null,"Organization","Rating\nInternal Capability","Rating\nInternal Capability + Mutual Aid","Gap Description","Recent Advances (optional)"]
[null,null,null,null,{"$f":"LOOKUP(P18, Lists!$C$2:$C$8, Lists!E2:E8)","v":"No selection made"},{"$f":"LOOKUP(Q18, Lists!$C$2:$C$8, Lists!E2:E8)","v":"No selection made"},null,null,null,null,null,null,null,null,null,1,1,0]
[]
[null,null,null,"Equipment","Rating\nInternal Capability","Rating\nInternal Capability + Mutual Aid","Gap Description","Recent Advances (optional)"]
[null,null,null,null,{"$f":"LOOKUP(P21, Lists!$C$2:$C$8, Lists!F2:F8)","v":"No selection made"},{"$f":"LOOKUP(Q21, Lists!$C$2:$C$8, Lists!F2:F8)","v":"No selection made"},null,null,null,null,null,null,null,null,null,1,1,0]
[]
[null,null,null,"Training","Rating\nInternal Capability","Rating\nInternal Capability + Mutual Aid","Gap Description","Recent Advances (optional)"]
[null,null,null,null,{"$f":"LOOKUP(P24, Lists!$C$2:$C$8, Lists!G2:G8)","v":"No selection made"},{"$f":"LOOKUP(Q24, Lists!$C$2:$C$8, Lists!G2:G8)","v":"No selection made"},null,null,null,null,null,null,null,null,null,1,1,{"$f":"COUNTIF(I25:S25, \"TRUE\")","v":0},0]
[null,null,null,null,"Gap Description\nWhich of the following best represent your community's primary training gaps?",null,null,null,false,false,false,false,false,false,false,false,false,false,false]
[]
[null,null,null,"Exercises","Rating\nInternal Capability","Rating\nInternal Capability + Mutual Aid","Gap Description","Recent Advances (optional)"]
[null,null,null,null,{"$f":"LOOKUP(P28, Lists!$C$2:$C$8, Lists!H2:H8)","v":"No selection made"},{"$f":"LOOKUP(Q28, Lists!$C$2:$C$8, Lists!H2:H8)","v":"No selection made"},null,null,null,null,null,null,null,null,null,1,1,{"$f":"COUNTIF(I29:AA29, \"TRUE\")","v":0},0]
[null,null,null,null,"Gap Description\nWhich of the following best represent your community's primary exercises gaps?",null,null,null,false,false,false,false,false,false,false,false]
[]
[null,null,null,"Assessment Corroboration"]
[null,null,null,null,null,null,null,null,{"$f":"IF(J32=2,TRUE,IF(J32=3,FALSE,\"\"))","v":""},1]
[]
[null,null,null,"Responsibility for Filling Gap",null,null,null,null,null,null,null,null,null,null,null,0]
[]
[]
[]
[]
[]
[]
[null,null,null,"Journal Notes/Process Narrative (optional)"]

{"sheet":"THIRA #4 Forensics Attribution","index":11,"n_rows":16,"n_cols":20,"rows_kept":16,"cut":false,"hidden":false,"merged":[[15,4,15,5],[2,3,2,7],[3,3,3,7],[3,13,3,14],[5,3,5,7],[6,3,10,3],[11,3,15,3],[11,4,11,5],[12,4,12,5],[13,4,13,5],[14,4,14,5]]}
[21]
[]
[{"$f":"MAX(B:B)","v":1},null,null,"Capability Target",null,null,null,null,null,null,null,null,null,null,null,null,null,null,"# NIMS Rows",{"$f":"MAX(J:J)","v":4}]
[null,{"$f":"ROW()-3","v":1},null,{"$f":"INDIRECT(\"'THIRA Steps 1-3'!$C$25\")","v":0},null,null,null,null,null,null,null,null,null,null,null,null,null,null,"# NIMS Started",{"$f":"SUM(K:K)","v":0}]
[null,null,null,null,null,null,null,null,null,null,null,null,null,null,null,null,null,null,"# NIMS Complete",{"$f":"SUM(L:L)","v":0}]
[null,null,null,"Resource Requirements",null,null,null,null,null,null,null,null,null,null,null,null,null,null,"# Other Rows",{"$f":"MAX(M:M)","v":4}]
[null,null,null,"NIMS-typed Resources","Category","Resource","Type","Number Required",null,null,null,null,null,null,null,null,null,null,"# Other Rows",{"$f":"SUM(N:N)","v":0}]
[{"$f":"LOOKUP(E8, Lists!A$236:A$245, Lists!B$236:B$245)","v":{"$error":"#N/A"}},null,{"$f":"VLOOKUP(F8, INDIRECT(\"Lists!$A$140:$B$\" & Lists!$C$245), 2, FALSE)","v":{"$error":"#N/A"}},null,null,null,null,null,null,1,{"$f":"IF(OR(E8<>\"\", F8<>\"\", G8<>\"\", H8<>\"\"), 1, 0)","v":0},{"$f":"IF(AND(E8<>\"\", F8<>\"\", G8<>\"\", H8<>\"\"), 1, 0)","v":0},null,null,null,null,null,null,"# Other",{"$f":"SUM(O:O)","v":0}]
[{"$f":"LOOKUP(E9, Lists!A$236:A$245, Lists!B$236:B$245)","v":{"$error":"#N/A"}},null,{"$f":"VLOOKUP(F9, INDIRECT(\"Lists!$A$140:$B$\" & Lists!$C$245), 2, FALSE)","v":{"$error":"#N/A"}},null,null,null,null,null,null,{"$f":"J8+1","v":2},{"$f":"IF(OR(E9<>\"\", F9<>\"\", G9<>\"\", H9<>\"\"), 1, 0)","v":0},{"$f":"IF(AND(E9<>\"\", F9<>\"\", G9<>\"\", H9<>\"\"), 1, 0)","v":0}]
[{"$f":"LOOKUP(E10, Lists!A$236:A$245, Lists!B$236:B$245)","v":{"$error":"#N/A"}},null,{"$f":"VLOOKUP(F10, INDIRECT(\"Lists!$A$140:$B$\" & Lists!$C$245), 2, FALSE)","v":{"$error":"#N/A"}},null,null,null,null,null,null,{"$f":"J9+1","v":3},{"$f":"IF(OR(E10<>\"\", F10<>\"\", G10<>\"\", H10<>\"\"), 1, 0)","v":0},{"$f":"IF(AND(E10<>\"\", F10<>\"\", G10<>\"\", H10<>\"\"), 1, 0)","v":0}]
[{"$f":"LOOKUP(E11, Lists!A$236:A$245, Lists!B$236:B$245)","v":{"$error":"#N/A"}},null,{"$f":"VLOOKUP(F11, INDIRECT(\"Lists!$A$140:$B$\" & Lists!$C$245), 2, FALSE)","v":{"$error":"#N/A"}},null,null,null,null,null,null,{"$f":"J10+1","v":4},{"$f":"IF(OR(E11<>\"\", F11<>\"\", G11<>\"\", H11<>\"\"), 1, 0)","v":0},{"$f":"IF(AND(E11<>\"\", F11<>\"\", G11<>\"\", H11<>\"\"), 1, 0)","v":0}]
[null,null,null,"Other\nResources","Resource\n(Example:  Case Management Team)",null,"Team/POETE\n","Number Required\n"]
[null,null,null,null,null,null,null,null,null,null,null,null,1,{"$f":"IF(OR(E13<>\"\", H13<>\"\"), 1, 0)","v":0},{"$f":"IF(AND(E13<>\"\", H13<>\"\"), 1, 0)","v":0}]
[null,null,null,null,null,null,null,null,null,null,null,null,{"$f":"M13+1","v":2},{"$f":"IF(OR(E14<>\"\", H14<>\"\"), 1, 0)","v":0},{"$f":"IF(AND(E14<>\"\", H14<>\"\"), 1, 0)","v":0}]
[null,null,null,null,null,null,null,null,null,null,null,null,{"$f":"M14+1","v":3},{"$f":"IF(OR(E15<>\"\", H15<>\"\"), 1, 0)","v":0},{"$f":"IF(AND(E15<>\"\", H15<>\"\"), 1, 0)","v":0}]
[null,null,null,null,null,null,null,null,null,null,null,null,{"$f":"M15+1","v":4},{"$f":"IF(OR(E16<>\"\", H16<>\"\"), 1, 0)","v":0},{"$f":"IF(AND(E16<>\"\", H16<>\"\"), 1, 0)","v":0}]

{"sheet":"SPR #4 Forensics Attribution","index":12,"n_rows":41,"n_cols":19,"rows_kept":41,"cut":false,"hidden":true,"merged":[[2,3,2,7],[3,3,3,7],[5,3,5,7],[7,3,7,7],[12,3,14,3],[14,4,14,7],[8,4,8,7],[9,4,9,7],[10,4,10,7],[30,3,30,7],[31,3,31,7],[33,3,33,7],[40,3,40,7],[16,3,17,3],[19,3,20,3],[22,3,24,3],[24,4,24,7],[26,3,28,3],[28,4,28,7]]}
[21]
[]
[{"$f":"MAX(B:B)","v":1},null,null,"Capability Target"]
[null,{"$f":"ROW()-3","v":1},null,{"$f":"INDIRECT(\"'THIRA Steps 1-3'!$C$25\")","v":0}]
[]
[null,null,null,"Capability Assessment"]
[]
[null,null,null,"Priority"]
[null,null,null,null,"Relative to the other core capabilities, efforts to build and/or sustain this core capability are of high importance to my jurisdiction’s preparedness activities.",null,null,null,null,null,null,null,null,null,null,0]
[null,null,null,null,"Relative to the other core capabilities, efforts to build and/or sustain this core capability are of medium importance to my jurisdiction’s preparedness activities."]
[null,null,null,null,"Relative to the other core capabilities, efforts to build and/or sustain this core capability are of low importance to my jurisdiction’s preparedness activities."]
[]
[null,null,null,"Planning","Rating\nInternal Capability","Rating\nInternal Capability + Mutual Aid","Gap Description","Recent Advances (optional)"]
[null,null,null,null,{"$f":"LOOKUP(P14, Lists!$C$2:$C$8, Lists!D2:D8)","v":"No selection made"},{"$f":"LOOKUP(Q14, Lists!$C$2:$C$8, Lists!D2:D8)","v":"No selection made"},null,null,null,null,null,null,null,null,null,1,1,{"$f":"COUNTIF(I15:AC15, \"TRUE\")","v":0},0]
[null,null,null,null,"Gap Description\nWhich of the following best represent your community's primary planning gaps?",null,null,null,false,false,false,false,false,false,false,false,false]
[]
[null,null,null,"Organization","Rating\nInternal Capability","Rating\nInternal Capability + Mutual Aid","Gap Description","Recent Advances (optional)"]
[null,null,null,null,{"$f":"LOOKUP(P18, Lists!$C$2:$C$8, Lists!E2:E8)","v":"No selection made"},{"$f":"LOOKUP(Q18, Lists!$C$2:$C$8, Lists!E2:E8)","v":"No selection made"},null,null,null,null,null,null,null,null,null,1,1,0]
[]
[null,null,null,"Equipment","Rating\nInternal Capability","Rating\nInternal Capability + Mutual Aid","Gap Description","Recent Advances (optional)"]
[null,null,null,null,{"$f":"LOOKUP(P21, Lists!$C$2:$C$8, Lists!F2:F8)","v":"No selection made"},{"$f":"LOOKUP(Q21, Lists!$C$2:$C$8, Lists!F2:F8)","v":"No selection made"},null,null,null,null,null,null,null,null,null,1,1,0]
[]
[null,null,null,"Training","Rating\nInternal Capability","Rating\nInternal Capability + Mutual Aid","Gap Description","Recent Advances (optional)"]
[null,null,null,null,{"$f":"LOOKUP(P24, Lists!$C$2:$C$8, Lists!G2:G8)","v":"No selection made"},{"$f":"LOOKUP(Q24, Lists!$C$2:$C$8, Lists!G2:G8)","v":"No selection made"},null,null,null,null,null,null,null,null,null,1,1,{"$f":"COUNTIF(I25:S25, \"TRUE\")","v":0},0]
[null,null,null,null,"Gap Description\nWhich of the following best represent your community's primary training gaps?",null,null,null,false,false,false,false,false,false,false,false,false,false,false]
[]
[null,null,null,"Exercises","Rating\nInternal Capability","Rating\nInternal Capability + Mutual Aid","Gap Description","Recent Advances (optional)"]
[null,null,null,null,{"$f":"LOOKUP(P28, Lists!$C$2:$C$8, Lists!H2:H8)","v":"No selection made"},{"$f":"LOOKUP(Q28, Lists!$C$2:$C$8, Lists!H2:H8)","v":"No selection made"},null,null,null,null,null,null,null,null,null,1,1,{"$f":"COUNTIF(I29:AA29, \"TRUE\")","v":0},0]
[null,null,null,null,"Gap Description\nWhich of the following best represent your community's primary exercises gaps?",null,null,null,false,false,false,false,false,false,false,false]
[]
[null,null,null,"Assessment Corroboration"]
[null,null,null,null,null,null,null,null,{"$f":"IF(J32=2,TRUE,IF(J32=3,FALSE,\"\"))","v":""},1]
[]
[null,null,null,"Responsibility for Filling Gap",null,null,null,null,null,null,null,null,null,null,null,0]
[]
[]
[]
[]
[]
[]
[null,null,null,"Journal Notes/Process Narrative (optional)"]

{"sheet":"THIRA #5 Intel Info Sharing","index":13,"n_rows":16,"n_cols":20,"rows_kept":16,"cut":false,"hidden":false,"merged":[[15,4,15,5],[2,3,2,7],[3,3,3,7],[3,13,3,14],[5,3,5,7],[6,3,10,3],[11,3,15,3],[11,4,11,5],[12,4,12,5],[13,4,13,5],[14,4,14,5]]}
[21]
[]
[{"$f":"MAX(B:B)","v":1},null,null,"Capability Target",null,null,null,null,null,null,null,null,null,null,null,null,null,null,"# NIMS Rows",{"$f":"MAX(J:J)","v":4}]
[null,{"$f":"ROW()-3","v":1},null,{"$f":"INDIRECT(\"'THIRA Steps 1-3'!$C$29\")","v":0},null,null,null,null,null,null,null,null,null,null,null,null,null,null,"# NIMS Started",{"$f":"SUM(K:K)","v":0}]
[null,null,null,null,null,null,null,null,null,null,null,null,null,null,null,null,null,null,"# NIMS Complete",{"$f":"SUM(L:L)","v":0}]
[null,null,null,"Resource Requirements",null,null,null,null,null,null,null,null,null,null,null,null,null,null,"# Other Rows",{"$f":"MAX(M:M)","v":4}]
[null,null,null,"NIMS-typed Resources","Category","Resource","Type","Number Required",null,null,null,null,null,null,null,null,null,null,"# Other Rows",{"$f":"SUM(N:N)","v":0}]
[{"$f":"LOOKUP(E8, Lists!A$236:A$245, Lists!B$236:B$245)","v":{"$error":"#N/A"}},null,{"$f":"VLOOKUP(F8, INDIRECT(\"Lists!$A$140:$B$\" & Lists!$C$245), 2, FALSE)","v":{"$error":"#N/A"}},null,null,null,null,null,null,1,{"$f":"IF(OR(E8<>\"\", F8<>\"\", G8<>\"\", H8<>\"\"), 1, 0)","v":0},{"$f":"IF(AND(E8<>\"\", F8<>\"\", G8<>\"\", H8<>\"\"), 1, 0)","v":0},null,null,null,null,null,null,"# Other",{"$f":"SUM(O:O)","v":0}]
[{"$f":"LOOKUP(E9, Lists!A$236:A$245, Lists!B$236:B$245)","v":{"$error":"#N/A"}},null,{"$f":"VLOOKUP(F9, INDIRECT(\"Lists!$A$140:$B$\" & Lists!$C$245), 2, FALSE)","v":{"$error":"#N/A"}},null,null,null,null,null,null,{"$f":"J8+1","v":2},{"$f":"IF(OR(E9<>\"\", F9<>\"\", G9<>\"\", H9<>\"\"), 1, 0)","v":0},{"$f":"IF(AND(E9<>\"\", F9<>\"\", G9<>\"\", H9<>\"\"), 1, 0)","v":0}]
[{"$f":"LOOKUP(E10, Lists!A$236:A$245, Lists!B$236:B$245)","v":{"$error":"#N/A"}},null,{"$f":"VLOOKUP(F10, INDIRECT(\"Lists!$A$140:$B$\" & Lists!$C$245), 2, FALSE)","v":{"$error":"#N/A"}},null,null,null,null,null,null,{"$f":"J9+1","v":3},{"$f":"IF(OR(E10<>\"\", F10<>\"\", G10<>\"\", H10<>\"\"), 1, 0)","v":0},{"$f":"IF(AND(E10<>\"\", F10<>\"\", G10<>\"\", H10<>\"\"), 1, 0)","v":0}]
[{"$f":"LOOKUP(E11, Lists!A$236:A$245, Lists!B$236:B$245)","v":{"$error":"#N/A"}},null,{"$f":"VLOOKUP(F11, INDIRECT(\"Lists!$A$140:$B$\" & Lists!$C$245), 2, FALSE)","v":{"$error":"#N/A"}},null,null,null,null,null,null,{"$f":"J10+1","v":4},{"$f":"IF(OR(E11<>\"\", F11<>\"\", G11<>\"\", H11<>\"\"), 1, 0)","v":0},{"$f":"IF(AND(E11<>\"\", F11<>\"\", G11<>\"\", H11<>\"\"), 1, 0)","v":0}]
[null,null,null,"Other\nResources","Resource\n(Example:  Case Management Team)",null,"Team/POETE\n","Number Required\n"]
[null,null,null,null,null,null,null,null,null,null,null,null,1,{"$f":"IF(OR(E13<>\"\", H13<>\"\"), 1, 0)","v":0},{"$f":"IF(AND(E13<>\"\", H13<>\"\"), 1, 0)","v":0}]
[null,null,null,null,null,null,null,null,null,null,null,null,{"$f":"M13+1","v":2},{"$f":"IF(OR(E14<>\"\", H14<>\"\"), 1, 0)","v":0},{"$f":"IF(AND(E14<>\"\", H14<>\"\"), 1, 0)","v":0}]
[null,null,null,null,null,null,null,null,null,null,null,null,{"$f":"M14+1","v":3},{"$f":"IF(OR(E15<>\"\", H15<>\"\"), 1, 0)","v":0},{"$f":"IF(AND(E15<>\"\", H15<>\"\"), 1, 0)","v":0}]
[null,null,null,null,null,null,null,null,null,null,null,null,{"$f":"M15+1","v":4},{"$f":"IF(OR(E16<>\"\", H16<>\"\"), 1, 0)","v":0},{"$f":"IF(AND(E16<>\"\", H16<>\"\"), 1, 0)","v":0}]

{"sheet":"SPR #5 Intel Info Sharing","index":14,"n_rows":41,"n_cols":19,"rows_kept":41,"cut":false,"hidden":true,"merged":[[2,3,2,7],[3,3,3,7],[5,3,5,7],[7,3,7,7],[12,3,14,3],[14,4,14,7],[8,4,8,7],[9,4,9,7],[10,4,10,7],[30,3,30,7],[31,3,31,7],[33,3,33,7],[40,3,40,7],[16,3,17,3],[19,3,20,3],[22,3,24,3],[24,4,24,7],[26,3,28,3],[28,4,28,7]]}
[21]
[]
[{"$f":"MAX(B:B)","v":1},null,null,"Capability Target"]
[null,{"$f":"ROW()-3","v":1},null,{"$f":"INDIRECT(\"'THIRA Steps 1-3'!$C$29\")","v":0}]
[]
[null,null,null,"Capability Assessment"]
[]
[null,null,null,"Priority"]
[null,null,null,null,"Relative to the other core capabilities, efforts to build and/or sustain this core capability are of high importance to my jurisdiction’s preparedness activities.",null,null,null,null,null,null,null,null,null,null,0]
[null,null,null,null,"Relative to the other core capabilities, efforts to build and/or sustain this core capability are of medium importance to my jurisdiction’s preparedness activities."]
[null,null,null,null,"Relative to the other core capabilities, efforts to build and/or sustain this core capability are of low importance to my jurisdiction’s preparedness activities."]
[]
[null,null,null,"Planning","Rating\nInternal Capability","Rating\nInternal Capability + Mutual Aid","Gap Description","Recent Advances (optional)"]
[null,null,null,null,{"$f":"LOOKUP(P14, Lists!$C$2:$C$8, Lists!D2:D8)","v":"No selection made"},{"$f":"LOOKUP(Q14, Lists!$C$2:$C$8, Lists!D2:D8)","v":"No selection made"},null,null,null,null,null,null,null,null,null,1,1,{"$f":"COUNTIF(I15:AC15, \"TRUE\")","v":0},0]
[null,null,null,null,"Gap Description\nWhich of the following best represent your community's primary planning gaps?",null,null,null,false,false,false,false,false,false,false,false,false]
[]
[null,null,null,"Organization","Rating\nInternal Capability","Rating\nInternal Capability + Mutual Aid","Gap Description","Recent Advances (optional)"]
[null,null,null,null,{"$f":"LOOKUP(P18, Lists!$C$2:$C$8, Lists!E2:E8)","v":"No selection made"},{"$f":"LOOKUP(Q18, Lists!$C$2:$C$8, Lists!E2:E8)","v":"No selection made"},null,null,null,null,null,null,null,null,null,1,1,0]
[]
[null,null,null,"Equipment","Rating\nInternal Capability","Rating\nInternal Capability + Mutual Aid","Gap Description","Recent Advances (optional)"]
[null,null,null,null,{"$f":"LOOKUP(P21, Lists!$C$2:$C$8, Lists!F2:F8)","v":"No selection made"},{"$f":"LOOKUP(Q21, Lists!$C$2:$C$8, Lists!F2:F8)","v":"No selection made"},null,null,null,null,null,null,null,null,null,1,1,0]
[]
[null,null,null,"Training","Rating\nInternal Capability","Rating\nInternal Capability + Mutual Aid","Gap Description","Recent Advances (optional)"]
[null,null,null,null,{"$f":"LOOKUP(P24, Lists!$C$2:$C$8, Lists!G2:G8)","v":"No selection made"},{"$f":"LOOKUP(Q24, Lists!$C$2:$C$8, Lists!G2:G8)","v":"No selection made"},null,null,null,null,null,null,null,null,null,1,1,{"$f":"COUNTIF(I25:S25, \"TRUE\")","v":0},1]
[null,null,null,null,"Gap Description\nWhich of the following best represent your community's primary training gaps?",null,null,null,false,false,false,false,false,false,false,false,false,false,false]
[]
[null,null,null,"Exercises","Rating\nInternal Capability","Rating\nInternal Capability + Mutual Aid","Gap Description","Recent Advances (optional)"]
[null,null,null,null,{"$f":"LOOKUP(P28, Lists!$C$2:$C$8, Lists!H2:H8)","v":"No selection made"},{"$f":"LOOKUP(Q28, Lists!$C$2:$C$8, Lists!H2:H8)","v":"No selection made"},null,null,null,null,null,null,null,null,null,1,1,{"$f":"COUNTIF(I29:AA29, \"TRUE\")","v":0},0]
[null,null,null,null,"Gap Description\nWhich of the following best represent your community's primary exercises gaps?",null,null,null,false,false,false,false,false,false,false,false]
[]
[null,null,null,"Assessment Corroboration"]
[null,null,null,null,null,null,null,null,{"$f":"IF(J32=2,TRUE,IF(J32=3,FALSE,\"\"))","v":""},1]
[]
[null,null,null,"Responsibility for Filling Gap",null,null,null,null,null,null,null,null,null,null,null,0]
[]
[]
[]
[]
[]
[]
[null,null,null,"Journal Notes/Process Narrative (optional)"]

{"sheet":"THIRA #6 Interdict Disrupt","index":15,"n_rows":16,"n_cols":20,"rows_kept":16,"cut":false,"hidden":false,"merged":[[15,4,15,5],[2,3,2,7],[3,3,3,7],[3,13,3,14],[5,3,5,7],[6,3,10,3],[11,3,15,3],[11,4,11,5],[12,4,12,5],[13,4,13,5],[14,4,14,5]]}
[21]
[]
[{"$f":"MAX(B:B)","v":1},null,null,"Capability Target",null,null,null,null,null,null,null,null,null,null,null,null,null,null,"# NIMS Rows",{"$f":"MAX(J:J)","v":4}]
[null,{"$f":"ROW()-3","v":1},null,{"$f":"INDIRECT(\"'THIRA Steps 1-3'!$C$33\")","v":0},null,null,null,null,null,null,null,null,null,null,null,null,null,null,"# NIMS Started",{"$f":"SUM(K:K)","v":0}]
[null,null,null,null,null,null,null,null,null,null,null,null,null,null,null,null,null,null,"# NIMS Complete",{"$f":"SUM(L:L)","v":0}]
[null,null,null,"Resource Requirements",null,null,null,null,null,null,null,null,null,null,null,null,null,null,"# Other Rows",{"$f":"MAX(M:M)","v":4}]
[null,null,null,"NIMS-typed Resources","Category","Resource","Type","Number Required",null,null,null,null,null,null,null,null,null,null,"# Other Rows",{"$f":"SUM(N:N)","v":0}]
[{"$f":"LOOKUP(E8, Lists!A$236:A$245, Lists!B$236:B$245)","v":{"$error":"#N/A"}},null,{"$f":"VLOOKUP(F8, INDIRECT(\"Lists!$A$140:$B$\" & Lists!$C$245), 2, FALSE)","v":{"$error":"#N/A"}},null,null,null,null,null,null,1,{"$f":"IF(OR(E8<>\"\", F8<>\"\", G8<>\"\", H8<>\"\"), 1, 0)","v":0},{"$f":"IF(AND(E8<>\"\", F8<>\"\", G8<>\"\", H8<>\"\"), 1, 0)","v":0},null,null,null,null,null,null,"# Other",{"$f":"SUM(O:O)","v":0}]
[{"$f":"LOOKUP(E9, Lists!A$236:A$245, Lists!B$236:B$245)","v":{"$error":"#N/A"}},null,{"$f":"VLOOKUP(F9, INDIRECT(\"Lists!$A$140:$B$\" & Lists!$C$245), 2, FALSE)","v":{"$error":"#N/A"}},null,null,null,null,null,null,{"$f":"J8+1","v":2},{"$f":"IF(OR(E9<>\"\", F9<>\"\", G9<>\"\", H9<>\"\"), 1, 0)","v":0},{"$f":"IF(AND(E9<>\"\", F9<>\"\", G9<>\"\", H9<>\"\"), 1, 0)","v":0}]
[{"$f":"LOOKUP(E10, Lists!A$236:A$245, Lists!B$236:B$245)","v":{"$error":"#N/A"}},null,{"$f":"VLOOKUP(F10, INDIRECT(\"Lists!$A$140:$B$\" & Lists!$C$245), 2, FALSE)","v":{"$error":"#N/A"}},null,null,null,null,null,null,{"$f":"J9+1","v":3},{"$f":"IF(OR(E10<>\"\", F10<>\"\", G10<>\"\", H10<>\"\"), 1, 0)","v":0},{"$f":"IF(AND(E10<>\"\", F10<>\"\", G10<>\"\", H10<>\"\"), 1, 0)","v":0}]
[{"$f":"LOOKUP(E11, Lists!A$236:A$245, Lists!B$236:B$245)","v":{"$error":"#N/A"}},null,{"$f":"VLOOKUP(F11, INDIRECT(\"Lists!$A$140:$B$\" & Lists!$C$245), 2, FALSE)","v":{"$error":"#N/A"}},null,null,null,null,null,null,{"$f":"J10+1","v":4},{"$f":"IF(OR(E11<>\"\", F11<>\"\", G11<>\"\", H11<>\"\"), 1, 0)","v":0},{"$f":"IF(AND(E11<>\"\", F11<>\"\", G11<>\"\", H11<>\"\"), 1, 0)","v":0}]
[null,null,null,"Other\nResources","Resource\n(Example:  Case Management Team)",null,"Team/POETE\n","Number Required\n"]
[null,null,null,null,null,null,null,null,null,null,null,null,1,{"$f":"IF(OR(E13<>\"\", H13<>\"\"), 1, 0)","v":0},{"$f":"IF(AND(E13<>\"\", H13<>\"\"), 1, 0)","v":0}]
[null,null,null,null,null,null,null,null,null,null,null,null,{"$f":"M13+1","v":2},{"$f":"IF(OR(E14<>\"\", H14<>\"\"), 1, 0)","v":0},{"$f":"IF(AND(E14<>\"\", H14<>\"\"), 1, 0)","v":0}]
[null,null,null,null,null,null,null,null,null,null,null,null,{"$f":"M14+1","v":3},{"$f":"IF(OR(E15<>\"\", H15<>\"\"), 1, 0)","v":0},{"$f":"IF(AND(E15<>\"\", H15<>\"\"), 1, 0)","v":0}]
[null,null,null,null,null,null,null,null,null,null,null,null,{"$f":"M15+1","v":4},{"$f":"IF(OR(E16<>\"\", H16<>\"\"), 1, 0)","v":0},{"$f":"IF(AND(E16<>\"\", H16<>\"\"), 1, 0)","v":0}]

{"sheet":"SPR #6 Interdict Disrupt","index":16,"n_rows":41,"n_cols":19,"rows_kept":41,"cut":false,"hidden":true,"merged":[[2,3,2,7],[3,3,3,7],[5,3,5,7],[7,3,7,7],[12,3,14,3],[14,4,14,7],[8,4,8,7],[9,4,9,7],[10,4,10,7],[30,3,30,7],[31,3,31,7],[33,3,33,7],[40,3,40,7],[16,3,17,3],[19,3,20,3],[22,3,24,3],[24,4,24,7],[26,3,28,3],[28,4,28,7]]}
[21]
[]
[{"$f":"MAX(B:B)","v":1},null,null,"Capability Target"]
[null,{"$f":"ROW()-3","v":1},null,{"$f":"INDIRECT(\"'THIRA Steps 1-3'!$C$33\")","v":0}]
[]
[null,null,null,"Capability Assessment"]
[]
[null,null,null,"Priority"]
[null,null,null,null,"Relative to the other core capabilities, efforts to build and/or sustain this core capability are of high importance to my jurisdiction’s preparedness activities.",null,null,null,null,null,null,null,null,null,null,0]
[null,null,null,null,"Relative to the other core capabilities, efforts to build and/or sustain this core capability are of medium importance to my jurisdiction’s preparedness activities."]
[null,null,null,null,"Relative to the other core capabilities, efforts to build and/or sustain this core capability are of low importance to my jurisdiction’s preparedness activities."]
[]
[null,null,null,"Planning","Rating\nInternal Capability","Rating\nInternal Capability + Mutual Aid","Gap Description","Recent Advances (optional)"]
[null,null,null,null,{"$f":"LOOKUP(P14, Lists!$C$2:$C$8, Lists!D2:D8)","v":"No selection made"},{"$f":"LOOKUP(Q14, Lists!$C$2:$C$8, Lists!D2:D8)","v":"No selection made"},null,null,null,null,null,null,null,null,null,1,1,{"$f":"COUNTIF(I15:AC15, \"TRUE\")","v":0},0]
[null,null,null,null,"Gap Description\nWhich of the following best represent your community's primary planning gaps?",null,null,null,false,false,false,false,false,false,false,false,false]
[]
[null,null,null,"Organization","Rating\nInternal Capability","Rating\nInternal Capability + Mutual Aid","Gap Description","Recent Advances (optional)"]
[null,null,null,null,{"$f":"LOOKUP(P18, Lists!$C$2:$C$8, Lists!E2:E8)","v":"No selection made"},{"$f":"LOOKUP(Q18, Lists!$C$2:$C$8, Lists!E2:E8)","v":"No selection made"},null,null,null,null,null,null,null,null,null,1,1,0]
[]
[null,null,null,"Equipment","Rating\nInternal Capability","Rating\nInternal Capability + Mutual Aid","Gap Description","Recent Advances (optional)"]
[null,null,null,null,{"$f":"LOOKUP(P21, Lists!$C$2:$C$8, Lists!F2:F8)","v":"No selection made"},{"$f":"LOOKUP(Q21, Lists!$C$2:$C$8, Lists!F2:F8)","v":"No selection made"},null,null,null,null,null,null,null,null,null,1,1,0]
[]
[null,null,null,"Training","Rating\nInternal Capability","Rating\nInternal Capability + Mutual Aid","Gap Description","Recent Advances (optional)"]
[null,null,null,null,{"$f":"LOOKUP(P24, Lists!$C$2:$C$8, Lists!G2:G8)","v":"No selection made"},{"$f":"LOOKUP(Q24, Lists!$C$2:$C$8, Lists!G2:G8)","v":"No selection made"},null,null,null,null,null,null,null,null,null,1,1,{"$f":"COUNTIF(I25:S25, \"TRUE\")","v":0},0]
[null,null,null,null,"Gap Description\nWhich of the following best represent your community's primary training gaps?",null,null,null,false,false,false,false,false,false,false,false,false,false,false]
[]
[null,null,null,"Exercises","Rating\nInternal Capability","Rating\nInternal Capability + Mutual Aid","Gap Description","Recent Advances (optional)"]
[null,null,null,null,{"$f":"LOOKUP(P28, Lists!$C$2:$C$8, Lists!H2:H8)","v":"No selection made"},{"$f":"LOOKUP(Q28, Lists!$C$2:$C$8, Lists!H2:H8)","v":"No selection made"},null,null,null,null,null,null,null,null,null,1,1,{"$f":"COUNTIF(I29:AA29, \"TRUE\")","v":0},0]
[null,null,null,null,"Gap Description\nWhich of the following best represent your community's primary exercises gaps?",null,null,null,false,false,false,false,false,false,false,false]
[]
[null,null,null,"Assessment Corroboration"]
[null,null,null,null,null,null,null,null,{"$f":"IF(J32=2,TRUE,IF(J32=3,FALSE,\"\"))","v":""},1]
[]
[null,null,null,"Responsibility for Filling Gap",null,null,null,null,null,null,null,null,null,null,null,0]
[]
[]
[]
[]
[]
[]
[null,null,null,"Journal Notes/Process Narrative (optional)"]

{"sheet":"THIRA #7 Screen Search Detect","index":17,"n_rows":16,"n_cols":20,"rows_kept":16,"cut":false,"hidden":false,"merged":[[15,4,15,5],[2,3,2,7],[3,3,3,7],[3,13,3,14],[5,3,5,7],[6,3,10,3],[11,3,15,3],[11,4,11,5],[12,4,12,5],[13,4,13,5],[14,4,14,5]]}
[21]
[]
[{"$f":"MAX(B:B)","v":1},null,null,"Capability Target",null,null,null,null,null,null,null,null,null,null,null,null,null,null,"# NIMS Rows",{"$f":"MAX(J:J)","v":4}]
[null,{"$f":"ROW()-3","v":1},null,{"$f":"INDIRECT(\"'THIRA Steps 1-3'!$C$37\")","v":0},null,null,null,null,null,null,null,null,null,null,null,null,null,null,"# NIMS Started",{"$f":"SUM(K:K)","v":0}]
[null,null,null,null,null,null,null,null,null,null,null,null,null,null,null,null,null,null,"# NIMS Complete",{"$f":"SUM(L:L)","v":0}]
[null,null,null,"Resource Requirements",null,null,null,null,null,null,null,null,null,null,null,null,null,null,"# Other Rows",{"$f":"MAX(M:M)","v":4}]
[null,null,null,"NIMS-typed Resources","Category","Resource","Type","Number Required",null,null,null,null,null,null,null,null,null,null,"# Other Rows",{"$f":"SUM(N:N)","v":0}]
[{"$f":"LOOKUP(E8, Lists!A$236:A$245, Lists!B$236:B$245)","v":{"$error":"#N/A"}},null,{"$f":"VLOOKUP(F8, INDIRECT(\"Lists!$A$140:$B$\" & Lists!$C$245), 2, FALSE)","v":{"$error":"#N/A"}},null,null,null,null,null,null,1,{"$f":"IF(OR(E8<>\"\", F8<>\"\", G8<>\"\", H8<>\"\"), 1, 0)","v":0},{"$f":"IF(AND(E8<>\"\", F8<>\"\", G8<>\"\", H8<>\"\"), 1, 0)","v":0},null,null,null,null,null,null,"# Other",{"$f":"SUM(O:O)","v":0}]
[{"$f":"LOOKUP(E9, Lists!A$236:A$245, Lists!B$236:B$245)","v":{"$error":"#N/A"}},null,{"$f":"VLOOKUP(F9, INDIRECT(\"Lists!$A$140:$B$\" & Lists!$C$245), 2, FALSE)","v":{"$error":"#N/A"}},null,null,null,null,null,null,{"$f":"J8+1","v":2},{"$f":"IF(OR(E9<>\"\", F9<>\"\", G9<>\"\", H9<>\"\"), 1, 0)","v":0},{"$f":"IF(AND(E9<>\"\", F9<>\"\", G9<>\"\", H9<>\"\"), 1, 0)","v":0}]
[{"$f":"LOOKUP(E10, Lists!A$236:A$245, Lists!B$236:B$245)","v":{"$error":"#N/A"}},null,{"$f":"VLOOKUP(F10, INDIRECT(\"Lists!$A$140:$B$\" & Lists!$C$245), 2, FALSE)","v":{"$error":"#N/A"}},null,null,null,null,null,null,{"$f":"J9+1","v":3},{"$f":"IF(OR(E10<>\"\", F10<>\"\", G10<>\"\", H10<>\"\"), 1, 0)","v":0},{"$f":"IF(AND(E10<>\"\", F10<>\"\", G10<>\"\", H10<>\"\"), 1, 0)","v":0}]
[{"$f":"LOOKUP(E11, Lists!A$236:A$245, Lists!B$236:B$245)","v":{"$error":"#N/A"}},null,{"$f":"VLOOKUP(F11, INDIRECT(\"Lists!$A$140:$B$\" & Lists!$C$245), 2, FALSE)","v":{"$error":"#N/A"}},null,null,null,null,null,null,{"$f":"J10+1","v":4},{"$f":"IF(OR(E11<>\"\", F11<>\"\", G11<>\"\", H11<>\"\"), 1, 0)","v":0},{"$f":"IF(AND(E11<>\"\", F11<>\"\", G11<>\"\", H11<>\"\"), 1, 0)","v":0}]
[null,null,null,"Other\nResources","Resource\n(Example:  Case Management Team)",null,"Team/POETE\n","Number Required\n"]
[null,null,null,null,null,null,null,null,null,null,null,null,1,{"$f":"IF(OR(E13<>\"\", H13<>\"\"), 1, 0)","v":0},{"$f":"IF(AND(E13<>\"\", H13<>\"\"), 1, 0)","v":0}]
[null,null,null,null,null,null,null,null,null,null,null,null,{"$f":"M13+1","v":2},{"$f":"IF(OR(E14<>\"\", H14<>\"\"), 1, 0)","v":0},{"$f":"IF(AND(E14<>\"\", H14<>\"\"), 1, 0)","v":0}]
[null,null,null,null,null,null,null,null,null,null,null,null,{"$f":"M14+1","v":3},{"$f":"IF(OR(E15<>\"\", H15<>\"\"), 1, 0)","v":0},{"$f":"IF(AND(E15<>\"\", H15<>\"\"), 1, 0)","v":0}]
[null,null,null,null,null,null,null,null,null,null,null,null,{"$f":"M15+1","v":4},{"$f":"IF(OR(E16<>\"\", H16<>\"\"), 1, 0)","v":0},{"$f":"IF(AND(E16<>\"\", H16<>\"\"), 1, 0)","v":0}]

{"sheet":"SPR #7 Screen Search Detect","index":18,"n_rows":41,"n_cols":19,"rows_kept":41,"cut":false,"hidden":true,"merged":[[2,3,2,7],[3,3,3,7],[5,3,5,7],[7,3,7,7],[12,3,14,3],[14,4,14,7],[8,4,8,7],[9,4,9,7],[10,4,10,7],[30,3,30,7],[31,3,31,7],[33,3,33,7],[40,3,40,7],[16,3,17,3],[19,3,20,3],[22,3,24,3],[24,4,24,7],[26,3,28,3],[28,4,28,7]]}
[21]
[]
[{"$f":"MAX(B:B)","v":1},null,null,"Capability Target"]
[null,{"$f":"ROW()-3","v":1},null,{"$f":"INDIRECT(\"'THIRA Steps 1-3'!$C$37\")","v":0}]
[]
[null,null,null,"Capability Assessment"]
[]
[null,null,null,"Priority"]
[null,null,null,null,"Relative to the other core capabilities, efforts to build and/or sustain this core capability are of high importance to my jurisdiction’s preparedness activities.",null,null,null,null,null,null,null,null,null,null,0]
[null,null,null,null,"Relative to the other core capabilities, efforts to build and/or sustain this core capability are of medium importance to my jurisdiction’s preparedness activities."]
[null,null,null,null,"Relative to the other core capabilities, efforts to build and/or sustain this core capability are of low importance to my jurisdiction’s preparedness activities."]
[]
[null,null,null,"Planning","Rating\nInternal Capability","Rating\nInternal Capability + Mutual Aid","Gap Description","Recent Advances (optional)"]
[null,null,null,null,{"$f":"LOOKUP(P14, Lists!$C$2:$C$8, Lists!D2:D8)","v":"No selection made"},{"$f":"LOOKUP(Q14, Lists!$C$2:$C$8, Lists!D2:D8)","v":"No selection made"},null,null,null,null,null,null,null,null,null,1,1,{"$f":"COUNTIF(I15:AC15, \"TRUE\")","v":0},0]
[null,null,null,null,"Gap Description\nWhich of the following best represent your community's primary planning gaps?",null,null,null,false,false,false,false,false,false,false,false,false]
[]
[null,null,null,"Organization","Rating\nInternal Capability","Rating\nInternal Capability + Mutual Aid","Gap Description","Recent Advances (optional)"]
[null,null,null,null,{"$f":"LOOKUP(P18, Lists!$C$2:$C$8, Lists!E2:E8)","v":"No selection made"},{"$f":"LOOKUP(Q18, Lists!$C$2:$C$8, Lists!E2:E8)","v":"No selection made"},null,null,null,null,null,null,null,null,null,1,1,0]
[]
[null,null,null,"Equipment","Rating\nInternal Capability","Rating\nInternal Capability + Mutual Aid","Gap Description","Recent Advances (optional)"]
[null,null,null,null,{"$f":"LOOKUP(P21, Lists!$C$2:$C$8, Lists!F2:F8)","v":"No selection made"},{"$f":"LOOKUP(Q21, Lists!$C$2:$C$8, Lists!F2:F8)","v":"No selection made"},null,null,null,null,null,null,null,null,null,1,1,0]
[]
[null,null,null,"Training","Rating\nInternal Capability","Rating\nInternal Capability + Mutual Aid","Gap Description","Recent Advances (optional)"]
[null,null,null,null,{"$f":"LOOKUP(P24, Lists!$C$2:$C$8, Lists!G2:G8)","v":"No selection made"},{"$f":"LOOKUP(Q24, Lists!$C$2:$C$8, Lists!G2:G8)","v":"No selection made"},null,null,null,null,null,null,null,null,null,1,1,{"$f":"COUNTIF(I25:S25, \"TRUE\")","v":0},0]
[null,null,null,null,"Gap Description\nWhich of the following best represent your community's primary training gaps?",null,null,null,false,false,false,false,false,false,false,false,false,false,false]
[]
[null,null,null,"Exercises","Rating\nInternal Capability","Rating\nInternal Capability + Mutual Aid","Gap Description","Recent Advances (optional)"]
[null,null,null,null,{"$f":"LOOKUP(P28, Lists!$C$2:$C$8, Lists!H2:H8)","v":"No selection made"},{"$f":"LOOKUP(Q28, Lists!$C$2:$C$8, Lists!H2:H8)","v":"No selection made"},null,null,null,null,null,null,null,null,null,1,1,{"$f":"COUNTIF(I29:AA29, \"TRUE\")","v":0},0]
[null,null,null,null,"Gap Description\nWhich of the following best represent your community's primary exercises gaps?",null,null,null,false,false,false,false,false,false,false,false]
[]
[null,null,null,"Assessment Corroboration"]
[null,null,null,null,null,null,null,null,{"$f":"IF(J32=2,TRUE,IF(J32=3,FALSE,\"\"))","v":""},1]
[]
[null,null,null,"Responsibility for Filling Gap",null,null,null,null,null,null,null,null,null,null,null,0]
[]
[]
[]
[]
[]
[]
[null,null,null,"Journal Notes/Process Narrative (optional)"]

{"sheet":"THIRA #8 Access Control","index":19,"n_rows":16,"n_cols":20,"rows_kept":16,"cut":false,"hidden":false,"merged":[[15,4,15,5],[2,3,2,7],[3,3,3,7],[3,13,3,14],[5,3,5,7],[6,3,10,3],[11,3,15,3],[11,4,11,5],[12,4,12,5],[13,4,13,5],[14,4,14,5]]}
[21]
[]
[{"$f":"MAX(B:B)","v":1},null,null,"Capability Target",null,null,null,null,null,null,null,null,null,null,null,null,null,null,"# NIMS Rows",{"$f":"MAX(J:J)","v":4}]
[null,{"$f":"ROW()-3","v":1},null,{"$f":"INDIRECT(\"'THIRA Steps 1-3'!$C$41\")","v":0},null,null,null,null,null,null,null,null,null,null,null,null,null,null,"# NIMS Started",{"$f":"SUM(K:K)","v":0}]
[null,null,null,null,null,null,null,null,null,null,null,null,null,null,null,null,null,null,"# NIMS Complete",{"$f":"SUM(L:L)","v":0}]
[null,null,null,"Resource Requirements",null,null,null,null,null,null,null,null,null,null,null,null,null,null,"# Other Rows",{"$f":"MAX(M:M)","v":4}]
[null,null,null,"NIMS-typed Resources","Category","Resource","Type","Number Required",null,null,null,null,null,null,null,null,null,null,"# Other Rows",{"$f":"SUM(N:N)","v":0}]
[{"$f":"LOOKUP(E8, Lists!A$236:A$245, Lists!B$236:B$245)","v":{"$error":"#N/A"}},null,{"$f":"VLOOKUP(F8, INDIRECT(\"Lists!$A$140:$B$\" & Lists!$C$245), 2, FALSE)","v":{"$error":"#N/A"}},null,null,null,null,null,null,1,{"$f":"IF(OR(E8<>\"\", F8<>\"\", G8<>\"\", H8<>\"\"), 1, 0)","v":0},{"$f":"IF(AND(E8<>\"\", F8<>\"\", G8<>\"\", H8<>\"\"), 1, 0)","v":0},null,null,null,null,null,null,"# Other",{"$f":"SUM(O:O)","v":0}]
[{"$f":"LOOKUP(E9, Lists!A$236:A$245, Lists!B$236:B$245)","v":{"$error":"#N/A"}},null,{"$f":"VLOOKUP(F9, INDIRECT(\"Lists!$A$140:$B$\" & Lists!$C$245), 2, FALSE)","v":{"$error":"#N/A"}},null,null,null,null,null,null,{"$f":"J8+1","v":2},{"$f":"IF(OR(E9<>\"\", F9<>\"\", G9<>\"\", H9<>\"\"), 1, 0)","v":0},{"$f":"IF(AND(E9<>\"\", F9<>\"\", G9<>\"\", H9<>\"\"), 1, 0)","v":0}]
[{"$f":"LOOKUP(E10, Lists!A$236:A$245, Lists!B$236:B$245)","v":{"$error":"#N/A"}},null,{"$f":"VLOOKUP(F10, INDIRECT(\"Lists!$A$140:$B$\" & Lists!$C$245), 2, FALSE)","v":{"$error":"#N/A"}},null,null,null,null,null,null,{"$f":"J9+1","v":3},{"$f":"IF(OR(E10<>\"\", F10<>\"\", G10<>\"\", H10<>\"\"), 1, 0)","v":0},{"$f":"IF(AND(E10<>\"\", F10<>\"\", G10<>\"\", H10<>\"\"), 1, 0)","v":0}]
[{"$f":"LOOKUP(E11, Lists!A$236:A$245, Lists!B$236:B$245)","v":{"$error":"#N/A"}},null,{"$f":"VLOOKUP(F11, INDIRECT(\"Lists!$A$140:$B$\" & Lists!$C$245), 2, FALSE)","v":{"$error":"#N/A"}},null,null,null,null,null,null,{"$f":"J10+1","v":4},{"$f":"IF(OR(E11<>\"\", F11<>\"\", G11<>\"\", H11<>\"\"), 1, 0)","v":0},{"$f":"IF(AND(E11<>\"\", F11<>\"\", G11<>\"\", H11<>\"\"), 1, 0)","v":0}]
[null,null,null,"Other\nResources","Resource\n(Example:  Case Management Team)",null,"Team/POETE\n","Number Required\n"]
[null,null,null,null,null,null,null,null,null,null,null,null,1,{"$f":"IF(OR(E13<>\"\", H13<>\"\"), 1, 0)","v":0},{"$f":"IF(AND(E13<>\"\", H13<>\"\"), 1, 0)","v":0}]
[null,null,null,null,null,null,null,null,null,null,null,null,{"$f":"M13+1","v":2},{"$f":"IF(OR(E14<>\"\", H14<>\"\"), 1, 0)","v":0},{"$f":"IF(AND(E14<>\"\", H14<>\"\"), 1, 0)","v":0}]
[null,null,null,null,null,null,null,null,null,null,null,null,{"$f":"M14+1","v":3},{"$f":"IF(OR(E15<>\"\", H15<>\"\"), 1, 0)","v":0},{"$f":"IF(AND(E15<>\"\", H15<>\"\"), 1, 0)","v":0}]
[null,null,null,null,null,null,null,null,null,null,null,null,{"$f":"M15+1","v":4},{"$f":"IF(OR(E16<>\"\", H16<>\"\"), 1, 0)","v":0},{"$f":"IF(AND(E16<>\"\", H16<>\"\"), 1, 0)","v":0}]

{"sheet":"SPR #8 Access Control","index":20,"n_rows":41,"n_cols":19,"rows_kept":41,"cut":false,"hidden":true,"merged":[[2,3,2,7],[3,3,3,7],[5,3,5,7],[7,3,7,7],[12,3,14,3],[14,4,14,7],[8,4,8,7],[9,4,9,7],[10,4,10,7],[30,3,30,7],[31,3,31,7],[33,3,33,7],[40,3,40,7],[16,3,17,3],[19,3,20,3],[22,3,24,3],[24,4,24,7],[26,3,28,3],[28,4,28,7]]}
[21]
[]
[{"$f":"MAX(B:B)","v":1},null,null,"Capability Target"]
[null,{"$f":"ROW()-3","v":1},null,{"$f":"INDIRECT(\"'THIRA Steps 1-3'!$C$41\")","v":0}]
[]
[null,null,null,"Capability Assessment"]
[]
[null,null,null,"Priority"]
[null,null,null,null,"Relative to the other core capabilities, efforts to build and/or sustain this core capability are of high importance to my jurisdiction’s preparedness activities.",null,null,null,null,null,null,null,null,null,null,0]
[null,null,null,null,"Relative to the other core capabilities, efforts to build and/or sustain this core capability are of medium importance to my jurisdiction’s preparedness activities."]
[null,null,null,null,"Relative to the other core capabilities, efforts to build and/or sustain this core capability are of low importance to my jurisdiction’s preparedness activities."]
[]
[null,null,null,"Planning","Rating\nInternal Capability","Rating\nInternal Capability + Mutual Aid","Gap Description","Recent Advances (optional)"]
[null,null,null,null,{"$f":"LOOKUP(P14, Lists!$C$2:$C$8, Lists!D2:D8)","v":"No selection made"},{"$f":"LOOKUP(Q14, Lists!$C$2:$C$8, Lists!D2:D8)","v":"No selection made"},null,null,null,null,null,null,null,null,null,1,1,{"$f":"COUNTIF(I15:AC15, \"TRUE\")","v":0},0]
[null,null,null,null,"Gap Description\nWhich of the following best represent your community's primary planning gaps?",null,null,null,false,false,false,false,false,false,false,false,false]
[]
[null,null,null,"Organization","Rating\nInternal Capability","Rating\nInternal Capability + Mutual Aid","Gap Description","Recent Advances (optional)"]
[null,null,null,null,{"$f":"LOOKUP(P18, Lists!$C$2:$C$8, Lists!E2:E8)","v":"No selection made"},{"$f":"LOOKUP(Q18, Lists!$C$2:$C$8, Lists!E2:E8)","v":"No selection made"},null,null,null,null,null,null,null,null,null,1,1,0]
[]
[null,null,null,"Equipment","Rating\nInternal Capability","Rating\nInternal Capability + Mutual Aid","Gap Description","Recent Advances (optional)"]
[null,null,null,null,{"$f":"LOOKUP(P21, Lists!$C$2:$C$8, Lists!F2:F8)","v":"No selection made"},{"$f":"LOOKUP(Q21, Lists!$C$2:$C$8, Lists!F2:F8)","v":"No selection made"},null,null,null,null,null,null,null,null,null,1,1,1]
[]
[null,null,null,"Training","Rating\nInternal Capability","Rating\nInternal Capability + Mutual Aid","Gap Description","Recent Advances (optional)"]
[null,null,null,null,{"$f":"LOOKUP(P24, Lists!$C$2:$C$8, Lists!G2:G8)","v":"No selection made"},{"$f":"LOOKUP(Q24, Lists!$C$2:$C$8, Lists!G2:G8)","v":"No selection made"},null,null,null,null,null,null,null,null,null,1,1,{"$f":"COUNTIF(I25:S25, \"TRUE\")","v":0},0]
[null,null,null,null,"Gap Description\nWhich of the following best represent your community's primary training gaps?",null,null,null,false,false,false,false,false,false,false,false,false,false,false]
[]
[null,null,null,"Exercises","Rating\nInternal Capability","Rating\nInternal Capability + Mutual Aid","Gap Description","Recent Advances (optional)"]
[null,null,null,null,{"$f":"LOOKUP(P28, Lists!$C$2:$C$8, Lists!H2:H8)","v":"No selection made"},{"$f":"LOOKUP(Q28, Lists!$C$2:$C$8, Lists!H2:H8)","v":"No selection made"},null,null,null,null,null,null,null,null,null,1,1,{"$f":"COUNTIF(I29:AA29, \"TRUE\")","v":0},0]
[null,null,null,null,"Gap Description\nWhich of the following best represent your community's primary exercises gaps?",null,null,null,false,false,false,false,false,false,false,false]
[]
[null,null,null,"Assessment Corroboration"]
[null,null,null,null,null,null,null,null,{"$f":"IF(J32=2,TRUE,IF(J32=3,FALSE,\"\"))","v":""},1]
[]
[null,null,null,"Responsibility for Filling Gap",null,null,null,null,null,null,null,null,null,null,null,0]
[]
[]
[]
[]
[]
[]
[null,null,null,"Journal Notes/Process Narrative (optional)"]

{"sheet":"THIRA #9 Cybersecurity","index":21,"n_rows":16,"n_cols":20,"rows_kept":16,"cut":false,"hidden":false,"merged":[[15,4,15,5],[2,3,2,7],[3,3,3,7],[3,13,3,14],[5,3,5,7],[6,3,10,3],[11,3,15,3],[11,4,11,5],[12,4,12,5],[13,4,13,5],[14,4,14,5]]}
[21]
[]
[{"$f":"MAX(B:B)","v":1},null,null,"Capability Target",null,null,null,null,null,null,null,null,null,null,null,null,null,null,"# NIMS Rows",{"$f":"MAX(J:J)","v":4}]
[null,{"$f":"ROW()-3","v":1},null,{"$f":"INDIRECT(\"'THIRA Steps 1-3'!$C$45\")","v":0},null,null,null,null,null,null,null,null,null,null,null,null,null,null,"# NIMS Started",{"$f":"SUM(K:K)","v":0}]
[null,null,null,null,null,null,null,null,null,null,null,null,null,null,null,null,null,null,"# NIMS Complete",{"$f":"SUM(L:L)","v":0}]
[null,null,null,"Resource Requirements",null,null,null,null,null,null,null,null,null,null,null,null,null,null,"# Other Rows",{"$f":"MAX(M:M)","v":4}]
[null,null,null,"NIMS-typed Resources","Category","Resource","Type","Number Required",null,null,null,null,null,null,null,null,null,null,"# Other Rows",{"$f":"SUM(N:N)","v":0}]
[{"$f":"LOOKUP(E8, Lists!A$236:A$245, Lists!B$236:B$245)","v":{"$error":"#N/A"}},null,{"$f":"VLOOKUP(F8, INDIRECT(\"Lists!$A$140:$B$\" & Lists!$C$245), 2, FALSE)","v":{"$error":"#N/A"}},null,null,null,null,null,null,1,{"$f":"IF(OR(E8<>\"\", F8<>\"\", G8<>\"\", H8<>\"\"), 1, 0)","v":0},{"$f":"IF(AND(E8<>\"\", F8<>\"\", G8<>\"\", H8<>\"\"), 1, 0)","v":0},null,null,null,null,null,null,"# Other",{"$f":"SUM(O:O)","v":0}]
[{"$f":"LOOKUP(E9, Lists!A$236:A$245, Lists!B$236:B$245)","v":{"$error":"#N/A"}},null,{"$f":"VLOOKUP(F9, INDIRECT(\"Lists!$A$140:$B$\" & Lists!$C$245), 2, FALSE)","v":{"$error":"#N/A"}},null,null,null,null,null,null,{"$f":"J8+1","v":2},{"$f":"IF(OR(E9<>\"\", F9<>\"\", G9<>\"\", H9<>\"\"), 1, 0)","v":0},{"$f":"IF(AND(E9<>\"\", F9<>\"\", G9<>\"\", H9<>\"\"), 1, 0)","v":0}]
[{"$f":"LOOKUP(E10, Lists!A$236:A$245, Lists!B$236:B$245)","v":{"$error":"#N/A"}},null,{"$f":"VLOOKUP(F10, INDIRECT(\"Lists!$A$140:$B$\" & Lists!$C$245), 2, FALSE)","v":{"$error":"#N/A"}},null,null,null,null,null,null,{"$f":"J9+1","v":3},{"$f":"IF(OR(E10<>\"\", F10<>\"\", G10<>\"\", H10<>\"\"), 1, 0)","v":0},{"$f":"IF(AND(E10<>\"\", F10<>\"\", G10<>\"\", H10<>\"\"), 1, 0)","v":0}]
[{"$f":"LOOKUP(E11, Lists!A$236:A$245, Lists!B$236:B$245)","v":{"$error":"#N/A"}},null,{"$f":"VLOOKUP(F11, INDIRECT(\"Lists!$A$140:$B$\" & Lists!$C$245), 2, FALSE)","v":{"$error":"#N/A"}},null,null,null,null,null,null,{"$f":"J10+1","v":4},{"$f":"IF(OR(E11<>\"\", F11<>\"\", G11<>\"\", H11<>\"\"), 1, 0)","v":0},{"$f":"IF(AND(E11<>\"\", F11<>\"\", G11<>\"\", H11<>\"\"), 1, 0)","v":0}]
[null,null,null,"Other\nResources","Resource\n(Example:  Case Management Team)",null,"Team/POETE\n","Number Required\n"]
[null,null,null,null,null,null,null,null,null,null,null,null,1,{"$f":"IF(OR(E13<>\"\", H13<>\"\"), 1, 0)","v":0},{"$f":"IF(AND(E13<>\"\", H13<>\"\"), 1, 0)","v":0}]
[null,null,null,null,null,null,null,null,null,null,null,null,{"$f":"M13+1","v":2},{"$f":"IF(OR(E14<>\"\", H14<>\"\"), 1, 0)","v":0},{"$f":"IF(AND(E14<>\"\", H14<>\"\"), 1, 0)","v":0}]
[null,null,null,null,null,null,null,null,null,null,null,null,{"$f":"M14+1","v":3},{"$f":"IF(OR(E15<>\"\", H15<>\"\"), 1, 0)","v":0},{"$f":"IF(AND(E15<>\"\", H15<>\"\"), 1, 0)","v":0}]
[null,null,null,null,null,null,null,null,null,null,null,null,{"$f":"M15+1","v":4},{"$f":"IF(OR(E16<>\"\", H16<>\"\"), 1, 0)","v":0},{"$f":"IF(AND(E16<>\"\", H16<>\"\"), 1, 0)","v":0}]

{"sheet":"SPR #9 Cybersecurity","index":22,"n_rows":41,"n_cols":19,"rows_kept":41,"cut":false,"hidden":true,"merged":[[2,3,2,7],[3,3,3,7],[5,3,5,7],[7,3,7,7],[12,3,14,3],[14,4,14,7],[8,4,8,7],[9,4,9,7],[10,4,10,7],[30,3,30,7],[31,3,31,7],[33,3,33,7],[40,3,40,7],[16,3,17,3],[19,3,20,3],[22,3,24,3],[24,4,24,7],[26,3,28,3],[28,4,28,7]]}
[21]
[]
[{"$f":"MAX(B:B)","v":1},null,null,"Capability Target"]
[null,{"$f":"ROW()-3","v":1},null,{"$f":"INDIRECT(\"'THIRA Steps 1-3'!$C$45\")","v":0}]
[]
[null,null,null,"Capability Assessment"]
[]
[null,null,null,"Priority"]
[null,null,null,null,"Relative to the other core capabilities, efforts to build and/or sustain this core capability are of high importance to my jurisdiction’s preparedness activities.",null,null,null,null,null,null,null,null,null,null,0]
[null,null,null,null,"Relative to the other core capabilities, efforts to build and/or sustain this core capability are of medium importance to my jurisdiction’s preparedness activities."]
[null,null,null,null,"Relative to the other core capabilities, efforts to build and/or sustain this core capability are of low importance to my jurisdiction’s preparedness activities."]
[]
[null,null,null,"Planning","Rating\nInternal Capability","Rating\nInternal Capability + Mutual Aid","Gap Description","Recent Advances (optional)"]
[null,null,null,null,{"$f":"LOOKUP(P14, Lists!$C$2:$C$8, Lists!D2:D8)","v":"No selection made"},{"$f":"LOOKUP(Q14, Lists!$C$2:$C$8, Lists!D2:D8)","v":"No selection made"},null,null,null,null,null,null,null,null,null,1,1,{"$f":"COUNTIF(I15:AC15, \"TRUE\")","v":0},0]
[null,null,null,null,"Gap Description\nWhich of the following best represent your community's primary planning gaps?",null,null,null,false,false,false,false,false,false,false,false,false]
[]
[null,null,null,"Organization","Rating\nInternal Capability","Rating\nInternal Capability + Mutual Aid","Gap Description","Recent Advances (optional)"]
[null,null,null,null,{"$f":"LOOKUP(P18, Lists!$C$2:$C$8, Lists!E2:E8)","v":"No selection made"},{"$f":"LOOKUP(Q18, Lists!$C$2:$C$8, Lists!E2:E8)","v":"No selection made"},null,null,null,null,null,null,null,null,null,1,1,0]
[]
[null,null,null,"Equipment","Rating\nInternal Capability","Rating\nInternal Capability + Mutual Aid","Gap Description","Recent Advances (optional)"]
[null,null,null,null,{"$f":"LOOKUP(P21, Lists!$C$2:$C$8, Lists!F2:F8)","v":"No selection made"},{"$f":"LOOKUP(Q21, Lists!$C$2:$C$8, Lists!F2:F8)","v":"No selection made"},null,null,null,null,null,null,null,null,null,1,1,0]
[]
[null,null,null,"Training","Rating\nInternal Capability","Rating\nInternal Capability + Mutual Aid","Gap Description","Recent Advances (optional)"]
[null,null,null,null,{"$f":"LOOKUP(P24, Lists!$C$2:$C$8, Lists!G2:G8)","v":"No selection made"},{"$f":"LOOKUP(Q24, Lists!$C$2:$C$8, Lists!G2:G8)","v":"No selection made"},null,null,null,null,null,null,null,null,null,1,1,{"$f":"COUNTIF(I25:S25, \"TRUE\")","v":0},0]
[null,null,null,null,"Gap Description\nWhich of the following best represent your community's primary training gaps?",null,null,null,false,false,false,false,false,false,false,false,false,false,false]
[]
[null,null,null,"Exercises","Rating\nInternal Capability","Rating\nInternal Capability + Mutual Aid","Gap Description","Recent Advances (optional)"]
[null,null,null,null,{"$f":"LOOKUP(P28, Lists!$C$2:$C$8, Lists!H2:H8)","v":"No selection made"},{"$f":"LOOKUP(Q28, Lists!$C$2:$C$8, Lists!H2:H8)","v":"No selection made"},null,null,null,null,null,null,null,null,null,1,1,{"$f":"COUNTIF(I29:AA29, \"TRUE\")","v":0},0]
[null,null,null,null,"Gap Description\nWhich of the following best represent your community's primary exercises gaps?",null,null,null,false,false,false,false,false,false,false,false]
[]
[null,null,null,"Assessment Corroboration"]
[null,null,null,null,null,null,null,null,{"$f":"IF(J32=2,TRUE,IF(J32=3,FALSE,\"\"))","v":""},1]
[]
[null,null,null,"Responsibility for Filling Gap",null,null,null,null,null,null,null,null,null,null,null,0]
[]
[]
[]
[]
[]
[]
[null,null,null,"Journal Notes/Process Narrative (optional)"]

{"sheet":"THIRA #10 Phys Protect Meas","index":23,"n_rows":16,"n_cols":20,"rows_kept":16,"cut":false,"hidden":false,"merged":[[15,4,15,5],[2,3,2,7],[3,3,3,7],[3,13,3,14],[5,3,5,7],[6,3,10,3],[11,3,15,3],[11,4,11,5],[12,4,12,5],[13,4,13,5],[14,4,14,5]]}
[21]
[]
[{"$f":"MAX(B:B)","v":1},null,null,"Capability Target",null,null,null,null,null,null,null,null,null,null,null,null,null,null,"# NIMS Rows",{"$f":"MAX(J:J)","v":4}]
[null,{"$f":"ROW()-3","v":1},null,{"$f":"INDIRECT(\"'THIRA Steps 1-3'!$C$49\")","v":0},null,null,null,null,null,null,null,null,null,null,null,null,null,null,"# NIMS Started",{"$f":"SUM(K:K)","v":0}]
[null,null,null,null,null,null,null,null,null,null,null,null,null,null,null,null,null,null,"# NIMS Complete",{"$f":"SUM(L:L)","v":0}]
[null,null,null,"Resource Requirements",null,null,null,null,null,null,null,null,null,null,null,null,null,null,"# Other Rows",{"$f":"MAX(M:M)","v":4}]
[null,null,null,"NIMS-typed Resources","Category","Resource","Type","Number Required",null,null,null,null,null,null,null,null,null,null,"# Other Rows",{"$f":"SUM(N:N)","v":0}]
[{"$f":"LOOKUP(E8, Lists!A$236:A$245, Lists!B$236:B$245)","v":{"$error":"#N/A"}},null,{"$f":"VLOOKUP(F8, INDIRECT(\"Lists!$A$140:$B$\" & Lists!$C$245), 2, FALSE)","v":{"$error":"#N/A"}},null,null,null,null,null,null,1,{"$f":"IF(OR(E8<>\"\", F8<>\"\", G8<>\"\", H8<>\"\"), 1, 0)","v":0},{"$f":"IF(AND(E8<>\"\", F8<>\"\", G8<>\"\", H8<>\"\"), 1, 0)","v":0},null,null,null,null,null,null,"# Other",{"$f":"SUM(O:O)","v":0}]
[{"$f":"LOOKUP(E9, Lists!A$236:A$245, Lists!B$236:B$245)","v":{"$error":"#N/A"}},null,{"$f":"VLOOKUP(F9, INDIRECT(\"Lists!$A$140:$B$\" & Lists!$C$245), 2, FALSE)","v":{"$error":"#N/A"}},null,null,null,null,null,null,{"$f":"J8+1","v":2},{"$f":"IF(OR(E9<>\"\", F9<>\"\", G9<>\"\", H9<>\"\"), 1, 0)","v":0},{"$f":"IF(AND(E9<>\"\", F9<>\"\", G9<>\"\", H9<>\"\"), 1, 0)","v":0}]
[{"$f":"LOOKUP(E10, Lists!A$236:A$245, Lists!B$236:B$245)","v":{"$error":"#N/A"}},null,{"$f":"VLOOKUP(F10, INDIRECT(\"Lists!$A$140:$B$\" & Lists!$C$245), 2, FALSE)","v":{"$error":"#N/A"}},null,null,null,null,null,null,{"$f":"J9+1","v":3},{"$f":"IF(OR(E10<>\"\", F10<>\"\", G10<>\"\", H10<>\"\"), 1, 0)","v":0},{"$f":"IF(AND(E10<>\"\", F10<>\"\", G10<>\"\", H10<>\"\"), 1, 0)","v":0}]
[{"$f":"LOOKUP(E11, Lists!A$236:A$245, Lists!B$236:B$245)","v":{"$error":"#N/A"}},null,{"$f":"VLOOKUP(F11, INDIRECT(\"Lists!$A$140:$B$\" & Lists!$C$245), 2, FALSE)","v":{"$error":"#N/A"}},null,null,null,null,null,null,{"$f":"J10+1","v":4},{"$f":"IF(OR(E11<>\"\", F11<>\"\", G11<>\"\", H11<>\"\"), 1, 0)","v":0},{"$f":"IF(AND(E11<>\"\", F11<>\"\", G11<>\"\", H11<>\"\"), 1, 0)","v":0}]
[null,null,null,"Other\nResources","Resource\n(Example:  Case Management Team)",null,"Team/POETE\n","Number Required\n"]
[null,null,null,null,null,null,null,null,null,null,null,null,1,{"$f":"IF(OR(E13<>\"\", H13<>\"\"), 1, 0)","v":0},{"$f":"IF(AND(E13<>\"\", H13<>\"\"), 1, 0)","v":0}]
[null,null,null,null,null,null,null,null,null,null,null,null,{"$f":"M13+1","v":2},{"$f":"IF(OR(E14<>\"\", H14<>\"\"), 1, 0)","v":0},{"$f":"IF(AND(E14<>\"\", H14<>\"\"), 1, 0)","v":0}]
[null,null,null,null,null,null,null,null,null,null,null,null,{"$f":"M14+1","v":3},{"$f":"IF(OR(E15<>\"\", H15<>\"\"), 1, 0)","v":0},{"$f":"IF(AND(E15<>\"\", H15<>\"\"), 1, 0)","v":0}]
[null,null,null,null,null,null,null,null,null,null,null,null,{"$f":"M15+1","v":4},{"$f":"IF(OR(E16<>\"\", H16<>\"\"), 1, 0)","v":0},{"$f":"IF(AND(E16<>\"\", H16<>\"\"), 1, 0)","v":0}]

{"sheet":"SPR #10 Phys Protect Meas","index":24,"n_rows":41,"n_cols":19,"rows_kept":41,"cut":false,"hidden":true,"merged":[[2,3,2,7],[3,3,3,7],[5,3,5,7],[7,3,7,7],[12,3,14,3],[14,4,14,7],[8,4,8,7],[9,4,9,7],[10,4,10,7],[30,3,30,7],[31,3,31,7],[33,3,33,7],[40,3,40,7],[16,3,17,3],[19,3,20,3],[22,3,24,3],[24,4,24,7],[26,3,28,3],[28,4,28,7]]}
[21]
[]
[{"$f":"MAX(B:B)","v":1},null,null,"Capability Target"]
[null,{"$f":"ROW()-3","v":1},null,{"$f":"INDIRECT(\"'THIRA Steps 1-3'!$C$49\")","v":0}]
[]
[null,null,null,"Capability Assessment"]
[]
[null,null,null,"Priority"]
[null,null,null,null,"Relative to the other core capabilities, efforts to build and/or sustain this core capability are of high importance to my jurisdiction’s preparedness activities.",null,null,null,null,null,null,null,null,null,null,0]
[null,null,null,null,"Relative to the other core capabilities, efforts to build and/or sustain this core capability are of medium importance to my jurisdiction’s preparedness activities."]
[null,null,null,null,"Relative to the other core capabilities, efforts to build and/or sustain this core capability are of low importance to my jurisdiction’s preparedness activities."]
[]
[null,null,null,"Planning","Rating\nInternal Capability","Rating\nInternal Capability + Mutual Aid","Gap Description","Recent Advances (optional)"]
[null,null,null,null,{"$f":"LOOKUP(P14, Lists!$C$2:$C$8, Lists!D2:D8)","v":"No selection made"},{"$f":"LOOKUP(Q14, Lists!$C$2:$C$8, Lists!D2:D8)","v":"No selection made"},null,null,null,null,null,null,null,null,null,1,1,{"$f":"COUNTIF(I15:AC15, \"TRUE\")","v":0},0]
[null,null,null,null,"Gap Description\nWhich of the following best represent your community's primary planning gaps?",null,null,null,false,false,false,false,false,false,false,false,false]
[]
[null,null,null,"Organization","Rating\nInternal Capability","Rating\nInternal Capability + Mutual Aid","Gap Description","Recent Advances (optional)"]
[null,null,null,null,{"$f":"LOOKUP(P18, Lists!$C$2:$C$8, Lists!E2:E8)","v":"No selection made"},{"$f":"LOOKUP(Q18, Lists!$C$2:$C$8, Lists!E2:E8)","v":"No selection made"},null,null,null,null,null,null,null,null,null,1,1,0]
[]
[null,null,null,"Equipment","Rating\nInternal Capability","Rating\nInternal Capability + Mutual Aid","Gap Description","Recent Advances (optional)"]
[null,null,null,null,{"$f":"LOOKUP(P21, Lists!$C$2:$C$8, Lists!F2:F8)","v":"No selection made"},{"$f":"LOOKUP(Q21, Lists!$C$2:$C$8, Lists!F2:F8)","v":"No selection made"},null,null,null,null,null,null,null,null,null,1,1,0]
[]
[null,null,null,"Training","Rating\nInternal Capability","Rating\nInternal Capability + Mutual Aid","Gap Description","Recent Advances (optional)"]
[null,null,null,null,{"$f":"LOOKUP(P24, Lists!$C$2:$C$8, Lists!G2:G8)","v":"No selection made"},{"$f":"LOOKUP(Q24, Lists!$C$2:$C$8, Lists!G2:G8)","v":"No selection made"},null,null,null,null,null,null,null,null,null,1,1,{"$f":"COUNTIF(I25:S25, \"TRUE\")","v":0},0]
[null,null,null,null,"Gap Description\nWhich of the following best represent your community's primary training gaps?",null,null,null,false,false,false,false,false,false,false,false,false,false,false]
[]
[null,null,null,"Exercises","Rating\nInternal Capability","Rating\nInternal Capability + Mutual Aid","Gap Description","Recent Advances (optional)"]
[null,null,null,null,{"$f":"LOOKUP(P28, Lists!$C$2:$C$8, Lists!H2:H8)","v":"No selection made"},{"$f":"LOOKUP(Q28, Lists!$C$2:$C$8, Lists!H2:H8)","v":"No selection made"},null,null,null,null,null,null,null,null,null,1,1,{"$f":"COUNTIF(I29:AA29, \"TRUE\")","v":0},0]
[null,null,null,null,"Gap Description\nWhich of the following best represent your community's primary exercises gaps?",null,null,null,false,false,false,false,false,false,false,false]
[]
[null,null,null,"Assessment Corroboration"]
[null,null,null,null,null,null,null,null,{"$f":"IF(J32=2,TRUE,IF(J32=3,FALSE,\"\"))","v":""},1]
[]
[null,null,null,"Responsibility for Filling Gap",null,null,null,null,null,null,null,null,null,null,null,0]
[]
[]
[]
[]
[]
[]
[null,null,null,"Journal Notes/Process Narrative (optional)"]

{"sheet":"THIRA #11 Risk Mgmt Protect","index":25,"n_rows":16,"n_cols":20,"rows_kept":16,"cut":false,"hidden":false,"merged":[[15,4,15,5],[2,3,2,7],[3,3,3,7],[3,13,3,14],[5,3,5,7],[6,3,10,3],[11,3,15,3],[11,4,11,5],[12,4,12,5],[13,4,13,5],[14,4,14,5]]}
[21]
[]
[{"$f":"MAX(B:B)","v":1},null,null,"Capability Target",null,null,null,null,null,null,null,null,null,null,null,null,null,null,"# NIMS Rows",{"$f":"MAX(J:J)","v":4}]
[null,{"$f":"ROW()-3","v":1},null,{"$f":"INDIRECT(\"'THIRA Steps 1-3'!$C$53\")","v":0},null,null,null,null,null,null,null,null,null,null,null,null,null,null,"# NIMS Started",{"$f":"SUM(K:K)","v":0}]
[null,null,null,null,null,null,null,null,null,null,null,null,null,null,null,null,null,null,"# NIMS Complete",{"$f":"SUM(L:L)","v":0}]
[null,null,null,"Resource Requirements",null,null,null,null,null,null,null,null,null,null,null,null,null,null,"# Other Rows",{"$f":"MAX(M:M)","v":4}]
[null,null,null,"NIMS-typed Resources","Category","Resource","Type","Number Required",null,null,null,null,null,null,null,null,null,null,"# Other Rows",{"$f":"SUM(N:N)","v":0}]
[{"$f":"LOOKUP(E8, Lists!A$236:A$245, Lists!B$236:B$245)","v":{"$error":"#N/A"}},null,{"$f":"VLOOKUP(F8, INDIRECT(\"Lists!$A$140:$B$\" & Lists!$C$245), 2, FALSE)","v":{"$error":"#N/A"}},null,null,null,null,null,null,1,{"$f":"IF(OR(E8<>\"\", F8<>\"\", G8<>\"\", H8<>\"\"), 1, 0)","v":0},{"$f":"IF(AND(E8<>\"\", F8<>\"\", G8<>\"\", H8<>\"\"), 1, 0)","v":0},null,null,null,null,null,null,"# Other",{"$f":"SUM(O:O)","v":0}]
[{"$f":"LOOKUP(E9, Lists!A$236:A$245, Lists!B$236:B$245)","v":{"$error":"#N/A"}},null,{"$f":"VLOOKUP(F9, INDIRECT(\"Lists!$A$140:$B$\" & Lists!$C$245), 2, FALSE)","v":{"$error":"#N/A"}},null,null,null,null,null,null,{"$f":"J8+1","v":2},{"$f":"IF(OR(E9<>\"\", F9<>\"\", G9<>\"\", H9<>\"\"), 1, 0)","v":0},{"$f":"IF(AND(E9<>\"\", F9<>\"\", G9<>\"\", H9<>\"\"), 1, 0)","v":0}]
[{"$f":"LOOKUP(E10, Lists!A$236:A$245, Lists!B$236:B$245)","v":{"$error":"#N/A"}},null,{"$f":"VLOOKUP(F10, INDIRECT(\"Lists!$A$140:$B$\" & Lists!$C$245), 2, FALSE)","v":{"$error":"#N/A"}},null,null,null,null,null,null,{"$f":"J9+1","v":3},{"$f":"IF(OR(E10<>\"\", F10<>\"\", G10<>\"\", H10<>\"\"), 1, 0)","v":0},{"$f":"IF(AND(E10<>\"\", F10<>\"\", G10<>\"\", H10<>\"\"), 1, 0)","v":0}]
[{"$f":"LOOKUP(E11, Lists!A$236:A$245, Lists!B$236:B$245)","v":{"$error":"#N/A"}},null,{"$f":"VLOOKUP(F11, INDIRECT(\"Lists!$A$140:$B$\" & Lists!$C$245), 2, FALSE)","v":{"$error":"#N/A"}},null,null,null,null,null,null,{"$f":"J10+1","v":4},{"$f":"IF(OR(E11<>\"\", F11<>\"\", G11<>\"\", H11<>\"\"), 1, 0)","v":0},{"$f":"IF(AND(E11<>\"\", F11<>\"\", G11<>\"\", H11<>\"\"), 1, 0)","v":0}]
[null,null,null,"Other\nResources","Resource\n(Example:  Case Management Team)",null,"Team/POETE\n","Number Required\n"]
[null,null,null,null,null,null,null,null,null,null,null,null,1,{"$f":"IF(OR(E13<>\"\", H13<>\"\"), 1, 0)","v":0},{"$f":"IF(AND(E13<>\"\", H13<>\"\"), 1, 0)","v":0}]
[null,null,null,null,null,null,null,null,null,null,null,null,{"$f":"M13+1","v":2},{"$f":"IF(OR(E14<>\"\", H14<>\"\"), 1, 0)","v":0},{"$f":"IF(AND(E14<>\"\", H14<>\"\"), 1, 0)","v":0}]
[null,null,null,null,null,null,null,null,null,null,null,null,{"$f":"M14+1","v":3},{"$f":"IF(OR(E15<>\"\", H15<>\"\"), 1, 0)","v":0},{"$f":"IF(AND(E15<>\"\", H15<>\"\"), 1, 0)","v":0}]
[null,null,null,null,null,null,null,null,null,null,null,null,{"$f":"M15+1","v":4},{"$f":"IF(OR(E16<>\"\", H16<>\"\"), 1, 0)","v":0},{"$f":"IF(AND(E16<>\"\", H16<>\"\"), 1, 0)","v":0}]

{"sheet":"SPR #11 Risk Mgmt Protect","index":26,"n_rows":41,"n_cols":19,"rows_kept":41,"cut":false,"hidden":true,"merged":[[2,3,2,7],[3,3,3,7],[5,3,5,7],[7,3,7,7],[12,3,14,3],[14,4,14,7],[8,4,8,7],[9,4,9,7],[10,4,10,7],[30,3,30,7],[31,3,31,7],[33,3,33,7],[40,3,40,7],[16,3,17,3],[19,3,20,3],[22,3,24,3],[24,4,24,7],[26,3,28,3],[28,4,28,7]]}
[21]
[]
[{"$f":"MAX(B:B)","v":1},null,null,"Capability Target"]
[null,{"$f":"ROW()-3","v":1},null,{"$f":"INDIRECT(\"'THIRA Steps 1-3'!$C$53\")","v":0}]
[]
[null,null,null,"Capability Assessment"]
[]
[null,null,null,"Priority"]
[null,null,null,null,"Relative to the other core capabilities, efforts to build and/or sustain this core capability are of high importance to my jurisdiction’s preparedness activities.",null,null,null,null,null,null,null,null,null,null,0]
[null,null,null,null,"Relative to the other core capabilities, efforts to build and/or sustain this core capability are of medium importance to my jurisdiction’s preparedness activities."]
[null,null,null,null,"Relative to the other core capabilities, efforts to build and/or sustain this core capability are of low importance to my jurisdiction’s preparedness activities."]
[]
[null,null,null,"Planning","Rating\nInternal Capability","Rating\nInternal Capability + Mutual Aid","Gap Description","Recent Advances (optional)"]
[null,null,null,null,{"$f":"LOOKUP(P14, Lists!$C$2:$C$8, Lists!D2:D8)","v":"No selection made"},{"$f":"LOOKUP(Q14, Lists!$C$2:$C$8, Lists!D2:D8)","v":"No selection made"},null,null,null,null,null,null,null,null,null,1,1,{"$f":"COUNTIF(I15:AC15, \"TRUE\")","v":0},0]
[null,null,null,null,"Gap Description\nWhich of the following best represent your community's primary planning gaps?",null,null,null,false,false,false,false,false,false,false,false,false]
[]
[null,null,null,"Organization","Rating\nInternal Capability","Rating\nInternal Capability + Mutual Aid","Gap Description","Recent Advances (optional)"]
[null,null,null,null,{"$f":"LOOKUP(P18, Lists!$C$2:$C$8, Lists!E2:E8)","v":"No selection made"},{"$f":"LOOKUP(Q18, Lists!$C$2:$C$8, Lists!E2:E8)","v":"No selection made"},null,null,null,null,null,null,null,null,null,1,1,0]
[]
[null,null,null,"Equipment","Rating\nInternal Capability","Rating\nInternal Capability + Mutual Aid","Gap Description","Recent Advances (optional)"]
[null,null,null,null,{"$f":"LOOKUP(P21, Lists!$C$2:$C$8, Lists!F2:F8)","v":"No selection made"},{"$f":"LOOKUP(Q21, Lists!$C$2:$C$8, Lists!F2:F8)","v":"No selection made"},null,null,null,null,null,null,null,null,null,1,1,0]
[]
[null,null,null,"Training","Rating\nInternal Capability","Rating\nInternal Capability + Mutual Aid","Gap Description","Recent Advances (optional)"]
[null,null,null,null,{"$f":"LOOKUP(P24, Lists!$C$2:$C$8, Lists!G2:G8)","v":"No selection made"},{"$f":"LOOKUP(Q24, Lists!$C$2:$C$8, Lists!G2:G8)","v":"No selection made"},null,null,null,null,null,null,null,null,null,1,1,{"$f":"COUNTIF(I25:S25, \"TRUE\")","v":0},0]
[null,null,null,null,"Gap Description\nWhich of the following best represent your community's primary training gaps?",null,null,null,false,false,false,false,false,false,false,false,false,false,false]
[]
[null,null,null,"Exercises","Rating\nInternal Capability","Rating\nInternal Capability + Mutual Aid","Gap Description","Recent Advances (optional)"]
[null,null,null,null,{"$f":"LOOKUP(P28, Lists!$C$2:$C$8, Lists!H2:H8)","v":"No selection made"},{"$f":"LOOKUP(Q28, Lists!$C$2:$C$8, Lists!H2:H8)","v":"No selection made"},null,null,null,null,null,null,null,null,null,1,1,{"$f":"COUNTIF(I29:AA29, \"TRUE\")","v":0},0]
[null,null,null,null,"Gap Description\nWhich of the following best represent your community's primary exercises gaps?",null,null,null,false,false,false,false,false,false,false,false]
[]
[null,null,null,"Assessment Corroboration"]
[null,null,null,null,null,null,null,null,{"$f":"IF(J32=2,TRUE,IF(J32=3,FALSE,\"\"))","v":""},1]
[]
[null,null,null,"Responsibility for Filling Gap",null,null,null,null,null,null,null,null,null,null,null,0]
[]
[]
[]
[]
[]
[]
[null,null,null,"Journal Notes/Process Narrative (optional)"]

{"sheet":"THIRA #12 Supply Chain","index":27,"n_rows":16,"n_cols":20,"rows_kept":16,"cut":false,"hidden":false,"merged":[[15,4,15,5],[2,3,2,7],[3,3,3,7],[3,13,3,14],[5,3,5,7],[6,3,10,3],[11,3,15,3],[11,4,11,5],[12,4,12,5],[13,4,13,5],[14,4,14,5]]}
[21]
[]
[{"$f":"MAX(B:B)","v":1},null,null,"Capability Target",null,null,null,null,null,null,null,null,null,null,null,null,null,null,"# NIMS Rows",{"$f":"MAX(J:J)","v":4}]
[null,{"$f":"ROW()-3","v":1},null,{"$f":"INDIRECT(\"'THIRA Steps 1-3'!$C$57\")","v":0},null,null,null,null,null,null,null,null,null,null,null,null,null,null,"# NIMS Started",{"$f":"SUM(K:K)","v":0}]
[null,null,null,null,null,null,null,null,null,null,null,null,null,null,null,null,null,null,"# NIMS Complete",{"$f":"SUM(L:L)","v":0}]
[null,null,null,"Resource Requirements",null,null,null,null,null,null,null,null,null,null,null,null,null,null,"# Other Rows",{"$f":"MAX(M:M)","v":4}]
[null,null,null,"NIMS-typed Resources","Category","Resource","Type","Number Required",null,null,null,null,null,null,null,null,null,null,"# Other Rows",{"$f":"SUM(N:N)","v":0}]
[{"$f":"LOOKUP(E8, Lists!A$236:A$245, Lists!B$236:B$245)","v":{"$error":"#N/A"}},null,{"$f":"VLOOKUP(F8, INDIRECT(\"Lists!$A$140:$B$\" & Lists!$C$245), 2, FALSE)","v":{"$error":"#N/A"}},null,null,null,null,null,null,1,{"$f":"IF(OR(E8<>\"\", F8<>\"\", G8<>\"\", H8<>\"\"), 1, 0)","v":0},{"$f":"IF(AND(E8<>\"\", F8<>\"\", G8<>\"\", H8<>\"\"), 1, 0)","v":0},null,null,null,null,null,null,"# Other",{"$f":"SUM(O:O)","v":0}]
[{"$f":"LOOKUP(E9, Lists!A$236:A$245, Lists!B$236:B$245)","v":{"$error":"#N/A"}},null,{"$f":"VLOOKUP(F9, INDIRECT(\"Lists!$A$140:$B$\" & Lists!$C$245), 2, FALSE)","v":{"$error":"#N/A"}},null,null,null,null,null,null,{"$f":"J8+1","v":2},{"$f":"IF(OR(E9<>\"\", F9<>\"\", G9<>\"\", H9<>\"\"), 1, 0)","v":0},{"$f":"IF(AND(E9<>\"\", F9<>\"\", G9<>\"\", H9<>\"\"), 1, 0)","v":0}]
[{"$f":"LOOKUP(E10, Lists!A$236:A$245, Lists!B$236:B$245)","v":{"$error":"#N/A"}},null,{"$f":"VLOOKUP(F10, INDIRECT(\"Lists!$A$140:$B$\" & Lists!$C$245), 2, FALSE)","v":{"$error":"#N/A"}},null,null,null,null,null,null,{"$f":"J9+1","v":3},{"$f":"IF(OR(E10<>\"\", F10<>\"\", G10<>\"\", H10<>\"\"), 1, 0)","v":0},{"$f":"IF(AND(E10<>\"\", F10<>\"\", G10<>\"\", H10<>\"\"), 1, 0)","v":0}]
[{"$f":"LOOKUP(E11, Lists!A$236:A$245, Lists!B$236:B$245)","v":{"$error":"#N/A"}},null,{"$f":"VLOOKUP(F11, INDIRECT(\"Lists!$A$140:$B$\" & Lists!$C$245), 2, FALSE)","v":{"$error":"#N/A"}},null,null,null,null,null,null,{"$f":"J10+1","v":4},{"$f":"IF(OR(E11<>\"\", F11<>\"\", G11<>\"\", H11<>\"\"), 1, 0)","v":0},{"$f":"IF(AND(E11<>\"\", F11<>\"\", G11<>\"\", H11<>\"\"), 1, 0)","v":0}]
[null,null,null,"Other\nResources","Resource\n(Example:  Case Management Team)",null,"Team/POETE\n","Number Required\n"]
[null,null,null,null,null,null,null,null,null,null,null,null,1,{"$f":"IF(OR(E13<>\"\", H13<>\"\"), 1, 0)","v":0},{"$f":"IF(AND(E13<>\"\", H13<>\"\"), 1, 0)","v":0}]
[null,null,null,null,null,null,null,null,null,null,null,null,{"$f":"M13+1","v":2},{"$f":"IF(OR(E14<>\"\", H14<>\"\"), 1, 0)","v":0},{"$f":"IF(AND(E14<>\"\", H14<>\"\"), 1, 0)","v":0}]
[null,null,null,null,null,null,null,null,null,null,null,null,{"$f":"M14+1","v":3},{"$f":"IF(OR(E15<>\"\", H15<>\"\"), 1, 0)","v":0},{"$f":"IF(AND(E15<>\"\", H15<>\"\"), 1, 0)","v":0}]
[null,null,null,null,null,null,null,null,null,null,null,null,{"$f":"M15+1","v":4},{"$f":"IF(OR(E16<>\"\", H16<>\"\"), 1, 0)","v":0},{"$f":"IF(AND(E16<>\"\", H16<>\"\"), 1, 0)","v":0}]

{"sheet":"SPR #12 Supply Chain","index":28,"n_rows":41,"n_cols":19,"rows_kept":41,"cut":false,"hidden":true,"merged":[[2,3,2,7],[3,3,3,7],[5,3,5,7],[7,3,7,7],[12,3,14,3],[14,4,14,7],[8,4,8,7],[9,4,9,7],[10,4,10,7],[30,3,30,7],[31,3,31,7],[33,3,33,7],[40,3,40,7],[16,3,17,3],[19,3,20,3],[22,3,24,3],[24,4,24,7],[26,3,28,3],[28,4,28,7]]}
[21]
[]
[{"$f":"MAX(B:B)","v":1},null,null,"Capability Target"]
[null,{"$f":"ROW()-3","v":1},null,{"$f":"INDIRECT(\"'THIRA Steps 1-3'!$C$57\")","v":0}]
[]
[null,null,null,"Capability Assessment"]
[]
[null,null,null,"Priority"]
[null,null,null,null,"Relative to the other core capabilities, efforts to build and/or sustain this core capability are of high importance to my jurisdiction’s preparedness activities.",null,null,null,null,null,null,null,null,null,null,0]
[null,null,null,null,"Relative to the other core capabilities, efforts to build and/or sustain this core capability are of medium importance to my jurisdiction’s preparedness activities."]
[null,null,null,null,"Relative to the other core capabilities, efforts to build and/or sustain this core capability are of low importance to my jurisdiction’s preparedness activities."]
[]
[null,null,null,"Planning","Rating\nInternal Capability","Rating\nInternal Capability + Mutual Aid","Gap Description","Recent Advances (optional)"]
[null,null,null,null,{"$f":"LOOKUP(P14, Lists!$C$2:$C$8, Lists!D2:D8)","v":"No selection made"},{"$f":"LOOKUP(Q14, Lists!$C$2:$C$8, Lists!D2:D8)","v":"No selection made"},null,null,null,null,null,null,null,null,null,1,1,{"$f":"COUNTIF(I15:AC15, \"TRUE\")","v":0},0]
[null,null,null,null,"Gap Description\nWhich of the following best represent your community's primary planning gaps?",null,null,null,false,false,false,false,false,false,false,false,false]
[]
[null,null,null,"Organization","Rating\nInternal Capability","Rating\nInternal Capability + Mutual Aid","Gap Description","Recent Advances (optional)"]
[null,null,null,null,{"$f":"LOOKUP(P18, Lists!$C$2:$C$8, Lists!E2:E8)","v":"No selection made"},{"$f":"LOOKUP(Q18, Lists!$C$2:$C$8, Lists!E2:E8)","v":"No selection made"},null,null,null,null,null,null,null,null,null,1,1,0]
[]
[null,null,null,"Equipment","Rating\nInternal Capability","Rating\nInternal Capability + Mutual Aid","Gap Description","Recent Advances (optional)"]
[null,null,null,null,{"$f":"LOOKUP(P21, Lists!$C$2:$C$8, Lists!F2:F8)","v":"No selection made"},{"$f":"LOOKUP(Q21, Lists!$C$2:$C$8, Lists!F2:F8)","v":"No selection made"},null,null,null,null,null,null,null,null,null,1,1,0]
[]
[null,null,null,"Training","Rating\nInternal Capability","Rating\nInternal Capability + Mutual Aid","Gap Description","Recent Advances (optional)"]
[null,null,null,null,{"$f":"LOOKUP(P24, Lists!$C$2:$C$8, Lists!G2:G8)","v":"No selection made"},{"$f":"LOOKUP(Q24, Lists!$C$2:$C$8, Lists!G2:G8)","v":"No selection made"},null,null,null,null,null,null,null,null,null,1,1,{"$f":"COUNTIF(I25:S25, \"TRUE\")","v":0},0]
[null,null,null,null,"Gap Description\nWhich of the following best represent your community's primary training gaps?",null,null,null,false,false,false,false,false,false,false,false,false,false,false]
[]
[null,null,null,"Exercises","Rating\nInternal Capability","Rating\nInternal Capability + Mutual Aid","Gap Description","Recent Advances (optional)"]
[null,null,null,null,{"$f":"LOOKUP(P28, Lists!$C$2:$C$8, Lists!H2:H8)","v":"No selection made"},{"$f":"LOOKUP(Q28, Lists!$C$2:$C$8, Lists!H2:H8)","v":"No selection made"},null,null,null,null,null,null,null,null,null,1,1,{"$f":"COUNTIF(I29:AA29, \"TRUE\")","v":0},0]
[null,null,null,null,"Gap Description\nWhich of the following best represent your community's primary exercises gaps?",null,null,null,false,false,false,false,false,false,false,false]
[]
[null,null,null,"Assessment Corroboration"]
[null,null,null,null,null,null,null,null,{"$f":"IF(J32=2,TRUE,IF(J32=3,FALSE,\"\"))","v":""},1]
[]
[null,null,null,"Responsibility for Filling Gap",null,null,null,null,null,null,null,null,null,null,null,0]
[]
[]
[]
[]
[]
[]
[null,null,null,"Journal Notes/Process Narrative (optional)"]

{"sheet":"THIRA #13 Comm Resilience","index":29,"n_rows":16,"n_cols":20,"rows_kept":16,"cut":false,"hidden":false,"merged":[[15,4,15,5],[2,3,2,7],[3,3,3,7],[3,13,3,14],[5,3,5,7],[6,3,10,3],[11,3,15,3],[11,4,11,5],[12,4,12,5],[13,4,13,5],[14,4,14,5]]}
[21]
[]
[{"$f":"MAX(B:B)","v":1},null,null,"Capability Target",null,null,null,null,null,null,null,null,null,null,null,null,null,null,"# NIMS Rows",{"$f":"MAX(J:J)","v":4}]
[null,{"$f":"ROW()-3","v":1},null,{"$f":"INDIRECT(\"'THIRA Steps 1-3'!$C$61\")","v":0},null,null,null,null,null,null,null,null,null,null,null,null,null,null,"# NIMS Started",{"$f":"SUM(K:K)","v":0}]
[null,null,null,null,null,null,null,null,null,null,null,null,null,null,null,null,null,null,"# NIMS Complete",{"$f":"SUM(L:L)","v":0}]
[null,null,null,"Resource Requirements",null,null,null,null,null,null,null,null,null,null,null,null,null,null,"# Other Rows",{"$f":"MAX(M:M)","v":4}]
[null,null,null,"NIMS-typed Resources","Category","Resource","Type","Number Required",null,null,null,null,null,null,null,null,null,null,"# Other Rows",{"$f":"SUM(N:N)","v":0}]
[{"$f":"LOOKUP(E8, Lists!A$236:A$245, Lists!B$236:B$245)","v":{"$error":"#N/A"}},null,{"$f":"VLOOKUP(F8, INDIRECT(\"Lists!$A$140:$B$\" & Lists!$C$245), 2, FALSE)","v":{"$error":"#N/A"}},null,null,null,null,null,null,1,{"$f":"IF(OR(E8<>\"\", F8<>\"\", G8<>\"\", H8<>\"\"), 1, 0)","v":0},{"$f":"IF(AND(E8<>\"\", F8<>\"\", G8<>\"\", H8<>\"\"), 1, 0)","v":0},null,null,null,null,null,null,"# Other",{"$f":"SUM(O:O)","v":0}]
[{"$f":"LOOKUP(E9, Lists!A$236:A$245, Lists!B$236:B$245)","v":{"$error":"#N/A"}},null,{"$f":"VLOOKUP(F9, INDIRECT(\"Lists!$A$140:$B$\" & Lists!$C$245), 2, FALSE)","v":{"$error":"#N/A"}},null,null,null,null,null,null,{"$f":"J8+1","v":2},{"$f":"IF(OR(E9<>\"\", F9<>\"\", G9<>\"\", H9<>\"\"), 1, 0)","v":0},{"$f":"IF(AND(E9<>\"\", F9<>\"\", G9<>\"\", H9<>\"\"), 1, 0)","v":0}]
[{"$f":"LOOKUP(E10, Lists!A$236:A$245, Lists!B$236:B$245)","v":{"$error":"#N/A"}},null,{"$f":"VLOOKUP(F10, INDIRECT(\"Lists!$A$140:$B$\" & Lists!$C$245), 2, FALSE)","v":{"$error":"#N/A"}},null,null,null,null,null,null,{"$f":"J9+1","v":3},{"$f":"IF(OR(E10<>\"\", F10<>\"\", G10<>\"\", H10<>\"\"), 1, 0)","v":0},{"$f":"IF(AND(E10<>\"\", F10<>\"\", G10<>\"\", H10<>\"\"), 1, 0)","v":0}]
[{"$f":"LOOKUP(E11, Lists!A$236:A$245, Lists!B$236:B$245)","v":{"$error":"#N/A"}},null,{"$f":"VLOOKUP(F11, INDIRECT(\"Lists!$A$140:$B$\" & Lists!$C$245), 2, FALSE)","v":{"$error":"#N/A"}},null,null,null,null,null,null,{"$f":"J10+1","v":4},{"$f":"IF(OR(E11<>\"\", F11<>\"\", G11<>\"\", H11<>\"\"), 1, 0)","v":0},{"$f":"IF(AND(E11<>\"\", F11<>\"\", G11<>\"\", H11<>\"\"), 1, 0)","v":0}]
[null,null,null,"Other\nResources","Resource\n(Example:  Case Management Team)",null,"Team/POETE\n","Number Required\n"]
[null,null,null,null,null,null,null,null,null,null,null,null,1,{"$f":"IF(OR(E13<>\"\", H13<>\"\"), 1, 0)","v":0},{"$f":"IF(AND(E13<>\"\", H13<>\"\"), 1, 0)","v":0}]
[null,null,null,null,null,null,null,null,null,null,null,null,{"$f":"M13+1","v":2},{"$f":"IF(OR(E14<>\"\", H14<>\"\"), 1, 0)","v":0},{"$f":"IF(AND(E14<>\"\", H14<>\"\"), 1, 0)","v":0}]
[null,null,null,null,null,null,null,null,null,null,null,null,{"$f":"M14+1","v":3},{"$f":"IF(OR(E15<>\"\", H15<>\"\"), 1, 0)","v":0},{"$f":"IF(AND(E15<>\"\", H15<>\"\"), 1, 0)","v":0}]
[null,null,null,null,null,null,null,null,null,null,null,null,{"$f":"M15+1","v":4},{"$f":"IF(OR(E16<>\"\", H16<>\"\"), 1, 0)","v":0},{"$f":"IF(AND(E16<>\"\", H16<>\"\"), 1, 0)","v":0}]

{"sheet":"SPR #13 Comm Resilience","index":30,"n_rows":41,"n_cols":19,"rows_kept":41,"cut":false,"hidden":true,"merged":[[2,3,2,7],[3,3,3,7],[5,3,5,7],[7,3,7,7],[12,3,14,3],[14,4,14,7],[8,4,8,7],[9,4,9,7],[10,4,10,7],[30,3,30,7],[31,3,31,7],[33,3,33,7],[40,3,40,7],[16,3,17,3],[19,3,20,3],[22,3,24,3],[24,4,24,7],[26,3,28,3],[28,4,28,7]]}
[21]
[]
[{"$f":"MAX(B:B)","v":1},null,null,"Capability Target"]
[null,{"$f":"ROW()-3","v":1},null,{"$f":"INDIRECT(\"'THIRA Steps 1-3'!$C$61\")","v":0}]
[]
[null,null,null,"Capability Assessment"]
[]
[null,null,null,"Priority"]
[null,null,null,null,"Relative to the other core capabilities, efforts to build and/or sustain this core capability are of high importance to my jurisdiction’s preparedness activities.",null,null,null,null,null,null,null,null,null,null,0]
[null,null,null,null,"Relative to the other core capabilities, efforts to build and/or sustain this core capability are of medium importance to my jurisdiction’s preparedness activities."]
[null,null,null,null,"Relative to the other core capabilities, efforts to build and/or sustain this core capability are of low importance to my jurisdiction’s preparedness activities."]
[]
[null,null,null,"Planning","Rating\nInternal Capability","Rating\nInternal Capability + Mutual Aid","Gap Description","Recent Advances (optional)"]
[null,null,null,null,{"$f":"LOOKUP(P14, Lists!$C$2:$C$8, Lists!D2:D8)","v":"No selection made"},{"$f":"LOOKUP(Q14, Lists!$C$2:$C$8, Lists!D2:D8)","v":"No selection made"},null,null,null,null,null,null,null,null,null,1,1,{"$f":"COUNTIF(I15:AC15, \"TRUE\")","v":0},0]
[null,null,null,null,"Gap Description\nWhich of the following best represent your community's primary planning gaps?",null,null,null,false,false,false,false,false,false,false,false,false]
[]
[null,null,null,"Organization","Rating\nInternal Capability","Rating\nInternal Capability + Mutual Aid","Gap Description","Recent Advances (optional)"]
[null,null,null,null,{"$f":"LOOKUP(P18, Lists!$C$2:$C$8, Lists!E2:E8)","v":"No selection made"},{"$f":"LOOKUP(Q18, Lists!$C$2:$C$8, Lists!E2:E8)","v":"No selection made"},null,null,null,null,null,null,null,null,null,1,1,0]
[]
[null,null,null,"Equipment","Rating\nInternal Capability","Rating\nInternal Capability + Mutual Aid","Gap Description","Recent Advances (optional)"]
[null,null,null,null,{"$f":"LOOKUP(P21, Lists!$C$2:$C$8, Lists!F2:F8)","v":"No selection made"},{"$f":"LOOKUP(Q21, Lists!$C$2:$C$8, Lists!F2:F8)","v":"No selection made"},null,null,null,null,null,null,null,null,null,1,1,0]
[]
[null,null,null,"Training","Rating\nInternal Capability","Rating\nInternal Capability + Mutual Aid","Gap Description","Recent Advances (optional)"]
[null,null,null,null,{"$f":"LOOKUP(P24, Lists!$C$2:$C$8, Lists!G2:G8)","v":"No selection made"},{"$f":"LOOKUP(Q24, Lists!$C$2:$C$8, Lists!G2:G8)","v":"No selection made"},null,null,null,null,null,null,null,null,null,1,1,{"$f":"COUNTIF(I25:S25, \"TRUE\")","v":0},0]
[null,null,null,null,"Gap Description\nWhich of the following best represent your community's primary training gaps?",null,null,null,false,false,false,false,false,false,false,false,false,false,false]
[]
[null,null,null,"Exercises","Rating\nInternal Capability","Rating\nInternal Capability + Mutual Aid","Gap Description","Recent Advances (optional)"]
[null,null,null,null,{"$f":"LOOKUP(P28, Lists!$C$2:$C$8, Lists!H2:H8)","v":"No selection made"},{"$f":"LOOKUP(Q28, Lists!$C$2:$C$8, Lists!H2:H8)","v":"No selection made"},null,null,null,null,null,null,null,null,null,1,1,{"$f":"COUNTIF(I29:AA29, \"TRUE\")","v":0},0]
[null,null,null,null,"Gap Description\nWhich of the following best represent your community's primary exercises gaps?",null,null,null,false,false,false,false,false,false,false,false]
[]
[null,null,null,"Assessment Corroboration"]
[null,null,null,null,null,null,null,null,{"$f":"IF(J32=2,TRUE,IF(J32=3,FALSE,\"\"))","v":""},1]
[]
[null,null,null,"Responsibility for Filling Gap",null,null,null,null,null,null,null,null,null,null,null,0]
[]
[]
[]
[]
[]
[]
[null,null,null,"Journal Notes/Process Narrative (optional)"]

{"sheet":"THIRA #14 Long Term Vul Red","index":31,"n_rows":16,"n_cols":20,"rows_kept":16,"cut":false,"hidden":false,"merged":[[15,4,15,5],[2,3,2,7],[3,3,3,7],[3,13,3,14],[5,3,5,7],[6,3,10,3],[11,3,15,3],[11,4,11,5],[12,4,12,5],[13,4,13,5],[14,4,14,5]]}
[21]
[]
[{"$f":"MAX(B:B)","v":1},null,null,"Capability Target",null,null,null,null,null,null,null,null,null,null,null,null,null,null,"# NIMS Rows",{"$f":"MAX(J:J)","v":4}]
[null,{"$f":"ROW()-3","v":1},null,{"$f":"INDIRECT(\"'THIRA Steps 1-3'!$C$65\")","v":0},null,null,null,null,null,null,null,null,null,null,null,null,null,null,"# NIMS Started",{"$f":"SUM(K:K)","v":0}]
[null,null,null,null,null,null,null,null,null,null,null,null,null,null,null,null,null,null,"# NIMS Complete",{"$f":"SUM(L:L)","v":0}]
[null,null,null,"Resource Requirements",null,null,null,null,null,null,null,null,null,null,null,null,null,null,"# Other Rows",{"$f":"MAX(M:M)","v":4}]
[null,null,null,"NIMS-typed Resources","Category","Resource","Type","Number Required",null,null,null,null,null,null,null,null,null,null,"# Other Rows",{"$f":"SUM(N:N)","v":0}]
[{"$f":"LOOKUP(E8, Lists!A$236:A$245, Lists!B$236:B$245)","v":{"$error":"#N/A"}},null,{"$f":"VLOOKUP(F8, INDIRECT(\"Lists!$A$140:$B$\" & Lists!$C$245), 2, FALSE)","v":{"$error":"#N/A"}},null,null,null,null,null,null,1,{"$f":"IF(OR(E8<>\"\", F8<>\"\", G8<>\"\", H8<>\"\"), 1, 0)","v":0},{"$f":"IF(AND(E8<>\"\", F8<>\"\", G8<>\"\", H8<>\"\"), 1, 0)","v":0},null,null,null,null,null,null,"# Other",{"$f":"SUM(O:O)","v":0}]
[{"$f":"LOOKUP(E9, Lists!A$236:A$245, Lists!B$236:B$245)","v":{"$error":"#N/A"}},null,{"$f":"VLOOKUP(F9, INDIRECT(\"Lists!$A$140:$B$\" & Lists!$C$245), 2, FALSE)","v":{"$error":"#N/A"}},null,null,null,null,null,null,{"$f":"J8+1","v":2},{"$f":"IF(OR(E9<>\"\", F9<>\"\", G9<>\"\", H9<>\"\"), 1, 0)","v":0},{"$f":"IF(AND(E9<>\"\", F9<>\"\", G9<>\"\", H9<>\"\"), 1, 0)","v":0}]
[{"$f":"LOOKUP(E10, Lists!A$236:A$245, Lists!B$236:B$245)","v":{"$error":"#N/A"}},null,{"$f":"VLOOKUP(F10, INDIRECT(\"Lists!$A$140:$B$\" & Lists!$C$245), 2, FALSE)","v":{"$error":"#N/A"}},null,null,null,null,null,null,{"$f":"J9+1","v":3},{"$f":"IF(OR(E10<>\"\", F10<>\"\", G10<>\"\", H10<>\"\"), 1, 0)","v":0},{"$f":"IF(AND(E10<>\"\", F10<>\"\", G10<>\"\", H10<>\"\"), 1, 0)","v":0}]
[{"$f":"LOOKUP(E11, Lists!A$236:A$245, Lists!B$236:B$245)","v":{"$error":"#N/A"}},null,{"$f":"VLOOKUP(F11, INDIRECT(\"Lists!$A$140:$B$\" & Lists!$C$245), 2, FALSE)","v":{"$error":"#N/A"}},null,null,null,null,null,null,{"$f":"J10+1","v":4},{"$f":"IF(OR(E11<>\"\", F11<>\"\", G11<>\"\", H11<>\"\"), 1, 0)","v":0},{"$f":"IF(AND(E11<>\"\", F11<>\"\", G11<>\"\", H11<>\"\"), 1, 0)","v":0}]
[null,null,null,"Other\nResources","Resource\n(Example:  Case Management Team)",null,"Team/POETE\n","Number Required\n"]
[null,null,null,null,null,null,null,null,null,null,null,null,1,{"$f":"IF(OR(E13<>\"\", H13<>\"\"), 1, 0)","v":0},{"$f":"IF(AND(E13<>\"\", H13<>\"\"), 1, 0)","v":0}]
[null,null,null,null,null,null,null,null,null,null,null,null,{"$f":"M13+1","v":2},{"$f":"IF(OR(E14<>\"\", H14<>\"\"), 1, 0)","v":0},{"$f":"IF(AND(E14<>\"\", H14<>\"\"), 1, 0)","v":0}]
[null,null,null,null,null,null,null,null,null,null,null,null,{"$f":"M14+1","v":3},{"$f":"IF(OR(E15<>\"\", H15<>\"\"), 1, 0)","v":0},{"$f":"IF(AND(E15<>\"\", H15<>\"\"), 1, 0)","v":0}]
[null,null,null,null,null,null,null,null,null,null,null,null,{"$f":"M15+1","v":4},{"$f":"IF(OR(E16<>\"\", H16<>\"\"), 1, 0)","v":0},{"$f":"IF(AND(E16<>\"\", H16<>\"\"), 1, 0)","v":0}]

{"sheet":"SPR #14 Long Term Vul Red","index":32,"n_rows":41,"n_cols":19,"rows_kept":41,"cut":false,"hidden":true,"merged":[[2,3,2,7],[3,3,3,7],[5,3,5,7],[7,3,7,7],[12,3,14,3],[14,4,14,7],[8,4,8,7],[9,4,9,7],[10,4,10,7],[30,3,30,7],[31,3,31,7],[33,3,33,7],[40,3,40,7],[16,3,17,3],[19,3,20,3],[22,3,24,3],[24,4,24,7],[26,3,28,3],[28,4,28,7]]}
[21]
[]
[{"$f":"MAX(B:B)","v":1},null,null,"Capability Target"]
[null,{"$f":"ROW()-3","v":1},null,{"$f":"INDIRECT(\"'THIRA Steps 1-3'!$C$65\")","v":0}]
[]
[null,null,null,"Capability Assessment"]
[]
[null,null,null,"Priority"]
[null,null,null,null,"Relative to the other core capabilities, efforts to build and/or sustain this core capability are of high importance to my jurisdiction’s preparedness activities.",null,null,null,null,null,null,null,null,null,null,0]
[null,null,null,null,"Relative to the other core capabilities, efforts to build and/or sustain this core capability are of medium importance to my jurisdiction’s preparedness activities."]
[null,null,null,null,"Relative to the other core capabilities, efforts to build and/or sustain this core capability are of low importance to my jurisdiction’s preparedness activities."]
[]
[null,null,null,"Planning","Rating\nInternal Capability","Rating\nInternal Capability + Mutual Aid","Gap Description","Recent Advances (optional)"]
[null,null,null,null,{"$f":"LOOKUP(P14, Lists!$C$2:$C$8, Lists!D2:D8)","v":"No selection made"},{"$f":"LOOKUP(Q14, Lists!$C$2:$C$8, Lists!D2:D8)","v":"No selection made"},null,null,null,null,null,null,null,null,null,1,1,{"$f":"COUNTIF(I15:AC15, \"TRUE\")","v":0},0]
[null,null,null,null,"Gap Description\nWhich of the following best represent your community's primary planning gaps?",null,null,null,false,false,false,false,false,false,false,false,false]
[]
[null,null,null,"Organization","Rating\nInternal Capability","Rating\nInternal Capability + Mutual Aid","Gap Description","Recent Advances (optional)"]
[null,null,null,null,{"$f":"LOOKUP(P18, Lists!$C$2:$C$8, Lists!E2:E8)","v":"No selection made"},{"$f":"LOOKUP(Q18, Lists!$C$2:$C$8, Lists!E2:E8)","v":"No selection made"},null,null,null,null,null,null,null,null,null,1,1,0]
[]
[null,null,null,"Equipment","Rating\nInternal Capability","Rating\nInternal Capability + Mutual Aid","Gap Description","Recent Advances (optional)"]
[null,null,null,null,{"$f":"LOOKUP(P21, Lists!$C$2:$C$8, Lists!F2:F8)","v":"No selection made"},{"$f":"LOOKUP(Q21, Lists!$C$2:$C$8, Lists!F2:F8)","v":"No selection made"},null,null,null,null,null,null,null,null,null,1,1,0]
[]
[null,null,null,"Training","Rating\nInternal Capability","Rating\nInternal Capability + Mutual Aid","Gap Description","Recent Advances (optional)"]
[null,null,null,null,{"$f":"LOOKUP(P24, Lists!$C$2:$C$8, Lists!G2:G8)","v":"No selection made"},{"$f":"LOOKUP(Q24, Lists!$C$2:$C$8, Lists!G2:G8)","v":"No selection made"},null,null,null,null,null,null,null,null,null,1,1,{"$f":"COUNTIF(I25:S25, \"TRUE\")","v":0},0]
[null,null,null,null,"Gap Description\nWhich of the following best represent your community's primary training gaps?",null,null,null,false,false,false,false,false,false,false,false,false,false,false]
[]
[null,null,null,"Exercises","Rating\nInternal Capability","Rating\nInternal Capability + Mutual Aid","Gap Description","Recent Advances (optional)"]
[null,null,null,null,{"$f":"LOOKUP(P28, Lists!$C$2:$C$8, Lists!H2:H8)","v":"No selection made"},{"$f":"LOOKUP(Q28, Lists!$C$2:$C$8, Lists!H2:H8)","v":"No selection made"},null,null,null,null,null,null,null,null,null,1,1,{"$f":"COUNTIF(I29:AA29, \"TRUE\")","v":0},0]
[null,null,null,null,"Gap Description\nWhich of the following best represent your community's primary exercises gaps?",null,null,null,false,false,false,false,false,false,false,false]
[]
[null,null,null,"Assessment Corroboration"]
[null,null,null,null,null,null,null,null,{"$f":"IF(J32=2,TRUE,IF(J32=3,FALSE,\"\"))","v":""},1]
[]
[null,null,null,"Responsibility for Filling Gap",null,null,null,null,null,null,null,null,null,null,null,0]
[]
[]
[]
[]
[]
[]
[null,null,null,"Journal Notes/Process Narrative (optional)"]

{"sheet":"THIRA #15 Risk Resil Assess","index":33,"n_rows":16,"n_cols":20,"rows_kept":16,"cut":false,"hidden":false,"merged":[[15,4,15,5],[2,3,2,7],[3,3,3,7],[3,13,3,14],[5,3,5,7],[6,3,10,3],[11,3,15,3],[11,4,11,5],[12,4,12,5],[13,4,13,5],[14,4,14,5]]}
[21]
[]
[{"$f":"MAX(B:B)","v":1},null,null,"Capability Target",null,null,null,null,null,null,null,null,null,null,null,null,null,null,"# NIMS Rows",{"$f":"MAX(J:J)","v":4}]
[null,{"$f":"ROW()-3","v":1},null,{"$f":"INDIRECT(\"'THIRA Steps 1-3'!$C$69\")","v":0},null,null,null,null,null,null,null,null,null,null,null,null,null,null,"# NIMS Started",{"$f":"SUM(K:K)","v":0}]
[null,null,null,null,null,null,null,null,null,null,null,null,null,null,null,null,null,null,"# NIMS Complete",{"$f":"SUM(L:L)","v":0}]
[null,null,null,"Resource Requirements",null,null,null,null,null,null,null,null,null,null,null,null,null,null,"# Other Rows",{"$f":"MAX(M:M)","v":4}]
[null,null,null,"NIMS-typed Resources","Category","Resource","Type","Number Required",null,null,null,null,null,null,null,null,null,null,"# Other Rows",{"$f":"SUM(N:N)","v":0}]
[{"$f":"LOOKUP(E8, Lists!A$236:A$245, Lists!B$236:B$245)","v":{"$error":"#N/A"}},null,{"$f":"VLOOKUP(F8, INDIRECT(\"Lists!$A$140:$B$\" & Lists!$C$245), 2, FALSE)","v":{"$error":"#N/A"}},null,null,null,null,null,null,1,{"$f":"IF(OR(E8<>\"\", F8<>\"\", G8<>\"\", H8<>\"\"), 1, 0)","v":0},{"$f":"IF(AND(E8<>\"\", F8<>\"\", G8<>\"\", H8<>\"\"), 1, 0)","v":0},null,null,null,null,null,null,"# Other",{"$f":"SUM(O:O)","v":0}]
[{"$f":"LOOKUP(E9, Lists!A$236:A$245, Lists!B$236:B$245)","v":{"$error":"#N/A"}},null,{"$f":"VLOOKUP(F9, INDIRECT(\"Lists!$A$140:$B$\" & Lists!$C$245), 2, FALSE)","v":{"$error":"#N/A"}},null,null,null,null,null,null,{"$f":"J8+1","v":2},{"$f":"IF(OR(E9<>\"\", F9<>\"\", G9<>\"\", H9<>\"\"), 1, 0)","v":0},{"$f":"IF(AND(E9<>\"\", F9<>\"\", G9<>\"\", H9<>\"\"), 1, 0)","v":0}]
[{"$f":"LOOKUP(E10, Lists!A$236:A$245, Lists!B$236:B$245)","v":{"$error":"#N/A"}},null,{"$f":"VLOOKUP(F10, INDIRECT(\"Lists!$A$140:$B$\" & Lists!$C$245), 2, FALSE)","v":{"$error":"#N/A"}},null,null,null,null,null,null,{"$f":"J9+1","v":3},{"$f":"IF(OR(E10<>\"\", F10<>\"\", G10<>\"\", H10<>\"\"), 1, 0)","v":0},{"$f":"IF(AND(E10<>\"\", F10<>\"\", G10<>\"\", H10<>\"\"), 1, 0)","v":0}]
[{"$f":"LOOKUP(E11, Lists!A$236:A$245, Lists!B$236:B$245)","v":{"$error":"#N/A"}},null,{"$f":"VLOOKUP(F11, INDIRECT(\"Lists!$A$140:$B$\" & Lists!$C$245), 2, FALSE)","v":{"$error":"#N/A"}},null,null,null,null,null,null,{"$f":"J10+1","v":4},{"$f":"IF(OR(E11<>\"\", F11<>\"\", G11<>\"\", H11<>\"\"), 1, 0)","v":0},{"$f":"IF(AND(E11<>\"\", F11<>\"\", G11<>\"\", H11<>\"\"), 1, 0)","v":0}]
[null,null,null,"Other\nResources","Resource\n(Example:  Case Management Team)",null,"Team/POETE\n","Number Required\n"]
[null,null,null,null,null,null,null,null,null,null,null,null,1,{"$f":"IF(OR(E13<>\"\", H13<>\"\"), 1, 0)","v":0},{"$f":"IF(AND(E13<>\"\", H13<>\"\"), 1, 0)","v":0}]
[null,null,null,null,null,null,null,null,null,null,null,null,{"$f":"M13+1","v":2},{"$f":"IF(OR(E14<>\"\", H14<>\"\"), 1, 0)","v":0},{"$f":"IF(AND(E14<>\"\", H14<>\"\"), 1, 0)","v":0}]
[null,null,null,null,null,null,null,null,null,null,null,null,{"$f":"M14+1","v":3},{"$f":"IF(OR(E15<>\"\", H15<>\"\"), 1, 0)","v":0},{"$f":"IF(AND(E15<>\"\", H15<>\"\"), 1, 0)","v":0}]
[null,null,null,null,null,null,null,null,null,null,null,null,{"$f":"M15+1","v":4},{"$f":"IF(OR(E16<>\"\", H16<>\"\"), 1, 0)","v":0},{"$f":"IF(AND(E16<>\"\", H16<>\"\"), 1, 0)","v":0}]

{"sheet":"SPR #15 Risk Resil Assess","index":34,"n_rows":41,"n_cols":19,"rows_kept":41,"cut":false,"hidden":true,"merged":[[2,3,2,7],[3,3,3,7],[5,3,5,7],[7,3,7,7],[12,3,14,3],[14,4,14,7],[8,4,8,7],[9,4,9,7],[10,4,10,7],[30,3,30,7],[31,3,31,7],[33,3,33,7],[40,3,40,7],[16,3,17,3],[19,3,20,3],[22,3,24,3],[24,4,24,7],[26,3,28,3],[28,4,28,7]]}
[21]
[]
[{"$f":"MAX(B:B)","v":1},null,null,"Capability Target"]
[null,{"$f":"ROW()-3","v":1},null,{"$f":"INDIRECT(\"'THIRA Steps 1-3'!$C$69\")","v":0}]
[]
[null,null,null,"Capability Assessment"]
[]
[null,null,null,"Priority"]
[null,null,null,null,"Relative to the other core capabilities, efforts to build and/or sustain this core capability are of high importance to my jurisdiction’s preparedness activities.",null,null,null,null,null,null,null,null,null,null,0]
[null,null,null,null,"Relative to the other core capabilities, efforts to build and/or sustain this core capability are of medium importance to my jurisdiction’s preparedness activities."]
[null,null,null,null,"Relative to the other core capabilities, efforts to build and/or sustain this core capability are of low importance to my jurisdiction’s preparedness activities."]
[]
[null,null,null,"Planning","Rating\nInternal Capability","Rating\nInternal Capability + Mutual Aid","Gap Description","Recent Advances (optional)"]
[null,null,null,null,{"$f":"LOOKUP(P14, Lists!$C$2:$C$8, Lists!D2:D8)","v":"No selection made"},{"$f":"LOOKUP(Q14, Lists!$C$2:$C$8, Lists!D2:D8)","v":"No selection made"},null,null,null,null,null,null,null,null,null,1,1,{"$f":"COUNTIF(I15:AC15, \"TRUE\")","v":0},0]
[null,null,null,null,"Gap Description\nWhich of the following best represent your community's primary planning gaps?",null,null,null,false,false,false,false,false,false,false,false,false]
[]
[null,null,null,"Organization","Rating\nInternal Capability","Rating\nInternal Capability + Mutual Aid","Gap Description","Recent Advances (optional)"]
[null,null,null,null,{"$f":"LOOKUP(P18, Lists!$C$2:$C$8, Lists!E2:E8)","v":"No selection made"},{"$f":"LOOKUP(Q18, Lists!$C$2:$C$8, Lists!E2:E8)","v":"No selection made"},null,null,null,null,null,null,null,null,null,1,1,0]
[]
[null,null,null,"Equipment","Rating\nInternal Capability","Rating\nInternal Capability + Mutual Aid","Gap Description","Recent Advances (optional)"]
[null,null,null,null,{"$f":"LOOKUP(P21, Lists!$C$2:$C$8, Lists!F2:F8)","v":"No selection made"},{"$f":"LOOKUP(Q21, Lists!$C$2:$C$8, Lists!F2:F8)","v":"No selection made"},null,null,null,null,null,null,null,null,null,1,1,0]
[]
[null,null,null,"Training","Rating\nInternal Capability","Rating\nInternal Capability + Mutual Aid","Gap Description","Recent Advances (optional)"]
[null,null,null,null,{"$f":"LOOKUP(P24, Lists!$C$2:$C$8, Lists!G2:G8)","v":"No selection made"},{"$f":"LOOKUP(Q24, Lists!$C$2:$C$8, Lists!G2:G8)","v":"No selection made"},null,null,null,null,null,null,null,null,null,1,1,{"$f":"COUNTIF(I25:S25, \"TRUE\")","v":0},0]
[null,null,null,null,"Gap Description\nWhich of the following best represent your community's primary training gaps?",null,null,null,false,false,false,false,false,false,false,false,false,false,false]
[]
[null,null,null,"Exercises","Rating\nInternal Capability","Rating\nInternal Capability + Mutual Aid","Gap Description","Recent Advances (optional)"]
[null,null,null,null,{"$f":"LOOKUP(P28, Lists!$C$2:$C$8, Lists!H2:H8)","v":"No selection made"},{"$f":"LOOKUP(Q28, Lists!$C$2:$C$8, Lists!H2:H8)","v":"No selection made"},null,null,null,null,null,null,null,null,null,1,1,{"$f":"COUNTIF(I29:AA29, \"TRUE\")","v":0},0]
[null,null,null,null,"Gap Description\nWhich of the following best represent your community's primary exercises gaps?",null,null,null,false,false,false,false,false,false,false,false]
[]
[null,null,null,"Assessment Corroboration"]
[null,null,null,null,null,null,null,null,{"$f":"IF(J32=2,TRUE,IF(J32=3,FALSE,\"\"))","v":""},1]
[]
[null,null,null,"Responsibility for Filling Gap",null,null,null,null,null,null,null,null,null,null,null,0]
[]
[]
[]
[]
[]
[]
[null,null,null,"Journal Notes/Process Narrative (optional)"]

{"sheet":"THIRA #16 Threat Haz ID","index":35,"n_rows":16,"n_cols":20,"rows_kept":16,"cut":false,"hidden":false,"merged":[[15,4,15,5],[2,3,2,7],[3,3,3,7],[3,13,3,14],[5,3,5,7],[6,3,10,3],[11,3,15,3],[11,4,11,5],[12,4,12,5],[13,4,13,5],[14,4,14,5]]}
[21]
[]
[{"$f":"MAX(B:B)","v":1},null,null,"Capability Target",null,null,null,null,null,null,null,null,null,null,null,null,null,null,"# NIMS Rows",{"$f":"MAX(J:J)","v":4}]
[null,{"$f":"ROW()-3","v":1},null,{"$f":"INDIRECT(\"'THIRA Steps 1-3'!$C$73\")","v":0},null,null,null,null,null,null,null,null,null,null,null,null,null,null,"# NIMS Started",{"$f":"SUM(K:K)","v":0}]
[null,null,null,null,null,null,null,null,null,null,null,null,null,null,null,null,null,null,"# NIMS Complete",{"$f":"SUM(L:L)","v":0}]
[null,null,null,"Resource Requirements",null,null,null,null,null,null,null,null,null,null,null,null,null,null,"# Other Rows",{"$f":"MAX(M:M)","v":4}]
[null,null,null,"NIMS-typed Resources","Category","Resource","Type","Number Required",null,null,null,null,null,null,null,null,null,null,"# Other Rows",{"$f":"SUM(N:N)","v":0}]
[{"$f":"LOOKUP(E8, Lists!A$236:A$245, Lists!B$236:B$245)","v":{"$error":"#N/A"}},null,{"$f":"VLOOKUP(F8, INDIRECT(\"Lists!$A$140:$B$\" & Lists!$C$245), 2, FALSE)","v":{"$error":"#N/A"}},null,null,null,null,null,null,1,{"$f":"IF(OR(E8<>\"\", F8<>\"\", G8<>\"\", H8<>\"\"), 1, 0)","v":0},{"$f":"IF(AND(E8<>\"\", F8<>\"\", G8<>\"\", H8<>\"\"), 1, 0)","v":0},null,null,null,null,null,null,"# Other",{"$f":"SUM(O:O)","v":0}]
[{"$f":"LOOKUP(E9, Lists!A$236:A$245, Lists!B$236:B$245)","v":{"$error":"#N/A"}},null,{"$f":"VLOOKUP(F9, INDIRECT(\"Lists!$A$140:$B$\" & Lists!$C$245), 2, FALSE)","v":{"$error":"#N/A"}},null,null,null,null,null,null,{"$f":"J8+1","v":2},{"$f":"IF(OR(E9<>\"\", F9<>\"\", G9<>\"\", H9<>\"\"), 1, 0)","v":0},{"$f":"IF(AND(E9<>\"\", F9<>\"\", G9<>\"\", H9<>\"\"), 1, 0)","v":0}]
[{"$f":"LOOKUP(E10, Lists!A$236:A$245, Lists!B$236:B$245)","v":{"$error":"#N/A"}},null,{"$f":"VLOOKUP(F10, INDIRECT(\"Lists!$A$140:$B$\" & Lists!$C$245), 2, FALSE)","v":{"$error":"#N/A"}},null,null,null,null,null,null,{"$f":"J9+1","v":3},{"$f":"IF(OR(E10<>\"\", F10<>\"\", G10<>\"\", H10<>\"\"), 1, 0)","v":0},{"$f":"IF(AND(E10<>\"\", F10<>\"\", G10<>\"\", H10<>\"\"), 1, 0)","v":0}]
[{"$f":"LOOKUP(E11, Lists!A$236:A$245, Lists!B$236:B$245)","v":{"$error":"#N/A"}},null,{"$f":"VLOOKUP(F11, INDIRECT(\"Lists!$A$140:$B$\" & Lists!$C$245), 2, FALSE)","v":{"$error":"#N/A"}},null,null,null,null,null,null,{"$f":"J10+1","v":4},{"$f":"IF(OR(E11<>\"\", F11<>\"\", G11<>\"\", H11<>\"\"), 1, 0)","v":0},{"$f":"IF(AND(E11<>\"\", F11<>\"\", G11<>\"\", H11<>\"\"), 1, 0)","v":0}]
[null,null,null,"Other\nResources","Resource\n(Example:  Case Management Team)",null,"Team/POETE\n","Number Required\n"]
[null,null,null,null,null,null,null,null,null,null,null,null,1,{"$f":"IF(OR(E13<>\"\", H13<>\"\"), 1, 0)","v":0},{"$f":"IF(AND(E13<>\"\", H13<>\"\"), 1, 0)","v":0}]
[null,null,null,null,null,null,null,null,null,null,null,null,{"$f":"M13+1","v":2},{"$f":"IF(OR(E14<>\"\", H14<>\"\"), 1, 0)","v":0},{"$f":"IF(AND(E14<>\"\", H14<>\"\"), 1, 0)","v":0}]
[null,null,null,null,null,null,null,null,null,null,null,null,{"$f":"M14+1","v":3},{"$f":"IF(OR(E15<>\"\", H15<>\"\"), 1, 0)","v":0},{"$f":"IF(AND(E15<>\"\", H15<>\"\"), 1, 0)","v":0}]
[null,null,null,null,null,null,null,null,null,null,null,null,{"$f":"M15+1","v":4},{"$f":"IF(OR(E16<>\"\", H16<>\"\"), 1, 0)","v":0},{"$f":"IF(AND(E16<>\"\", H16<>\"\"), 1, 0)","v":0}]

{"sheet":"SPR #16 Threat Haz ID","index":36,"n_rows":41,"n_cols":19,"rows_kept":41,"cut":false,"hidden":true,"merged":[[2,3,2,7],[3,3,3,7],[5,3,5,7],[7,3,7,7],[12,3,14,3],[14,4,14,7],[8,4,8,7],[9,4,9,7],[10,4,10,7],[30,3,30,7],[31,3,31,7],[33,3,33,7],[40,3,40,7],[16,3,17,3],[19,3,20,3],[22,3,24,3],[24,4,24,7],[26,3,28,3],[28,4,28,7]]}
[21]
[]
[{"$f":"MAX(B:B)","v":1},null,null,"Capability Target"]
[null,{"$f":"ROW()-3","v":1},null,{"$f":"INDIRECT(\"'THIRA Steps 1-3'!$C$73\")","v":0}]
[]
[null,null,null,"Capability Assessment"]
[]
[null,null,null,"Priority"]
[null,null,null,null,"Relative to the other core capabilities, efforts to build and/or sustain this core capability are of high importance to my jurisdiction’s preparedness activities.",null,null,null,null,null,null,null,null,null,null,0]
[null,null,null,null,"Relative to the other core capabilities, efforts to build and/or sustain this core capability are of medium importance to my jurisdiction’s preparedness activities."]
[null,null,null,null,"Relative to the other core capabilities, efforts to build and/or sustain this core capability are of low importance to my jurisdiction’s preparedness activities."]
[]
[null,null,null,"Planning","Rating\nInternal Capability","Rating\nInternal Capability + Mutual Aid","Gap Description","Recent Advances (optional)"]
[null,null,null,null,{"$f":"LOOKUP(P14, Lists!$C$2:$C$8, Lists!D2:D8)","v":"No selection made"},{"$f":"LOOKUP(Q14, Lists!$C$2:$C$8, Lists!D2:D8)","v":"No selection made"},null,null,null,null,null,null,null,null,null,1,1,{"$f":"COUNTIF(I15:AC15, \"TRUE\")","v":0},0]
[null,null,null,null,"Gap Description\nWhich of the following best represent your community's primary planning gaps?",null,null,null,false,false,false,false,false,false,false,false,false]
[]
[null,null,null,"Organization","Rating\nInternal Capability","Rating\nInternal Capability + Mutual Aid","Gap Description","Recent Advances (optional)"]
[null,null,null,null,{"$f":"LOOKUP(P18, Lists!$C$2:$C$8, Lists!E2:E8)","v":"No selection made"},{"$f":"LOOKUP(Q18, Lists!$C$2:$C$8, Lists!E2:E8)","v":"No selection made"},null,null,null,null,null,null,null,null,null,1,1,0]
[]
[null,null,null,"Equipment","Rating\nInternal Capability","Rating\nInternal Capability + Mutual Aid","Gap Description","Recent Advances (optional)"]
[null,null,null,null,{"$f":"LOOKUP(P21, Lists!$C$2:$C$8, Lists!F2:F8)","v":"No selection made"},{"$f":"LOOKUP(Q21, Lists!$C$2:$C$8, Lists!F2:F8)","v":"No selection made"},null,null,null,null,null,null,null,null,null,1,1,0]
[]
[null,null,null,"Training","Rating\nInternal Capability","Rating\nInternal Capability + Mutual Aid","Gap Description","Recent Advances (optional)"]
[null,null,null,null,{"$f":"LOOKUP(P24, Lists!$C$2:$C$8, Lists!G2:G8)","v":"No selection made"},{"$f":"LOOKUP(Q24, Lists!$C$2:$C$8, Lists!G2:G8)","v":"No selection made"},null,null,null,null,null,null,null,null,null,1,1,{"$f":"COUNTIF(I25:S25, \"TRUE\")","v":0},0]
[null,null,null,null,"Gap Description\nWhich of the following best represent your community's primary training gaps?",null,null,null,false,false,false,false,false,false,false,false,false,false,false]
[]
[null,null,null,"Exercises","Rating\nInternal Capability","Rating\nInternal Capability + Mutual Aid","Gap Description","Recent Advances (optional)"]
[null,null,null,null,{"$f":"LOOKUP(P28, Lists!$C$2:$C$8, Lists!H2:H8)","v":"No selection made"},{"$f":"LOOKUP(Q28, Lists!$C$2:$C$8, Lists!H2:H8)","v":"No selection made"},null,null,null,null,null,null,null,null,null,1,1,{"$f":"COUNTIF(I29:AA29, \"TRUE\")","v":0},0]
[null,null,null,null,"Gap Description\nWhich of the following best represent your community's primary exercises gaps?",null,null,null,false,false,false,false,false,false,false,false]
[]
[null,null,null,"Assessment Corroboration"]
[null,null,null,null,null,null,null,null,{"$f":"IF(J32=2,TRUE,IF(J32=3,FALSE,\"\"))","v":""},1]
[]
[null,null,null,"Responsibility for Filling Gap",null,null,null,null,null,null,null,null,null,null,null,0]
[]
[]
[]
[]
[]
[]
[null,null,null,"Journal Notes/Process Narrative (optional)"]

{"sheet":"THIRA #17 Crit Transport","index":37,"n_rows":24,"n_cols":20,"rows_kept":24,"cut":false,"hidden":false,"merged":[[23,4,23,5],[2,3,2,7],[3,3,3,7],[3,13,3,14],[5,3,5,7],[6,3,18,3],[19,3,23,3],[19,4,19,5],[20,4,20,5],[21,4,21,5],[22,4,22,5]]}
[21]
[]
[{"$f":"MAX(B:B)","v":1},null,null,"Capability Target",null,null,null,null,null,null,null,null,null,null,null,null,null,null,"# NIMS Rows",{"$f":"MAX(J:J)","v":12}]
[null,{"$f":"ROW()-3","v":1},null,{"$f":"INDIRECT(\"'THIRA Steps 1-3'!$C$77\")","v":0},null,null,null,null,null,null,null,null,null,null,null,null,null,null,"# NIMS Started",{"$f":"SUM(K:K)","v":0}]
[null,null,null,null,null,null,null,null,null,null,null,null,null,null,null,null,null,null,"# NIMS Complete",{"$f":"SUM(L:L)","v":0}]
[null,null,null,"Resource Requirements",null,null,null,null,null,null,null,null,null,null,null,null,null,null,"# Other Rows",{"$f":"MAX(M:M)","v":4}]
[null,null,null,"NIMS-typed Resources","Category","Resource","Type","Number Required",null,null,null,null,null,null,null,null,null,null,"# Other Rows",{"$f":"SUM(N:N)","v":0}]
[{"$f":"LOOKUP(E8, Lists!A$236:A$245, Lists!B$236:B$245)","v":{"$error":"#N/A"}},null,{"$f":"VLOOKUP(F8, INDIRECT(\"Lists!$A$140:$B$\" & Lists!$C$245), 2, FALSE)","v":{"$error":"#N/A"}},null,null,null,null,null,null,1,{"$f":"IF(OR(E8<>\"\", F8<>\"\", G8<>\"\", H8<>\"\"), 1, 0)","v":0},{"$f":"IF(AND(E8<>\"\", F8<>\"\", G8<>\"\", H8<>\"\"), 1, 0)","v":0},null,null,null,null,null,null,"# Other",{"$f":"SUM(O:O)","v":0}]
[{"$f":"LOOKUP(E9, Lists!A$236:A$245, Lists!B$236:B$245)","v":{"$error":"#N/A"}},null,{"$f":"VLOOKUP(F9, INDIRECT(\"Lists!$A$140:$B$\" & Lists!$C$245), 2, FALSE)","v":{"$error":"#N/A"}},null,null,null,null,null,null,{"$f":"J8+1","v":2},{"$f":"IF(OR(E9<>\"\", F9<>\"\", G9<>\"\", H9<>\"\"), 1, 0)","v":0},{"$f":"IF(AND(E9<>\"\", F9<>\"\", G9<>\"\", H9<>\"\"), 1, 0)","v":0}]
[{"$f":"LOOKUP(E10, Lists!A$236:A$245, Lists!B$236:B$245)","v":{"$error":"#N/A"}},null,{"$f":"VLOOKUP(F10, INDIRECT(\"Lists!$A$140:$B$\" & Lists!$C$245), 2, FALSE)","v":{"$error":"#N/A"}},null,null,null,null,null,null,{"$f":"J9+1","v":3},{"$f":"IF(OR(E10<>\"\", F10<>\"\", G10<>\"\", H10<>\"\"), 1, 0)","v":0},{"$f":"IF(AND(E10<>\"\", F10<>\"\", G10<>\"\", H10<>\"\"), 1, 0)","v":0}]
[{"$f":"LOOKUP(E11, Lists!A$236:A$245, Lists!B$236:B$245)","v":{"$error":"#N/A"}},null,{"$f":"VLOOKUP(F11, INDIRECT(\"Lists!$A$140:$B$\" & Lists!$C$245), 2, FALSE)","v":{"$error":"#N/A"}},null,null,null,null,null,null,{"$f":"J10+1","v":4},{"$f":"IF(OR(E11<>\"\", F11<>\"\", G11<>\"\", H11<>\"\"), 1, 0)","v":0},{"$f":"IF(AND(E11<>\"\", F11<>\"\", G11<>\"\", H11<>\"\"), 1, 0)","v":0}]
[{"$f":"LOOKUP(E12, Lists!A$236:A$245, Lists!B$236:B$245)","v":{"$error":"#N/A"}},null,{"$f":"VLOOKUP(F12, INDIRECT(\"Lists!$A$140:$B$\" & Lists!$C$245), 2, FALSE)","v":{"$error":"#N/A"}},null,null,null,null,null,null,{"$f":"J11+1","v":5},{"$f":"IF(OR(E12<>\"\", F12<>\"\", G12<>\"\", H12<>\"\"), 1, 0)","v":0},{"$f":"IF(AND(E12<>\"\", F12<>\"\", G12<>\"\", H12<>\"\"), 1, 0)","v":0}]
[{"$f":"LOOKUP(E13, Lists!A$236:A$245, Lists!B$236:B$245)","v":{"$error":"#N/A"}},null,{"$f":"VLOOKUP(F13, INDIRECT(\"Lists!$A$140:$B$\" & Lists!$C$245), 2, FALSE)","v":{"$error":"#N/A"}},null,null,null,null,null,null,{"$f":"J12+1","v":6},{"$f":"IF(OR(E13<>\"\", F13<>\"\", G13<>\"\", H13<>\"\"), 1, 0)","v":0},{"$f":"IF(AND(E13<>\"\", F13<>\"\", G13<>\"\", H13<>\"\"), 1, 0)","v":0}]
[{"$f":"LOOKUP(E14, Lists!A$236:A$245, Lists!B$236:B$245)","v":{"$error":"#N/A"}},null,{"$f":"VLOOKUP(F14, INDIRECT(\"Lists!$A$140:$B$\" & Lists!$C$245), 2, FALSE)","v":{"$error":"#N/A"}},null,null,null,null,null,null,7,{"$f":"IF(OR(E14<>\"\", F14<>\"\", G14<>\"\", H14<>\"\"), 1, 0)","v":0},{"$f":"IF(AND(E14<>\"\", F14<>\"\", G14<>\"\", H14<>\"\"), 1, 0)","v":0}]
[{"$f":"LOOKUP(E15, Lists!A$236:A$245, Lists!B$236:B$245)","v":{"$error":"#N/A"}},null,{"$f":"VLOOKUP(F15, INDIRECT(\"Lists!$A$140:$B$\" & Lists!$C$245), 2, FALSE)","v":{"$error":"#N/A"}},null,null,null,null,null,null,8,{"$f":"IF(OR(E15<>\"\", F15<>\"\", G15<>\"\", H15<>\"\"), 1, 0)","v":0},{"$f":"IF(AND(E15<>\"\", F15<>\"\", G15<>\"\", H15<>\"\"), 1, 0)","v":0}]
[{"$f":"LOOKUP(E16, Lists!A$236:A$245, Lists!B$236:B$245)","v":{"$error":"#N/A"}},null,{"$f":"VLOOKUP(F16, INDIRECT(\"Lists!$A$140:$B$\" & Lists!$C$245), 2, FALSE)","v":{"$error":"#N/A"}},null,null,null,null,null,null,9,{"$f":"IF(OR(E16<>\"\", F16<>\"\", G16<>\"\", H16<>\"\"), 1, 0)","v":0},{"$f":"IF(AND(E16<>\"\", F16<>\"\", G16<>\"\", H16<>\"\"), 1, 0)","v":0}]
[{"$f":"LOOKUP(E17, Lists!A$236:A$245, Lists!B$236:B$245)","v":{"$error":"#N/A"}},null,{"$f":"VLOOKUP(F17, INDIRECT(\"Lists!$A$140:$B$\" & Lists!$C$245), 2, FALSE)","v":{"$error":"#N/A"}},null,null,null,null,null,null,10,{"$f":"IF(OR(E17<>\"\", F17<>\"\", G17<>\"\", H17<>\"\"), 1, 0)","v":0},{"$f":"IF(AND(E17<>\"\", F17<>\"\", G17<>\"\", H17<>\"\"), 1, 0)","v":0}]
[{"$f":"LOOKUP(E18, Lists!A$236:A$245, Lists!B$236:B$245)","v":{"$error":"#N/A"}},null,{"$f":"VLOOKUP(F18, INDIRECT(\"Lists!$A$140:$B$\" & Lists!$C$245), 2, FALSE)","v":{"$error":"#N/A"}},null,null,null,null,null,null,11,{"$f":"IF(OR(E18<>\"\", F18<>\"\", G18<>\"\", H18<>\"\"), 1, 0)","v":0},{"$f":"IF(AND(E18<>\"\", F18<>\"\", G18<>\"\", H18<>\"\"), 1, 0)","v":0}]
[{"$f":"LOOKUP(E19, Lists!A$236:A$245, Lists!B$236:B$245)","v":{"$error":"#N/A"}},null,{"$f":"VLOOKUP(F19, INDIRECT(\"Lists!$A$140:$B$\" & Lists!$C$245), 2, FALSE)","v":{"$error":"#N/A"}},null,null,null,null,null,null,12,0,0]
[null,null,null,"Other\nResources","Resource\n(Example:  Case Management Team)",null,"Team/POETE\n","Number Required\n"]
[null,null,null,null,null,null,null,null,null,null,null,null,1,{"$f":"IF(OR(E21<>\"\", H21<>\"\"), 1, 0)","v":0},{"$f":"IF(AND(E21<>\"\", H21<>\"\"), 1, 0)","v":0}]
[null,null,null,null,null,null,null,null,null,null,null,null,{"$f":"M21+1","v":2},{"$f":"IF(OR(E22<>\"\", H22<>\"\"), 1, 0)","v":0},{"$f":"IF(AND(E22<>\"\", H22<>\"\"), 1, 0)","v":0}]
[null,null,null,null,null,null,null,null,null,null,null,null,{"$f":"M22+1","v":3},{"$f":"IF(OR(E23<>\"\", H23<>\"\"), 1, 0)","v":0},{"$f":"IF(AND(E23<>\"\", H23<>\"\"), 1, 0)","v":0}]
[null,null,null,null,null,null,null,null,null,null,null,null,{"$f":"M23+1","v":4},{"$f":"IF(OR(E24<>\"\", H24<>\"\"), 1, 0)","v":0},{"$f":"IF(AND(E24<>\"\", H24<>\"\"), 1, 0)","v":0}]

{"sheet":"SPR #17 Crit Transport","index":38,"n_rows":41,"n_cols":19,"rows_kept":41,"cut":false,"hidden":true,"merged":[[2,3,2,7],[3,3,3,7],[5,3,5,7],[7,3,7,7],[12,3,14,3],[14,4,14,7],[8,4,8,7],[9,4,9,7],[10,4,10,7],[30,3,30,7],[31,3,31,7],[33,3,33,7],[40,3,40,7],[16,3,17,3],[19,3,20,3],[22,3,24,3],[24,4,24,7],[26,3,28,3],[28,4,28,7]]}
[21]
[]
[{"$f":"MAX(B:B)","v":1},null,null,"Capability Target"]
[null,{"$f":"ROW()-3","v":1},null,{"$f":"INDIRECT(\"'THIRA Steps 1-3'!$C$77\")","v":0}]
[]
[null,null,null,"Capability Assessment"]
[]
[null,null,null,"Priority"]
[null,null,null,null,"Relative to the other core capabilities, efforts to build and/or sustain this core capability are of high importance to my jurisdiction’s preparedness activities.",null,null,null,null,null,null,null,null,null,null,0]
[null,null,null,null,"Relative to the other core capabilities, efforts to build and/or sustain this core capability are of medium importance to my jurisdiction’s preparedness activities."]
[null,null,null,null,"Relative to the other core capabilities, efforts to build and/or sustain this core capability are of low importance to my jurisdiction’s preparedness activities."]
[]
[null,null,null,"Planning","Rating\nInternal Capability","Rating\nInternal Capability + Mutual Aid","Gap Description","Recent Advances (optional)"]
[null,null,null,null,{"$f":"LOOKUP(P14, Lists!$C$2:$C$8, Lists!D2:D8)","v":"No selection made"},{"$f":"LOOKUP(Q14, Lists!$C$2:$C$8, Lists!D2:D8)","v":"No selection made"},null,null,null,null,null,null,null,null,null,1,1,{"$f":"COUNTIF(I15:AC15, \"TRUE\")","v":0},0]
[null,null,null,null,"Gap Description\nWhich of the following best represent your community's primary planning gaps?",null,null,null,false,false,false,false,false,false,false,false,false]
[]
[null,null,null,"Organization","Rating\nInternal Capability","Rating\nInternal Capability + Mutual Aid","Gap Description","Recent Advances (optional)"]
[null,null,null,null,{"$f":"LOOKUP(P18, Lists!$C$2:$C$8, Lists!E2:E8)","v":"No selection made"},{"$f":"LOOKUP(Q18, Lists!$C$2:$C$8, Lists!E2:E8)","v":"No selection made"},null,null,null,null,null,null,null,null,null,1,1,0]
[]
[null,null,null,"Equipment","Rating\nInternal Capability","Rating\nInternal Capability + Mutual Aid","Gap Description","Recent Advances (optional)"]
[null,null,null,null,{"$f":"LOOKUP(P21, Lists!$C$2:$C$8, Lists!F2:F8)","v":"No selection made"},{"$f":"LOOKUP(Q21, Lists!$C$2:$C$8, Lists!F2:F8)","v":"No selection made"},null,null,null,null,null,null,null,null,null,1,1,0]
[]
[null,null,null,"Training","Rating\nInternal Capability","Rating\nInternal Capability + Mutual Aid","Gap Description","Recent Advances (optional)"]
[null,null,null,null,{"$f":"LOOKUP(P24, Lists!$C$2:$C$8, Lists!G2:G8)","v":"No selection made"},{"$f":"LOOKUP(Q24, Lists!$C$2:$C$8, Lists!G2:G8)","v":"No selection made"},null,null,null,null,null,null,null,null,null,1,1,{"$f":"COUNTIF(I25:S25, \"TRUE\")","v":0},0]
[null,null,null,null,"Gap Description\nWhich of the following best represent your community's primary training gaps?",null,null,null,false,false,false,false,false,false,false,false,false,false,false]
[]
[null,null,null,"Exercises","Rating\nInternal Capability","Rating\nInternal Capability + Mutual Aid","Gap Description","Recent Advances (optional)"]
[null,null,null,null,{"$f":"LOOKUP(P28, Lists!$C$2:$C$8, Lists!H2:H8)","v":"No selection made"},{"$f":"LOOKUP(Q28, Lists!$C$2:$C$8, Lists!H2:H8)","v":"No selection made"},null,null,null,null,null,null,null,null,null,1,1,{"$f":"COUNTIF(I29:AA29, \"TRUE\")","v":0},0]
[null,null,null,null,"Gap Description\nWhich of the following best represent your community's primary exercises gaps?",null,null,null,false,false,false,false,false,false,false,false]
[]
[null,null,null,"Assessment Corroboration"]
[null,null,null,null,null,null,null,null,{"$f":"IF(J32=2,TRUE,IF(J32=3,FALSE,\"\"))","v":""},1]
[]
[null,null,null,"Responsibility for Filling Gap",null,null,null,null,null,null,null,null,null,null,null,0]
[]
[]
[]
[]
[]
[]
[null,null,null,"Journal Notes/Process Narrative (optional)"]

{"sheet":"THIRA #18 Envir Resp Health","index":39,"n_rows":29,"n_cols":20,"rows_kept":29,"cut":false,"hidden":false,"merged":[[28,4,28,5],[2,3,2,7],[3,3,3,7],[3,13,3,14],[5,3,5,7],[6,3,23,3],[24,3,28,3],[24,4,24,5],[25,4,25,5],[26,4,26,5],[27,4,27,5]]}
[21]
[]
[{"$f":"MAX(B:B)","v":1},null,null,"Capability Target",null,null,null,null,null,null,null,null,null,null,null,null,null,null,"# NIMS Rows",{"$f":"MAX(J:J)","v":17}]
[null,{"$f":"ROW()-3","v":1},null,{"$f":"INDIRECT(\"'THIRA Steps 1-3'!$C$81\")","v":0},null,null,null,null,null,null,null,null,null,null,null,null,null,null,"# NIMS Started",{"$f":"SUM(K:K)","v":0}]
[null,null,null,null,null,null,null,null,null,null,null,null,null,null,null,null,null,null,"# NIMS Complete",{"$f":"SUM(L:L)","v":0}]
[null,null,null,"Resource Requirements",null,null,null,null,null,null,null,null,null,null,null,null,null,null,"# Other Rows",{"$f":"MAX(M:M)","v":4}]
[null,null,null,"NIMS-typed Resources","Category","Resource","Type","Number Required",null,null,null,null,null,null,null,null,null,null,"# Other Rows",{"$f":"SUM(N:N)","v":0}]
[{"$f":"LOOKUP(E8, Lists!A$236:A$245, Lists!B$236:B$245)","v":{"$error":"#N/A"}},null,{"$f":"VLOOKUP(F8, INDIRECT(\"Lists!$A$140:$B$\" & Lists!$C$245), 2, FALSE)","v":{"$error":"#N/A"}},null,null,null,null,null,null,1,{"$f":"IF(OR(E8<>\"\", F8<>\"\", G8<>\"\", H8<>\"\"), 1, 0)","v":0},{"$f":"IF(AND(E8<>\"\", F8<>\"\", G8<>\"\", H8<>\"\"), 1, 0)","v":0},null,null,null,null,null,null,"# Other",{"$f":"SUM(O:O)","v":0}]
[{"$f":"LOOKUP(E9, Lists!A$236:A$245, Lists!B$236:B$245)","v":{"$error":"#N/A"}},null,{"$f":"VLOOKUP(F9, INDIRECT(\"Lists!$A$140:$B$\" & Lists!$C$245), 2, FALSE)","v":{"$error":"#N/A"}},null,null,null,null,null,null,{"$f":"J8+1","v":2},{"$f":"IF(OR(E9<>\"\", F9<>\"\", G9<>\"\", H9<>\"\"), 1, 0)","v":0},{"$f":"IF(AND(E9<>\"\", F9<>\"\", G9<>\"\", H9<>\"\"), 1, 0)","v":0}]
[{"$f":"LOOKUP(E10, Lists!A$236:A$245, Lists!B$236:B$245)","v":{"$error":"#N/A"}},null,{"$f":"VLOOKUP(F10, INDIRECT(\"Lists!$A$140:$B$\" & Lists!$C$245), 2, FALSE)","v":{"$error":"#N/A"}},null,null,null,null,null,null,{"$f":"J9+1","v":3},{"$f":"IF(OR(E10<>\"\", F10<>\"\", G10<>\"\", H10<>\"\"), 1, 0)","v":0},{"$f":"IF(AND(E10<>\"\", F10<>\"\", G10<>\"\", H10<>\"\"), 1, 0)","v":0}]
[{"$f":"LOOKUP(E11, Lists!A$236:A$245, Lists!B$236:B$245)","v":{"$error":"#N/A"}},null,{"$f":"VLOOKUP(F11, INDIRECT(\"Lists!$A$140:$B$\" & Lists!$C$245), 2, FALSE)","v":{"$error":"#N/A"}},null,null,null,null,null,null,{"$f":"J10+1","v":4},{"$f":"IF(OR(E11<>\"\", F11<>\"\", G11<>\"\", H11<>\"\"), 1, 0)","v":0},{"$f":"IF(AND(E11<>\"\", F11<>\"\", G11<>\"\", H11<>\"\"), 1, 0)","v":0}]
[{"$f":"LOOKUP(E12, Lists!A$236:A$245, Lists!B$236:B$245)","v":{"$error":"#N/A"}},null,{"$f":"VLOOKUP(F12, INDIRECT(\"Lists!$A$140:$B$\" & Lists!$C$245), 2, FALSE)","v":{"$error":"#N/A"}},null,null,null,null,null,null,{"$f":"J11+1","v":5},{"$f":"IF(OR(E12<>\"\", F12<>\"\", G12<>\"\", H12<>\"\"), 1, 0)","v":0},{"$f":"IF(AND(E12<>\"\", F12<>\"\", G12<>\"\", H12<>\"\"), 1, 0)","v":0}]
[{"$f":"LOOKUP(E13, Lists!A$236:A$245, Lists!B$236:B$245)","v":{"$error":"#N/A"}},null,{"$f":"VLOOKUP(F13, INDIRECT(\"Lists!$A$140:$B$\" & Lists!$C$245), 2, FALSE)","v":{"$error":"#N/A"}},null,null,null,null,null,null,{"$f":"J12+1","v":6},{"$f":"IF(OR(E13<>\"\", F13<>\"\", G13<>\"\", H13<>\"\"), 1, 0)","v":0},{"$f":"IF(AND(E13<>\"\", F13<>\"\", G13<>\"\", H13<>\"\"), 1, 0)","v":0}]
[{"$f":"LOOKUP(E14, Lists!A$236:A$245, Lists!B$236:B$245)","v":{"$error":"#N/A"}},null,{"$f":"VLOOKUP(F14, INDIRECT(\"Lists!$A$140:$B$\" & Lists!$C$245), 2, FALSE)","v":{"$error":"#N/A"}},null,null,null,null,null,null,{"$f":"J13+1","v":7},{"$f":"IF(OR(E14<>\"\", F14<>\"\", G14<>\"\", H14<>\"\"), 1, 0)","v":0},{"$f":"IF(AND(E14<>\"\", F14<>\"\", G14<>\"\", H14<>\"\"), 1, 0)","v":0}]
[{"$f":"LOOKUP(E15, Lists!A$236:A$245, Lists!B$236:B$245)","v":{"$error":"#N/A"}},null,{"$f":"VLOOKUP(F15, INDIRECT(\"Lists!$A$140:$B$\" & Lists!$C$245), 2, FALSE)","v":{"$error":"#N/A"}},null,null,null,null,null,null,{"$f":"J14+1","v":8},{"$f":"IF(OR(E15<>\"\", F15<>\"\", G15<>\"\", H15<>\"\"), 1, 0)","v":0},{"$f":"IF(AND(E15<>\"\", F15<>\"\", G15<>\"\", H15<>\"\"), 1, 0)","v":0}]
[{"$f":"LOOKUP(E16, Lists!A$236:A$245, Lists!B$236:B$245)","v":{"$error":"#N/A"}},null,{"$f":"VLOOKUP(F16, INDIRECT(\"Lists!$A$140:$B$\" & Lists!$C$245), 2, FALSE)","v":{"$error":"#N/A"}},null,null,null,null,null,null,{"$f":"J15+1","v":9},{"$f":"IF(OR(E16<>\"\", F16<>\"\", G16<>\"\", H16<>\"\"), 1, 0)","v":0},{"$f":"IF(AND(E16<>\"\", F16<>\"\", G16<>\"\", H16<>\"\"), 1, 0)","v":0}]
[{"$f":"LOOKUP(E17, Lists!A$236:A$245, Lists!B$236:B$245)","v":{"$error":"#N/A"}},null,{"$f":"VLOOKUP(F17, INDIRECT(\"Lists!$A$140:$B$\" & Lists!$C$245), 2, FALSE)","v":{"$error":"#N/A"}},null,null,null,null,null,null,10,{"$f":"IF(OR(E17<>\"\", F17<>\"\", G17<>\"\", H17<>\"\"), 1, 0)","v":0},{"$f":"IF(AND(E17<>\"\", F17<>\"\", G17<>\"\", H17<>\"\"), 1, 0)","v":0}]
[{"$f":"LOOKUP(E18, Lists!A$236:A$245, Lists!B$236:B$245)","v":{"$error":"#N/A"}},null,{"$f":"VLOOKUP(F18, INDIRECT(\"Lists!$A$140:$B$\" & Lists!$C$245), 2, FALSE)","v":{"$error":"#N/A"}},null,null,null,null,null,null,11,{"$f":"IF(OR(E18<>\"\", F18<>\"\", G18<>\"\", H18<>\"\"), 1, 0)","v":0},{"$f":"IF(AND(E18<>\"\", F18<>\"\", G18<>\"\", H18<>\"\"), 1, 0)","v":0}]
[{"$f":"LOOKUP(E19, Lists!A$236:A$245, Lists!B$236:B$245)","v":{"$error":"#N/A"}},null,{"$f":"VLOOKUP(F19, INDIRECT(\"Lists!$A$140:$B$\" & Lists!$C$245), 2, FALSE)","v":{"$error":"#N/A"}},null,null,null,null,null,null,12,{"$f":"IF(OR(E19<>\"\", F19<>\"\", G19<>\"\", H19<>\"\"), 1, 0)","v":0},{"$f":"IF(AND(E19<>\"\", F19<>\"\", G19<>\"\", H19<>\"\"), 1, 0)","v":0}]
[{"$f":"LOOKUP(E20, Lists!A$236:A$245, Lists!B$236:B$245)","v":{"$error":"#N/A"}},null,{"$f":"VLOOKUP(F20, INDIRECT(\"Lists!$A$140:$B$\" & Lists!$C$245), 2, FALSE)","v":{"$error":"#N/A"}},null,null,null,null,null,null,13,{"$f":"IF(OR(E20<>\"\", F20<>\"\", G20<>\"\", H20<>\"\"), 1, 0)","v":0},{"$f":"IF(AND(E20<>\"\", F20<>\"\", G20<>\"\", H20<>\"\"), 1, 0)","v":0}]
[{"$f":"LOOKUP(E21, Lists!A$236:A$245, Lists!B$236:B$245)","v":{"$error":"#N/A"}},null,{"$f":"VLOOKUP(F21, INDIRECT(\"Lists!$A$140:$B$\" & Lists!$C$245), 2, FALSE)","v":{"$error":"#N/A"}},null,null,null,null,null,null,14,{"$f":"IF(OR(E21<>\"\", F21<>\"\", G21<>\"\", H21<>\"\"), 1, 0)","v":0},{"$f":"IF(AND(E21<>\"\", F21<>\"\", G21<>\"\", H21<>\"\"), 1, 0)","v":0}]
[{"$f":"LOOKUP(E22, Lists!A$236:A$245, Lists!B$236:B$245)","v":{"$error":"#N/A"}},null,{"$f":"VLOOKUP(F22, INDIRECT(\"Lists!$A$140:$B$\" & Lists!$C$245), 2, FALSE)","v":{"$error":"#N/A"}},null,null,null,null,null,null,15,{"$f":"IF(OR(E22<>\"\", F22<>\"\", G22<>\"\", H22<>\"\"), 1, 0)","v":0},{"$f":"IF(AND(E22<>\"\", F22<>\"\", G22<>\"\", H22<>\"\"), 1, 0)","v":0}]
[{"$f":"LOOKUP(E23, Lists!A$236:A$245, Lists!B$236:B$245)","v":{"$error":"#N/A"}},null,{"$f":"VLOOKUP(F23, INDIRECT(\"Lists!$A$140:$B$\" & Lists!$C$245), 2, FALSE)","v":{"$error":"#N/A"}},null,null,null,null,null,null,16,{"$f":"IF(OR(E23<>\"\", F23<>\"\", G23<>\"\", H23<>\"\"), 1, 0)","v":0},{"$f":"IF(AND(E23<>\"\", F23<>\"\", G23<>\"\", H23<>\"\"), 1, 0)","v":0}]
[{"$f":"LOOKUP(E24, Lists!A$236:A$245, Lists!B$236:B$245)","v":{"$error":"#N/A"}},null,{"$f":"VLOOKUP(F24, INDIRECT(\"Lists!$A$140:$B$\" & Lists!$C$245), 2, FALSE)","v":{"$error":"#N/A"}},null,null,null,null,null,null,17,0,0]
[null,null,null,"Other\nResources","Resource\n(Example:  Case Management Team)",null,"Team/POETE\n","Number Required\n"]
[null,null,null,null,null,null,null,null,null,null,null,null,1,{"$f":"IF(OR(E26<>\"\", H26<>\"\"), 1, 0)","v":0},{"$f":"IF(AND(E26<>\"\", H26<>\"\"), 1, 0)","v":0}]
[null,null,null,null,null,null,null,null,null,null,null,null,{"$f":"M26+1","v":2},{"$f":"IF(OR(E27<>\"\", H27<>\"\"), 1, 0)","v":0},{"$f":"IF(AND(E27<>\"\", H27<>\"\"), 1, 0)","v":0}]
[null,null,null,null,null,null,null,null,null,null,null,null,{"$f":"M27+1","v":3},{"$f":"IF(OR(E28<>\"\", H28<>\"\"), 1, 0)","v":0},{"$f":"IF(AND(E28<>\"\", H28<>\"\"), 1, 0)","v":0}]
[null,null,null,null,null,null,null,null,null,null,null,null,{"$f":"M28+1","v":4},{"$f":"IF(OR(E29<>\"\", H29<>\"\"), 1, 0)","v":0},{"$f":"IF(AND(E29<>\"\", H29<>\"\"), 1, 0)","v":0}]

{"sheet":"SPR #18 Envir Resp Health","index":40,"n_rows":41,"n_cols":19,"rows_kept":41,"cut":false,"hidden":true,"merged":[[2,3,2,7],[3,3,3,7],[5,3,5,7],[7,3,7,7],[12,3,14,3],[14,4,14,7],[8,4,8,7],[9,4,9,7],[10,4,10,7],[30,3,30,7],[31,3,31,7],[33,3,33,7],[40,3,40,7],[16,3,17,3],[19,3,20,3],[22,3,24,3],[24,4,24,7],[26,3,28,3],[28,4,28,7]]}
[21]
[]
[{"$f":"MAX(B:B)","v":1},null,null,"Capability Target"]
[null,{"$f":"ROW()-3","v":1},null,{"$f":"INDIRECT(\"'THIRA Steps 1-3'!$C$81\")","v":0}]
[]
[null,null,null,"Capability Assessment"]
[]
[null,null,null,"Priority"]
[null,null,null,null,"Relative to the other core capabilities, efforts to build and/or sustain this core capability are of high importance to my jurisdiction’s preparedness activities.",null,null,null,null,null,null,null,null,null,null,0]
[null,null,null,null,"Relative to the other core capabilities, efforts to build and/or sustain this core capability are of medium importance to my jurisdiction’s preparedness activities."]
[null,null,null,null,"Relative to the other core capabilities, efforts to build and/or sustain this core capability are of low importance to my jurisdiction’s preparedness activities."]
[]
[null,null,null,"Planning","Rating\nInternal Capability","Rating\nInternal Capability + Mutual Aid","Gap Description","Recent Advances (optional)"]
[null,null,null,null,{"$f":"LOOKUP(P14, Lists!$C$2:$C$8, Lists!D2:D8)","v":"No selection made"},{"$f":"LOOKUP(Q14, Lists!$C$2:$C$8, Lists!D2:D8)","v":"No selection made"},null,null,null,null,null,null,null,null,null,1,1,{"$f":"COUNTIF(I15:AC15, \"TRUE\")","v":0},0]
[null,null,null,null,"Gap Description\nWhich of the following best represent your community's primary planning gaps?",null,null,null,false,false,false,false,false,false,false,false,false]
[]
[null,null,null,"Organization","Rating\nInternal Capability","Rating\nInternal Capability + Mutual Aid","Gap Description","Recent Advances (optional)"]
[null,null,null,null,{"$f":"LOOKUP(P18, Lists!$C$2:$C$8, Lists!E2:E8)","v":"No selection made"},{"$f":"LOOKUP(Q18, Lists!$C$2:$C$8, Lists!E2:E8)","v":"No selection made"},null,null,null,null,null,null,null,null,null,1,1,0]
[]
[null,null,null,"Equipment","Rating\nInternal Capability","Rating\nInternal Capability + Mutual Aid","Gap Description","Recent Advances (optional)"]
[null,null,null,null,{"$f":"LOOKUP(P21, Lists!$C$2:$C$8, Lists!F2:F8)","v":"No selection made"},{"$f":"LOOKUP(Q21, Lists!$C$2:$C$8, Lists!F2:F8)","v":"No selection made"},null,null,null,null,null,null,null,null,null,1,1,0]
[]
[null,null,null,"Training","Rating\nInternal Capability","Rating\nInternal Capability + Mutual Aid","Gap Description","Recent Advances (optional)"]
[null,null,null,null,{"$f":"LOOKUP(P24, Lists!$C$2:$C$8, Lists!G2:G8)","v":"No selection made"},{"$f":"LOOKUP(Q24, Lists!$C$2:$C$8, Lists!G2:G8)","v":"No selection made"},null,null,null,null,null,null,null,null,null,1,1,{"$f":"COUNTIF(I25:S25, \"TRUE\")","v":0},0]
[null,null,null,null,"Gap Description\nWhich of the following best represent your community's primary training gaps?",null,null,null,false,false,false,false,false,false,false,false,false,false,false]
[]
[null,null,null,"Exercises","Rating\nInternal Capability","Rating\nInternal Capability + Mutual Aid","Gap Description","Recent Advances (optional)"]
[null,null,null,null,{"$f":"LOOKUP(P28, Lists!$C$2:$C$8, Lists!H2:H8)","v":"No selection made"},{"$f":"LOOKUP(Q28, Lists!$C$2:$C$8, Lists!H2:H8)","v":"No selection made"},null,null,null,null,null,null,null,null,null,1,1,{"$f":"COUNTIF(I29:AA29, \"TRUE\")","v":0},0]
[null,null,null,null,"Gap Description\nWhich of the following best represent your community's primary exercises gaps?",null,null,null,false,false,false,false,false,false,false,false]
[]
[null,null,null,"Assessment Corroboration"]
[null,null,null,null,null,null,null,null,{"$f":"IF(J32=2,TRUE,IF(J32=3,FALSE,\"\"))","v":""},1]
[]
[null,null,null,"Responsibility for Filling Gap",null,null,null,null,null,null,null,null,null,null,null,0]
[]
[]
[]
[]
[]
[]
[null,null,null,"Journal Notes/Process Narrative (optional)"]

{"sheet":"THIRA #19 Fatality Mgmt","index":41,"n_rows":25,"n_cols":20,"rows_kept":25,"cut":false,"hidden":false,"merged":[[24,4,24,5],[2,3,2,7],[3,3,3,7],[3,13,3,14],[5,3,5,7],[6,3,15,3],[16,3,24,3],[16,4,16,5],[17,4,17,5],[18,4,18,5],[23,4,23,5],[19,4,19,5],[20,4,20,5],[21,4,21,5],[22,4,22,5]]}
[21]
[]
[{"$f":"MAX(B:B)","v":1},null,null,"Capability Target",null,null,null,null,null,null,null,null,null,null,null,null,null,null,"# NIMS Rows",{"$f":"MAX(J:J)","v":9}]
[null,{"$f":"ROW()-3","v":1},null,{"$f":"INDIRECT(\"'THIRA Steps 1-3'!$C$85\")","v":0},null,null,null,null,null,null,null,null,null,null,null,null,null,null,"# NIMS Started",{"$f":"SUM(K:K)","v":0}]
[null,null,null,null,null,null,null,null,null,null,null,null,null,null,null,null,null,null,"# NIMS Complete",{"$f":"SUM(L:L)","v":0}]
[null,null,null,"Resource Requirements",null,null,null,null,null,null,null,null,null,null,null,null,null,null,"# Other Rows",{"$f":"MAX(M:M)","v":8}]
[null,null,null,"NIMS-typed Resources","Category","Resource","Type","Number Required",null,null,null,null,null,null,null,null,null,null,"# Other Rows",{"$f":"SUM(N:N)","v":0}]
[{"$f":"LOOKUP(E8, Lists!A$236:A$245, Lists!B$236:B$245)","v":{"$error":"#N/A"}},null,{"$f":"VLOOKUP(F8, INDIRECT(\"Lists!$A$140:$B$\" & Lists!$C$245), 2, FALSE)","v":{"$error":"#N/A"}},null,null,null,null,null,null,1,{"$f":"IF(OR(E8<>\"\", F8<>\"\", G8<>\"\", H8<>\"\"), 1, 0)","v":0},{"$f":"IF(AND(E8<>\"\", F8<>\"\", G8<>\"\", H8<>\"\"), 1, 0)","v":0},null,null,null,null,null,null,"# Other",{"$f":"SUM(O:O)","v":0}]
[{"$f":"LOOKUP(E9, Lists!A$236:A$245, Lists!B$236:B$245)","v":{"$error":"#N/A"}},null,{"$f":"VLOOKUP(F9, INDIRECT(\"Lists!$A$140:$B$\" & Lists!$C$245), 2, FALSE)","v":{"$error":"#N/A"}},null,null,null,null,null,null,{"$f":"J8+1","v":2},{"$f":"IF(OR(E9<>\"\", F9<>\"\", G9<>\"\", H9<>\"\"), 1, 0)","v":0},{"$f":"IF(AND(E9<>\"\", F9<>\"\", G9<>\"\", H9<>\"\"), 1, 0)","v":0}]
[{"$f":"LOOKUP(E10, Lists!A$236:A$245, Lists!B$236:B$245)","v":{"$error":"#N/A"}},null,{"$f":"VLOOKUP(F10, INDIRECT(\"Lists!$A$140:$B$\" & Lists!$C$245), 2, FALSE)","v":{"$error":"#N/A"}},null,null,null,null,null,null,{"$f":"J9+1","v":3},{"$f":"IF(OR(E10<>\"\", F10<>\"\", G10<>\"\", H10<>\"\"), 1, 0)","v":0},{"$f":"IF(AND(E10<>\"\", F10<>\"\", G10<>\"\", H10<>\"\"), 1, 0)","v":0}]
[{"$f":"LOOKUP(E11, Lists!A$236:A$245, Lists!B$236:B$245)","v":{"$error":"#N/A"}},null,{"$f":"VLOOKUP(F11, INDIRECT(\"Lists!$A$140:$B$\" & Lists!$C$245), 2, FALSE)","v":{"$error":"#N/A"}},null,null,null,null,null,null,{"$f":"J10+1","v":4},{"$f":"IF(OR(E11<>\"\", F11<>\"\", G11<>\"\", H11<>\"\"), 1, 0)","v":0},{"$f":"IF(AND(E11<>\"\", F11<>\"\", G11<>\"\", H11<>\"\"), 1, 0)","v":0}]
[{"$f":"LOOKUP(E12, Lists!A$236:A$245, Lists!B$236:B$245)","v":{"$error":"#N/A"}},null,{"$f":"VLOOKUP(F12, INDIRECT(\"Lists!$A$140:$B$\" & Lists!$C$245), 2, FALSE)","v":{"$error":"#N/A"}},null,null,null,null,null,null,5,{"$f":"IF(OR(E12<>\"\", F12<>\"\", G12<>\"\", H12<>\"\"), 1, 0)","v":0},{"$f":"IF(AND(E12<>\"\", F12<>\"\", G12<>\"\", H12<>\"\"), 1, 0)","v":0}]
[{"$f":"LOOKUP(E13, Lists!A$236:A$245, Lists!B$236:B$245)","v":{"$error":"#N/A"}},null,{"$f":"VLOOKUP(F13, INDIRECT(\"Lists!$A$140:$B$\" & Lists!$C$245), 2, FALSE)","v":{"$error":"#N/A"}},null,null,null,null,null,null,6,{"$f":"IF(OR(E13<>\"\", F13<>\"\", G13<>\"\", H13<>\"\"), 1, 0)","v":0},{"$f":"IF(AND(E13<>\"\", F13<>\"\", G13<>\"\", H13<>\"\"), 1, 0)","v":0}]
[{"$f":"LOOKUP(E14, Lists!A$236:A$245, Lists!B$236:B$245)","v":{"$error":"#N/A"}},null,{"$f":"VLOOKUP(F14, INDIRECT(\"Lists!$A$140:$B$\" & Lists!$C$245), 2, FALSE)","v":{"$error":"#N/A"}},null,null,null,null,null,null,7,{"$f":"IF(OR(E14<>\"\", F14<>\"\", G14<>\"\", H14<>\"\"), 1, 0)","v":0},{"$f":"IF(AND(E14<>\"\", F14<>\"\", G14<>\"\", H14<>\"\"), 1, 0)","v":0}]
[{"$f":"LOOKUP(E15, Lists!A$236:A$245, Lists!B$236:B$245)","v":{"$error":"#N/A"}},null,{"$f":"VLOOKUP(F15, INDIRECT(\"Lists!$A$140:$B$\" & Lists!$C$245), 2, FALSE)","v":{"$error":"#N/A"}},null,null,null,null,null,null,8,{"$f":"IF(OR(E15<>\"\", F15<>\"\", G15<>\"\", H15<>\"\"), 1, 0)","v":0},{"$f":"IF(AND(E15<>\"\", F15<>\"\", G15<>\"\", H15<>\"\"), 1, 0)","v":0}]
[{"$f":"LOOKUP(E16, Lists!A$236:A$245, Lists!B$236:B$245)","v":{"$error":"#N/A"}},null,{"$f":"VLOOKUP(F16, INDIRECT(\"Lists!$A$140:$B$\" & Lists!$C$245), 2, FALSE)","v":{"$error":"#N/A"}},null,null,null,null,null,null,9,0,0]
[null,null,null,"Other\nResources","Resource\n(Example:  Case Management Team)",null,"Team/POETE\n","Number Required\n"]
[null,null,null,null,null,null,null,null,null,null,null,null,1,{"$f":"IF(OR(E18<>\"\", H18<>\"\"), 1, 0)","v":0},{"$f":"IF(AND(E18<>\"\", H18<>\"\"), 1, 0)","v":0}]
[null,null,null,null,null,null,null,null,null,null,null,null,{"$f":"M18+1","v":2},{"$f":"IF(OR(E19<>\"\", H19<>\"\"), 1, 0)","v":0},{"$f":"IF(AND(E19<>\"\", H19<>\"\"), 1, 0)","v":0}]
[null,null,null,null,null,null,null,null,null,null,null,null,{"$f":"M19+1","v":3},{"$f":"IF(OR(E20<>\"\", H20<>\"\"), 1, 0)","v":0},{"$f":"IF(AND(E20<>\"\", H20<>\"\"), 1, 0)","v":0}]
[null,null,null,null,null,null,null,null,null,null,null,null,{"$f":"M20+1","v":4},{"$f":"IF(OR(E21<>\"\", H21<>\"\"), 1, 0)","v":0},{"$f":"IF(AND(E21<>\"\", H21<>\"\"), 1, 0)","v":0}]
[null,null,null,null,null,null,null,null,null,null,null,null,{"$f":"M21+1","v":5},{"$f":"IF(OR(E22<>\"\", H22<>\"\"), 1, 0)","v":0},{"$f":"IF(AND(E22<>\"\", H22<>\"\"), 1, 0)","v":0}]
[null,null,null,null,null,null,null,null,null,null,null,null,6,{"$f":"IF(OR(E23<>\"\", H23<>\"\"), 1, 0)","v":0},{"$f":"IF(AND(E23<>\"\", H23<>\"\"), 1, 0)","v":0}]
[null,null,null,null,null,null,null,null,null,null,null,null,7,0,0]
[null,null,null,null,null,null,null,null,null,null,null,null,8,0,0]

{"sheet":"SPR #19 Fatality Mgmt","index":42,"n_rows":41,"n_cols":19,"rows_kept":41,"cut":false,"hidden":true,"merged":[[2,3,2,7],[3,3,3,7],[5,3,5,7],[7,3,7,7],[12,3,14,3],[14,4,14,7],[8,4,8,7],[9,4,9,7],[10,4,10,7],[30,3,30,7],[31,3,31,7],[33,3,33,7],[40,3,40,7],[16,3,17,3],[19,3,20,3],[22,3,24,3],[24,4,24,7],[26,3,28,3],[28,4,28,7]]}
[21]
[]
[{"$f":"MAX(B:B)","v":1},null,null,"Capability Target"]
[null,{"$f":"ROW()-3","v":1},null,{"$f":"INDIRECT(\"'THIRA Steps 1-3'!$C$85\")","v":0}]
[]
[null,null,null,"Capability Assessment"]
[]
[null,null,null,"Priority"]
[null,null,null,null,"Relative to the other core capabilities, efforts to build and/or sustain this core capability are of high importance to my jurisdiction’s preparedness activities.",null,null,null,null,null,null,null,null,null,null,0]
[null,null,null,null,"Relative to the other core capabilities, efforts to build and/or sustain this core capability are of medium importance to my jurisdiction’s preparedness activities."]
[null,null,null,null,"Relative to the other core capabilities, efforts to build and/or sustain this core capability are of low importance to my jurisdiction’s preparedness activities."]
[]
[null,null,null,"Planning","Rating\nInternal Capability","Rating\nInternal Capability + Mutual Aid","Gap Description","Recent Advances (optional)"]
[null,null,null,null,{"$f":"LOOKUP(P14, Lists!$C$2:$C$8, Lists!D2:D8)","v":"No selection made"},{"$f":"LOOKUP(Q14, Lists!$C$2:$C$8, Lists!D2:D8)","v":"No selection made"},null,null,null,null,null,null,null,null,null,1,1,{"$f":"COUNTIF(I15:AC15, \"TRUE\")","v":0},0]
[null,null,null,null,"Gap Description\nWhich of the following best represent your community's primary planning gaps?",null,null,null,false,false,false,false,false,false,false,false,false]
[]
[null,null,null,"Organization","Rating\nInternal Capability","Rating\nInternal Capability + Mutual Aid","Gap Description","Recent Advances (optional)"]
[null,null,null,null,{"$f":"LOOKUP(P18, Lists!$C$2:$C$8, Lists!E2:E8)","v":"No selection made"},{"$f":"LOOKUP(Q18, Lists!$C$2:$C$8, Lists!E2:E8)","v":"No selection made"},null,null,null,null,null,null,null,null,null,1,1,0]
[]
[null,null,null,"Equipment","Rating\nInternal Capability","Rating\nInternal Capability + Mutual Aid","Gap Description","Recent Advances (optional)"]
[null,null,null,null,{"$f":"LOOKUP(P21, Lists!$C$2:$C$8, Lists!F2:F8)","v":"No selection made"},{"$f":"LOOKUP(Q21, Lists!$C$2:$C$8, Lists!F2:F8)","v":"No selection made"},null,null,null,null,null,null,null,null,null,1,1,0]
[]
[null,null,null,"Training","Rating\nInternal Capability","Rating\nInternal Capability + Mutual Aid","Gap Description","Recent Advances (optional)"]
[null,null,null,null,{"$f":"LOOKUP(P24, Lists!$C$2:$C$8, Lists!G2:G8)","v":"No selection made"},{"$f":"LOOKUP(Q24, Lists!$C$2:$C$8, Lists!G2:G8)","v":"No selection made"},null,null,null,null,null,null,null,null,null,1,1,{"$f":"COUNTIF(I25:S25, \"TRUE\")","v":0},0]
[null,null,null,null,"Gap Description\nWhich of the following best represent your community's primary training gaps?",null,null,null,false,false,false,false,false,false,false,false,false,false,false]
[]
[null,null,null,"Exercises","Rating\nInternal Capability","Rating\nInternal Capability + Mutual Aid","Gap Description","Recent Advances (optional)"]
[null,null,null,null,{"$f":"LOOKUP(P28, Lists!$C$2:$C$8, Lists!H2:H8)","v":"No selection made"},{"$f":"LOOKUP(Q28, Lists!$C$2:$C$8, Lists!H2:H8)","v":"No selection made"},null,null,null,null,null,null,null,null,null,1,1,{"$f":"COUNTIF(I29:AA29, \"TRUE\")","v":0},0]
[null,null,null,null,"Gap Description\nWhich of the following best represent your community's primary exercises gaps?",null,null,null,false,false,false,false,false,false,false,false]
[]
[null,null,null,"Assessment Corroboration"]
[null,null,null,null,null,null,null,null,{"$f":"IF(J32=2,TRUE,IF(J32=3,FALSE,\"\"))","v":""},1]
[]
[null,null,null,"Responsibility for Filling Gap",null,null,null,null,null,null,null,null,null,null,null,0]
[]
[]
[]
[]
[]
[]
[null,null,null,"Journal Notes/Process Narrative (optional)"]

{"sheet":"THIRA #20 Infrastructure Sys","index":43,"n_rows":32,"n_cols":20,"rows_kept":32,"cut":false,"hidden":false,"merged":[[31,4,31,5],[2,3,2,7],[3,3,3,7],[3,13,3,14],[5,3,5,7],[6,3,24,3],[25,3,31,3],[25,4,25,5],[26,4,26,5],[27,4,27,5],[30,4,30,5],[28,4,28,5],[29,4,29,5]]}
[21]
[]
[{"$f":"MAX(B:B)","v":1},null,null,"Capability Target",null,null,null,null,null,null,null,null,null,null,null,null,null,null,"# NIMS Rows",{"$f":"MAX(J:J)","v":18}]
[null,{"$f":"ROW()-3","v":1},null,{"$f":"INDIRECT(\"'THIRA Steps 1-3'!$C$89\")","v":0},null,null,null,null,null,null,null,null,null,null,null,null,null,null,"# NIMS Started",{"$f":"SUM(K:K)","v":0}]
[null,null,null,null,null,null,null,null,null,null,null,null,null,null,null,null,null,null,"# NIMS Complete",{"$f":"SUM(L:L)","v":0}]
[null,null,null,"Resource Requirements",null,null,null,null,null,null,null,null,null,null,null,null,null,null,"# Other Rows",{"$f":"MAX(M:M)","v":6}]
[null,null,null,"NIMS-typed Resources","Category","Resource","Type","Number Required",null,null,null,null,null,null,null,null,null,null,"# Other Rows",{"$f":"SUM(N:N)","v":0}]
[{"$f":"LOOKUP(E8, Lists!A$236:A$245, Lists!B$236:B$245)","v":{"$error":"#N/A"}},null,{"$f":"VLOOKUP(F8, INDIRECT(\"Lists!$A$140:$B$\" & Lists!$C$245), 2, FALSE)","v":{"$error":"#N/A"}},null,null,null,null,null,null,1,{"$f":"IF(OR(E8<>\"\", F8<>\"\", G8<>\"\", H8<>\"\"), 1, 0)","v":0},{"$f":"IF(AND(E8<>\"\", F8<>\"\", G8<>\"\", H8<>\"\"), 1, 0)","v":0},null,null,null,null,null,null,"# Other",{"$f":"SUM(O:O)","v":0}]
[{"$f":"LOOKUP(E9, Lists!A$236:A$245, Lists!B$236:B$245)","v":{"$error":"#N/A"}},null,{"$f":"VLOOKUP(F9, INDIRECT(\"Lists!$A$140:$B$\" & Lists!$C$245), 2, FALSE)","v":{"$error":"#N/A"}},null,null,null,null,null,null,{"$f":"J8+1","v":2},{"$f":"IF(OR(E9<>\"\", F9<>\"\", G9<>\"\", H9<>\"\"), 1, 0)","v":0},{"$f":"IF(AND(E9<>\"\", F9<>\"\", G9<>\"\", H9<>\"\"), 1, 0)","v":0}]
[{"$f":"LOOKUP(E10, Lists!A$236:A$245, Lists!B$236:B$245)","v":{"$error":"#N/A"}},null,{"$f":"VLOOKUP(F10, INDIRECT(\"Lists!$A$140:$B$\" & Lists!$C$245), 2, FALSE)","v":{"$error":"#N/A"}},null,null,null,null,null,null,{"$f":"J9+1","v":3},{"$f":"IF(OR(E10<>\"\", F10<>\"\", G10<>\"\", H10<>\"\"), 1, 0)","v":0},{"$f":"IF(AND(E10<>\"\", F10<>\"\", G10<>\"\", H10<>\"\"), 1, 0)","v":0}]
[{"$f":"LOOKUP(E11, Lists!A$236:A$245, Lists!B$236:B$245)","v":{"$error":"#N/A"}},null,{"$f":"VLOOKUP(F11, INDIRECT(\"Lists!$A$140:$B$\" & Lists!$C$245), 2, FALSE)","v":{"$error":"#N/A"}},null,null,null,null,null,null,{"$f":"J10+1","v":4},{"$f":"IF(OR(E11<>\"\", F11<>\"\", G11<>\"\", H11<>\"\"), 1, 0)","v":0},{"$f":"IF(AND(E11<>\"\", F11<>\"\", G11<>\"\", H11<>\"\"), 1, 0)","v":0}]
[{"$f":"LOOKUP(E12, Lists!A$236:A$245, Lists!B$236:B$245)","v":{"$error":"#N/A"}},null,{"$f":"VLOOKUP(F12, INDIRECT(\"Lists!$A$140:$B$\" & Lists!$C$245), 2, FALSE)","v":{"$error":"#N/A"}},null,null,null,null,null,null,{"$f":"J11+1","v":5},{"$f":"IF(OR(E12<>\"\", F12<>\"\", G12<>\"\", H12<>\"\"), 1, 0)","v":0},{"$f":"IF(AND(E12<>\"\", F12<>\"\", G12<>\"\", H12<>\"\"), 1, 0)","v":0}]
[{"$f":"LOOKUP(E13, Lists!A$236:A$245, Lists!B$236:B$245)","v":{"$error":"#N/A"}},null,{"$f":"VLOOKUP(F13, INDIRECT(\"Lists!$A$140:$B$\" & Lists!$C$245), 2, FALSE)","v":{"$error":"#N/A"}},null,null,null,null,null,null,{"$f":"J12+1","v":6},{"$f":"IF(OR(E13<>\"\", F13<>\"\", G13<>\"\", H13<>\"\"), 1, 0)","v":0},{"$f":"IF(AND(E13<>\"\", F13<>\"\", G13<>\"\", H13<>\"\"), 1, 0)","v":0}]
[{"$f":"LOOKUP(E14, Lists!A$236:A$245, Lists!B$236:B$245)","v":{"$error":"#N/A"}},null,{"$f":"VLOOKUP(F14, INDIRECT(\"Lists!$A$140:$B$\" & Lists!$C$245), 2, FALSE)","v":{"$error":"#N/A"}},null,null,null,null,null,null,{"$f":"J13+1","v":7},{"$f":"IF(OR(E14<>\"\", F14<>\"\", G14<>\"\", H14<>\"\"), 1, 0)","v":0},{"$f":"IF(AND(E14<>\"\", F14<>\"\", G14<>\"\", H14<>\"\"), 1, 0)","v":0}]
[{"$f":"LOOKUP(E15, Lists!A$236:A$245, Lists!B$236:B$245)","v":{"$error":"#N/A"}},null,{"$f":"VLOOKUP(F15, INDIRECT(\"Lists!$A$140:$B$\" & Lists!$C$245), 2, FALSE)","v":{"$error":"#N/A"}},null,null,null,null,null,null,{"$f":"J14+1","v":8},{"$f":"IF(OR(E15<>\"\", F15<>\"\", G15<>\"\", H15<>\"\"), 1, 0)","v":0},{"$f":"IF(AND(E15<>\"\", F15<>\"\", G15<>\"\", H15<>\"\"), 1, 0)","v":0}]
[{"$f":"LOOKUP(E16, Lists!A$236:A$245, Lists!B$236:B$245)","v":{"$error":"#N/A"}},null,{"$f":"VLOOKUP(F16, INDIRECT(\"Lists!$A$140:$B$\" & Lists!$C$245), 2, FALSE)","v":{"$error":"#N/A"}},null,null,null,null,null,null,{"$f":"J15+1","v":9},{"$f":"IF(OR(E16<>\"\", F16<>\"\", G16<>\"\", H16<>\"\"), 1, 0)","v":0},{"$f":"IF(AND(E16<>\"\", F16<>\"\", G16<>\"\", H16<>\"\"), 1, 0)","v":0}]
[{"$f":"LOOKUP(E17, Lists!A$236:A$245, Lists!B$236:B$245)","v":{"$error":"#N/A"}},null,{"$f":"VLOOKUP(F17, INDIRECT(\"Lists!$A$140:$B$\" & Lists!$C$245), 2, FALSE)","v":{"$error":"#N/A"}},null,null,null,null,null,null,{"$f":"J16+1","v":10},{"$f":"IF(OR(E17<>\"\", F17<>\"\", G17<>\"\", H17<>\"\"), 1, 0)","v":0},{"$f":"IF(AND(E17<>\"\", F17<>\"\", G17<>\"\", H17<>\"\"), 1, 0)","v":0}]
[{"$f":"LOOKUP(E18, Lists!A$236:A$245, Lists!B$236:B$245)","v":{"$error":"#N/A"}},null,{"$f":"VLOOKUP(F18, INDIRECT(\"Lists!$A$140:$B$\" & Lists!$C$245), 2, FALSE)","v":{"$error":"#N/A"}},null,null,null,null,null,null,{"$f":"J17+1","v":11},{"$f":"IF(OR(E18<>\"\", F18<>\"\", G18<>\"\", H18<>\"\"), 1, 0)","v":0},{"$f":"IF(AND(E18<>\"\", F18<>\"\", G18<>\"\", H18<>\"\"), 1, 0)","v":0}]
[{"$f":"LOOKUP(E19, Lists!A$236:A$245, Lists!B$236:B$245)","v":{"$error":"#N/A"}},null,{"$f":"VLOOKUP(F19, INDIRECT(\"Lists!$A$140:$B$\" & Lists!$C$245), 2, FALSE)","v":{"$error":"#N/A"}},null,null,null,null,null,null,12,{"$f":"IF(OR(E19<>\"\", F19<>\"\", G19<>\"\", H19<>\"\"), 1, 0)","v":0},{"$f":"IF(AND(E19<>\"\", F19<>\"\", G19<>\"\", H19<>\"\"), 1, 0)","v":0}]
[{"$f":"LOOKUP(E20, Lists!A$236:A$245, Lists!B$236:B$245)","v":{"$error":"#N/A"}},null,{"$f":"VLOOKUP(F20, INDIRECT(\"Lists!$A$140:$B$\" & Lists!$C$245), 2, FALSE)","v":{"$error":"#N/A"}},null,null,null,null,null,null,13,{"$f":"IF(OR(E20<>\"\", F20<>\"\", G20<>\"\", H20<>\"\"), 1, 0)","v":0},{"$f":"IF(AND(E20<>\"\", F20<>\"\", G20<>\"\", H20<>\"\"), 1, 0)","v":0}]
[{"$f":"LOOKUP(E21, Lists!A$236:A$245, Lists!B$236:B$245)","v":{"$error":"#N/A"}},null,{"$f":"VLOOKUP(F21, INDIRECT(\"Lists!$A$140:$B$\" & Lists!$C$245), 2, FALSE)","v":{"$error":"#N/A"}},null,null,null,null,null,null,14,{"$f":"IF(OR(E21<>\"\", F21<>\"\", G21<>\"\", H21<>\"\"), 1, 0)","v":0},{"$f":"IF(AND(E21<>\"\", F21<>\"\", G21<>\"\", H21<>\"\"), 1, 0)","v":0}]
[{"$f":"LOOKUP(E22, Lists!A$236:A$245, Lists!B$236:B$245)","v":{"$error":"#N/A"}},null,{"$f":"VLOOKUP(F22, INDIRECT(\"Lists!$A$140:$B$\" & Lists!$C$245), 2, FALSE)","v":{"$error":"#N/A"}},null,null,null,null,null,null,15,{"$f":"IF(OR(E22<>\"\", F22<>\"\", G22<>\"\", H22<>\"\"), 1, 0)","v":0},{"$f":"IF(AND(E22<>\"\", F22<>\"\", G22<>\"\", H22<>\"\"), 1, 0)","v":0}]
[{"$f":"LOOKUP(E23, Lists!A$236:A$245, Lists!B$236:B$245)","v":{"$error":"#N/A"}},null,{"$f":"VLOOKUP(F23, INDIRECT(\"Lists!$A$140:$B$\" & Lists!$C$245), 2, FALSE)","v":{"$error":"#N/A"}},null,null,null,null,null,null,16,{"$f":"IF(OR(E23<>\"\", F23<>\"\", G23<>\"\", H23<>\"\"), 1, 0)","v":0},{"$f":"IF(AND(E23<>\"\", F23<>\"\", G23<>\"\", H23<>\"\"), 1, 0)","v":0}]
[{"$f":"LOOKUP(E24, Lists!A$236:A$245, Lists!B$236:B$245)","v":{"$error":"#N/A"}},null,{"$f":"VLOOKUP(F24, INDIRECT(\"Lists!$A$140:$B$\" & Lists!$C$245), 2, FALSE)","v":{"$error":"#N/A"}},null,null,null,null,null,null,17,{"$f":"IF(OR(E24<>\"\", F24<>\"\", G24<>\"\", H24<>\"\"), 1, 0)","v":0},{"$f":"IF(AND(E24<>\"\", F24<>\"\", G24<>\"\", H24<>\"\"), 1, 0)","v":0}]
[{"$f":"LOOKUP(E25, Lists!A$236:A$245, Lists!B$236:B$245)","v":{"$error":"#N/A"}},null,{"$f":"VLOOKUP(F25, INDIRECT(\"Lists!$A$140:$B$\" & Lists!$C$245), 2, FALSE)","v":{"$error":"#N/A"}},null,null,null,null,null,null,18,0,0]
[null,null,null,"Other\nResources","Resource\n(Example:  Case Management Team)",null,"Team/POETE\n","Number Required\n"]
[null,null,null,null,null,null,null,null,null,null,null,null,1,{"$f":"IF(OR(E27<>\"\", H27<>\"\"), 1, 0)","v":0},{"$f":"IF(AND(E27<>\"\", H27<>\"\"), 1, 0)","v":0}]
[null,null,null,null,null,null,null,null,null,null,null,null,{"$f":"M27+1","v":2},{"$f":"IF(OR(E28<>\"\", H28<>\"\"), 1, 0)","v":0},{"$f":"IF(AND(E28<>\"\", H28<>\"\"), 1, 0)","v":0}]
[null,null,null,null,null,null,null,null,null,null,null,null,{"$f":"M28+1","v":3},{"$f":"IF(OR(E29<>\"\", H29<>\"\"), 1, 0)","v":0},{"$f":"IF(AND(E29<>\"\", H29<>\"\"), 1, 0)","v":0}]
[null,null,null,null,null,null,null,null,null,null,null,null,{"$f":"M29+1","v":4},{"$f":"IF(OR(E30<>\"\", H30<>\"\"), 1, 0)","v":0},{"$f":"IF(AND(E30<>\"\", H30<>\"\"), 1, 0)","v":0}]
[null,null,null,null,null,null,null,null,null,null,null,null,5,0,0]
[null,null,null,null,null,null,null,null,null,null,null,null,6,0,0]

{"sheet":"SPR #20 Infrastructure Sys","index":44,"n_rows":41,"n_cols":19,"rows_kept":41,"cut":false,"hidden":true,"merged":[[2,3,2,7],[3,3,3,7],[5,3,5,7],[7,3,7,7],[12,3,14,3],[14,4,14,7],[8,4,8,7],[9,4,9,7],[10,4,10,7],[30,3,30,7],[31,3,31,7],[33,3,33,7],[40,3,40,7],[16,3,17,3],[19,3,20,3],[22,3,24,3],[24,4,24,7],[26,3,28,3],[28,4,28,7]]}
[21]
[]
[{"$f":"MAX(B:B)","v":1},null,null,"Capability Target"]
[null,{"$f":"ROW()-3","v":1},null,{"$f":"INDIRECT(\"'THIRA Steps 1-3'!$C$89\")","v":0}]
[]
[null,null,null,"Capability Assessment"]
[]
[null,null,null,"Priority"]
[null,null,null,null,"Relative to the other core capabilities, efforts to build and/or sustain this core capability are of high importance to my jurisdiction’s preparedness activities.",null,null,null,null,null,null,null,null,null,null,0]
[null,null,null,null,"Relative to the other core capabilities, efforts to build and/or sustain this core capability are of medium importance to my jurisdiction’s preparedness activities."]
[null,null,null,null,"Relative to the other core capabilities, efforts to build and/or sustain this core capability are of low importance to my jurisdiction’s preparedness activities."]
[]
[null,null,null,"Planning","Rating\nInternal Capability","Rating\nInternal Capability + Mutual Aid","Gap Description","Recent Advances (optional)"]
[null,null,null,null,{"$f":"LOOKUP(P14, Lists!$C$2:$C$8, Lists!D2:D8)","v":"No selection made"},{"$f":"LOOKUP(Q14, Lists!$C$2:$C$8, Lists!D2:D8)","v":"No selection made"},null,null,null,null,null,null,null,null,null,1,1,{"$f":"COUNTIF(I15:AC15, \"TRUE\")","v":0},0]
[null,null,null,null,"Gap Description\nWhich of the following best represent your community's primary planning gaps?",null,null,null,false,false,false,false,false,false,false,false,false]
[]
[null,null,null,"Organization","Rating\nInternal Capability","Rating\nInternal Capability + Mutual Aid","Gap Description","Recent Advances (optional)"]
[null,null,null,null,{"$f":"LOOKUP(P18, Lists!$C$2:$C$8, Lists!E2:E8)","v":"No selection made"},{"$f":"LOOKUP(Q18, Lists!$C$2:$C$8, Lists!E2:E8)","v":"No selection made"},null,null,null,null,null,null,null,null,null,1,1,0]
[]
[null,null,null,"Equipment","Rating\nInternal Capability","Rating\nInternal Capability + Mutual Aid","Gap Description","Recent Advances (optional)"]
[null,null,null,null,{"$f":"LOOKUP(P21, Lists!$C$2:$C$8, Lists!F2:F8)","v":"No selection made"},{"$f":"LOOKUP(Q21, Lists!$C$2:$C$8, Lists!F2:F8)","v":"No selection made"},null,null,null,null,null,null,null,null,null,1,1,0]
[]
[null,null,null,"Training","Rating\nInternal Capability","Rating\nInternal Capability + Mutual Aid","Gap Description","Recent Advances (optional)"]
[null,null,null,null,{"$f":"LOOKUP(P24, Lists!$C$2:$C$8, Lists!G2:G8)","v":"No selection made"},{"$f":"LOOKUP(Q24, Lists!$C$2:$C$8, Lists!G2:G8)","v":"No selection made"},null,null,null,null,null,null,null,null,null,1,1,{"$f":"COUNTIF(I25:S25, \"TRUE\")","v":0},0]
[null,null,null,null,"Gap Description\nWhich of the following best represent your community's primary training gaps?",null,null,null,false,false,false,false,false,false,false,false,false,false,false]
[]
[null,null,null,"Exercises","Rating\nInternal Capability","Rating\nInternal Capability + Mutual Aid","Gap Description","Recent Advances (optional)"]
[null,null,null,null,{"$f":"LOOKUP(P28, Lists!$C$2:$C$8, Lists!H2:H8)","v":"No selection made"},{"$f":"LOOKUP(Q28, Lists!$C$2:$C$8, Lists!H2:H8)","v":"No selection made"},null,null,null,null,null,null,null,null,null,1,1,{"$f":"COUNTIF(I29:AA29, \"TRUE\")","v":0},0]
[null,null,null,null,"Gap Description\nWhich of the following best represent your community's primary exercises gaps?",null,null,null,false,false,false,false,false,false,false,false]
[]
[null,null,null,"Assessment Corroboration"]
[null,null,null,null,null,null,null,null,{"$f":"IF(J32=2,TRUE,IF(J32=3,FALSE,\"\"))","v":""},1]
[]
[null,null,null,"Responsibility for Filling Gap",null,null,null,null,null,null,null,null,null,null,null,0]
[]
[]
[]
[]
[]
[]
[null,null,null,"Journal Notes/Process Narrative (optional)"]

{"sheet":"THIRA #21 Mass Care","index":45,"n_rows":48,"n_cols":20,"rows_kept":48,"cut":false,"hidden":false,"merged":[[2,3,2,7],[3,13,3,14],[43,4,43,5],[44,4,44,5],[45,4,45,5],[46,4,46,5],[5,3,5,7],[6,3,42,3],[43,3,47,3],[3,3,3,7],[47,4,47,5]]}
[21]
[]
[{"$f":"MAX(B:B)","v":1},null,null,"Capability Target",null,null,null,null,null,null,null,null,null,null,null,null,null,null,"# NIMS Rows",{"$f":"MAX(J:J)","v":36}]
[null,{"$f":"ROW()-3","v":1},null,{"$f":"INDIRECT(\"'THIRA Steps 1-3'!$C$93\")","v":0},null,null,null,null,null,null,null,null,null,null,null,null,null,null,"# NIMS Started",{"$f":"SUM(K:K)","v":0}]
[null,null,null,null,null,null,null,null,null,null,null,null,null,null,null,null,null,null,"# NIMS Complete",{"$f":"SUM(L:L)","v":0}]
[null,null,null,"Resource Requirements",null,null,null,null,null,null,null,null,null,null,null,null,null,null,"# Other Rows",{"$f":"MAX(M:M)","v":4}]
[null,null,null,"NIMS-typed Resources","Category","Resource","Type","Number Required",null,null,null,null,null,null,null,null,null,null,"# Other Rows",{"$f":"SUM(N:N)","v":0}]
[{"$f":"LOOKUP(E8, Lists!A$236:A$245, Lists!B$236:B$245)","v":{"$error":"#N/A"}},null,{"$f":"VLOOKUP(F8, INDIRECT(\"Lists!$A$140:$B$\" & Lists!$C$245), 2, FALSE)","v":{"$error":"#N/A"}},null,null,null,null,null,null,1,{"$f":"IF(OR(E8<>\"\", F8<>\"\", G8<>\"\", H8<>\"\"), 1, 0)","v":0},{"$f":"IF(AND(E8<>\"\", F8<>\"\", G8<>\"\", H8<>\"\"), 1, 0)","v":0},null,null,null,null,null,null,"# Other",{"$f":"SUM(O:O)","v":0}]
[{"$f":"LOOKUP(E9, Lists!A$236:A$245, Lists!B$236:B$245)","v":{"$error":"#N/A"}},null,{"$f":"VLOOKUP(F9, INDIRECT(\"Lists!$A$140:$B$\" & Lists!$C$245), 2, FALSE)","v":{"$error":"#N/A"}},null,null,null,null,null,null,{"$f":"J8+1","v":2},{"$f":"IF(OR(E9<>\"\", F9<>\"\", G9<>\"\", H9<>\"\"), 1, 0)","v":0},{"$f":"IF(AND(E9<>\"\", F9<>\"\", G9<>\"\", H9<>\"\"), 1, 0)","v":0}]
[{"$f":"LOOKUP(E10, Lists!A$236:A$245, Lists!B$236:B$245)","v":{"$error":"#N/A"}},null,{"$f":"VLOOKUP(F10, INDIRECT(\"Lists!$A$140:$B$\" & Lists!$C$245), 2, FALSE)","v":{"$error":"#N/A"}},null,null,null,null,null,null,{"$f":"J9+1","v":3},{"$f":"IF(OR(E10<>\"\", F10<>\"\", G10<>\"\", H10<>\"\"), 1, 0)","v":0},{"$f":"IF(AND(E10<>\"\", F10<>\"\", G10<>\"\", H10<>\"\"), 1, 0)","v":0}]
[{"$f":"LOOKUP(E11, Lists!A$236:A$245, Lists!B$236:B$245)","v":{"$error":"#N/A"}},null,{"$f":"VLOOKUP(F11, INDIRECT(\"Lists!$A$140:$B$\" & Lists!$C$245), 2, FALSE)","v":{"$error":"#N/A"}},null,null,null,null,null,null,{"$f":"J10+1","v":4},{"$f":"IF(OR(E11<>\"\", F11<>\"\", G11<>\"\", H11<>\"\"), 1, 0)","v":0},{"$f":"IF(AND(E11<>\"\", F11<>\"\", G11<>\"\", H11<>\"\"), 1, 0)","v":0}]
[{"$f":"LOOKUP(E12, Lists!A$236:A$245, Lists!B$236:B$245)","v":{"$error":"#N/A"}},null,{"$f":"VLOOKUP(F12, INDIRECT(\"Lists!$A$140:$B$\" & Lists!$C$245), 2, FALSE)","v":{"$error":"#N/A"}},null,null,null,null,null,null,{"$f":"J11+1","v":5},{"$f":"IF(OR(E12<>\"\", F12<>\"\", G12<>\"\", H12<>\"\"), 1, 0)","v":0},{"$f":"IF(AND(E12<>\"\", F12<>\"\", G12<>\"\", H12<>\"\"), 1, 0)","v":0}]
[{"$f":"LOOKUP(E13, Lists!A$236:A$245, Lists!B$236:B$245)","v":{"$error":"#N/A"}},null,{"$f":"VLOOKUP(F13, INDIRECT(\"Lists!$A$140:$B$\" & Lists!$C$245), 2, FALSE)","v":{"$error":"#N/A"}},null,null,null,null,null,null,{"$f":"J12+1","v":6},{"$f":"IF(OR(E13<>\"\", F13<>\"\", G13<>\"\", H13<>\"\"), 1, 0)","v":0},{"$f":"IF(AND(E13<>\"\", F13<>\"\", G13<>\"\", H13<>\"\"), 1, 0)","v":0}]
[{"$f":"LOOKUP(E14, Lists!A$236:A$245, Lists!B$236:B$245)","v":{"$error":"#N/A"}},null,{"$f":"VLOOKUP(F14, INDIRECT(\"Lists!$A$140:$B$\" & Lists!$C$245), 2, FALSE)","v":{"$error":"#N/A"}},null,null,null,null,null,null,{"$f":"J13+1","v":7},{"$f":"IF(OR(E14<>\"\", F14<>\"\", G14<>\"\", H14<>\"\"), 1, 0)","v":0},{"$f":"IF(AND(E14<>\"\", F14<>\"\", G14<>\"\", H14<>\"\"), 1, 0)","v":0}]
[{"$f":"LOOKUP(E15, Lists!A$236:A$245, Lists!B$236:B$245)","v":{"$error":"#N/A"}},null,{"$f":"VLOOKUP(F15, INDIRECT(\"Lists!$A$140:$B$\" & Lists!$C$245), 2, FALSE)","v":{"$error":"#N/A"}},null,null,null,null,null,null,{"$f":"J14+1","v":8},{"$f":"IF(OR(E15<>\"\", F15<>\"\", G15<>\"\", H15<>\"\"), 1, 0)","v":0},{"$f":"IF(AND(E15<>\"\", F15<>\"\", G15<>\"\", H15<>\"\"), 1, 0)","v":0}]
[{"$f":"LOOKUP(E16, Lists!A$236:A$245, Lists!B$236:B$245)","v":{"$error":"#N/A"}},null,{"$f":"VLOOKUP(F16, INDIRECT(\"Lists!$A$140:$B$\" & Lists!$C$245), 2, FALSE)","v":{"$error":"#N/A"}},null,null,null,null,null,null,{"$f":"J15+1","v":9},{"$f":"IF(OR(E16<>\"\", F16<>\"\", G16<>\"\", H16<>\"\"), 1, 0)","v":0},{"$f":"IF(AND(E16<>\"\", F16<>\"\", G16<>\"\", H16<>\"\"), 1, 0)","v":0}]
[{"$f":"LOOKUP(E17, Lists!A$236:A$245, Lists!B$236:B$245)","v":{"$error":"#N/A"}},null,{"$f":"VLOOKUP(F17, INDIRECT(\"Lists!$A$140:$B$\" & Lists!$C$245), 2, FALSE)","v":{"$error":"#N/A"}},null,null,null,null,null,null,{"$f":"J16+1","v":10},{"$f":"IF(OR(E17<>\"\", F17<>\"\", G17<>\"\", H17<>\"\"), 1, 0)","v":0},{"$f":"IF(AND(E17<>\"\", F17<>\"\", G17<>\"\", H17<>\"\"), 1, 0)","v":0}]
[{"$f":"LOOKUP(E18, Lists!A$236:A$245, Lists!B$236:B$245)","v":{"$error":"#N/A"}},null,{"$f":"VLOOKUP(F18, INDIRECT(\"Lists!$A$140:$B$\" & Lists!$C$245), 2, FALSE)","v":{"$error":"#N/A"}},null,null,null,null,null,null,{"$f":"J17+1","v":11},{"$f":"IF(OR(E18<>\"\", F18<>\"\", G18<>\"\", H18<>\"\"), 1, 0)","v":0},{"$f":"IF(AND(E18<>\"\", F18<>\"\", G18<>\"\", H18<>\"\"), 1, 0)","v":0}]
[{"$f":"LOOKUP(E19, Lists!A$236:A$245, Lists!B$236:B$245)","v":{"$error":"#N/A"}},null,{"$f":"VLOOKUP(F19, INDIRECT(\"Lists!$A$140:$B$\" & Lists!$C$245), 2, FALSE)","v":{"$error":"#N/A"}},null,null,null,null,null,null,{"$f":"J18+1","v":12},{"$f":"IF(OR(E19<>\"\", F19<>\"\", G19<>\"\", H19<>\"\"), 1, 0)","v":0},{"$f":"IF(AND(E19<>\"\", F19<>\"\", G19<>\"\", H19<>\"\"), 1, 0)","v":0}]
[{"$f":"LOOKUP(E20, Lists!A$236:A$245, Lists!B$236:B$245)","v":{"$error":"#N/A"}},null,{"$f":"VLOOKUP(F20, INDIRECT(\"Lists!$A$140:$B$\" & Lists!$C$245), 2, FALSE)","v":{"$error":"#N/A"}},null,null,null,null,null,null,{"$f":"J19+1","v":13},{"$f":"IF(OR(E20<>\"\", F20<>\"\", G20<>\"\", H20<>\"\"), 1, 0)","v":0},{"$f":"IF(AND(E20<>\"\", F20<>\"\", G20<>\"\", H20<>\"\"), 1, 0)","v":0}]
[{"$f":"LOOKUP(E21, Lists!A$236:A$245, Lists!B$236:B$245)","v":{"$error":"#N/A"}},null,{"$f":"VLOOKUP(F21, INDIRECT(\"Lists!$A$140:$B$\" & Lists!$C$245), 2, FALSE)","v":{"$error":"#N/A"}},null,null,null,null,null,null,{"$f":"J20+1","v":14},{"$f":"IF(OR(E21<>\"\", F21<>\"\", G21<>\"\", H21<>\"\"), 1, 0)","v":0},{"$f":"IF(AND(E21<>\"\", F21<>\"\", G21<>\"\", H21<>\"\"), 1, 0)","v":0}]
[{"$f":"LOOKUP(E22, Lists!A$236:A$245, Lists!B$236:B$245)","v":{"$error":"#N/A"}},null,{"$f":"VLOOKUP(F22, INDIRECT(\"Lists!$A$140:$B$\" & Lists!$C$245), 2, FALSE)","v":{"$error":"#N/A"}},null,null,null,null,null,null,{"$f":"J21+1","v":15},{"$f":"IF(OR(E22<>\"\", F22<>\"\", G22<>\"\", H22<>\"\"), 1, 0)","v":0},{"$f":"IF(AND(E22<>\"\", F22<>\"\", G22<>\"\", H22<>\"\"), 1, 0)","v":0}]
[{"$f":"LOOKUP(E23, Lists!A$236:A$245, Lists!B$236:B$245)","v":{"$error":"#N/A"}},null,{"$f":"VLOOKUP(F23, INDIRECT(\"Lists!$A$140:$B$\" & Lists!$C$245), 2, FALSE)","v":{"$error":"#N/A"}},null,null,null,null,null,null,{"$f":"J22+1","v":16},{"$f":"IF(OR(E23<>\"\", F23<>\"\", G23<>\"\", H23<>\"\"), 1, 0)","v":0},{"$f":"IF(AND(E23<>\"\", F23<>\"\", G23<>\"\", H23<>\"\"), 1, 0)","v":0}]
[{"$f":"LOOKUP(E24, Lists!A$236:A$245, Lists!B$236:B$245)","v":{"$error":"#N/A"}},null,{"$f":"VLOOKUP(F24, INDIRECT(\"Lists!$A$140:$B$\" & Lists!$C$245), 2, FALSE)","v":{"$error":"#N/A"}},null,null,null,null,null,null,{"$f":"J23+1","v":17},{"$f":"IF(OR(E24<>\"\", F24<>\"\", G24<>\"\", H24<>\"\"), 1, 0)","v":0},{"$f":"IF(AND(E24<>\"\", F24<>\"\", G24<>\"\", H24<>\"\"), 1, 0)","v":0}]
[{"$f":"LOOKUP(E25, Lists!A$236:A$245, Lists!B$236:B$245)","v":{"$error":"#N/A"}},null,{"$f":"VLOOKUP(F25, INDIRECT(\"Lists!$A$140:$B$\" & Lists!$C$245), 2, FALSE)","v":{"$error":"#N/A"}},null,null,null,null,null,null,{"$f":"J24+1","v":18},{"$f":"IF(OR(E25<>\"\", F25<>\"\", G25<>\"\", H25<>\"\"), 1, 0)","v":0},{"$f":"IF(AND(E25<>\"\", F25<>\"\", G25<>\"\", H25<>\"\"), 1, 0)","v":0}]
[{"$f":"LOOKUP(E26, Lists!A$236:A$245, Lists!B$236:B$245)","v":{"$error":"#N/A"}},null,{"$f":"VLOOKUP(F26, INDIRECT(\"Lists!$A$140:$B$\" & Lists!$C$245), 2, FALSE)","v":{"$error":"#N/A"}},null,null,null,null,null,null,{"$f":"J25+1","v":19},{"$f":"IF(OR(E26<>\"\", F26<>\"\", G26<>\"\", H26<>\"\"), 1, 0)","v":0},{"$f":"IF(AND(E26<>\"\", F26<>\"\", G26<>\"\", H26<>\"\"), 1, 0)","v":0}]
[{"$f":"LOOKUP(E27, Lists!A$236:A$245, Lists!B$236:B$245)","v":{"$error":"#N/A"}},null,{"$f":"VLOOKUP(F27, INDIRECT(\"Lists!$A$140:$B$\" & Lists!$C$245), 2, FALSE)","v":{"$error":"#N/A"}},null,null,null,null,null,null,{"$f":"J26+1","v":20},{"$f":"IF(OR(E27<>\"\", F27<>\"\", G27<>\"\", H27<>\"\"), 1, 0)","v":0},{"$f":"IF(AND(E27<>\"\", F27<>\"\", G27<>\"\", H27<>\"\"), 1, 0)","v":0}]
[{"$f":"LOOKUP(E28, Lists!A$236:A$245, Lists!B$236:B$245)","v":{"$error":"#N/A"}},null,{"$f":"VLOOKUP(F28, INDIRECT(\"Lists!$A$140:$B$\" & Lists!$C$245), 2, FALSE)","v":{"$error":"#N/A"}},null,null,null,null,null,null,{"$f":"J27+1","v":21},{"$f":"IF(OR(E28<>\"\", F28<>\"\", G28<>\"\", H28<>\"\"), 1, 0)","v":0},{"$f":"IF(AND(E28<>\"\", F28<>\"\", G28<>\"\", H28<>\"\"), 1, 0)","v":0}]
[{"$f":"LOOKUP(E29, Lists!A$236:A$245, Lists!B$236:B$245)","v":{"$error":"#N/A"}},null,{"$f":"VLOOKUP(F29, INDIRECT(\"Lists!$A$140:$B$\" & Lists!$C$245), 2, FALSE)","v":{"$error":"#N/A"}},null,null,null,null,null,null,{"$f":"J28+1","v":22},{"$f":"IF(OR(E29<>\"\", F29<>\"\", G29<>\"\", H29<>\"\"), 1, 0)","v":0},{"$f":"IF(AND(E29<>\"\", F29<>\"\", G29<>\"\", H29<>\"\"), 1, 0)","v":0}]
[{"$f":"LOOKUP(E30, Lists!A$236:A$245, Lists!B$236:B$245)","v":{"$error":"#N/A"}},null,{"$f":"VLOOKUP(F30, INDIRECT(\"Lists!$A$140:$B$\" & Lists!$C$245), 2, FALSE)","v":{"$error":"#N/A"}},null,null,null,null,null,null,{"$f":"J29+1","v":23},{"$f":"IF(OR(E30<>\"\", F30<>\"\", G30<>\"\", H30<>\"\"), 1, 0)","v":0},{"$f":"IF(AND(E30<>\"\", F30<>\"\", G30<>\"\", H30<>\"\"), 1, 0)","v":0}]
[{"$f":"LOOKUP(E31, Lists!A$236:A$245, Lists!B$236:B$245)","v":{"$error":"#N/A"}},null,{"$f":"VLOOKUP(F31, INDIRECT(\"Lists!$A$140:$B$\" & Lists!$C$245), 2, FALSE)","v":{"$error":"#N/A"}},null,null,null,null,null,null,{"$f":"J30+1","v":24},{"$f":"IF(OR(E31<>\"\", F31<>\"\", G31<>\"\", H31<>\"\"), 1, 0)","v":0},{"$f":"IF(AND(E31<>\"\", F31<>\"\", G31<>\"\", H31<>\"\"), 1, 0)","v":0}]
[{"$f":"LOOKUP(E32, Lists!A$236:A$245, Lists!B$236:B$245)","v":{"$error":"#N/A"}},null,{"$f":"VLOOKUP(F32, INDIRECT(\"Lists!$A$140:$B$\" & Lists!$C$245), 2, FALSE)","v":{"$error":"#N/A"}},null,null,null,null,null,null,{"$f":"J31+1","v":25},{"$f":"IF(OR(E32<>\"\", F32<>\"\", G32<>\"\", H32<>\"\"), 1, 0)","v":0},{"$f":"IF(AND(E32<>\"\", F32<>\"\", G32<>\"\", H32<>\"\"), 1, 0)","v":0}]
[{"$f":"LOOKUP(E33, Lists!A$236:A$245, Lists!B$236:B$245)","v":{"$error":"#N/A"}},null,{"$f":"VLOOKUP(F33, INDIRECT(\"Lists!$A$140:$B$\" & Lists!$C$245), 2, FALSE)","v":{"$error":"#N/A"}},null,null,null,null,null,null,{"$f":"J32+1","v":26},{"$f":"IF(OR(E33<>\"\", F33<>\"\", G33<>\"\", H33<>\"\"), 1, 0)","v":0},{"$f":"IF(AND(E33<>\"\", F33<>\"\", G33<>\"\", H33<>\"\"), 1, 0)","v":0}]
[{"$f":"LOOKUP(E34, Lists!A$236:A$245, Lists!B$236:B$245)","v":{"$error":"#N/A"}},null,{"$f":"VLOOKUP(F34, INDIRECT(\"Lists!$A$140:$B$\" & Lists!$C$245), 2, FALSE)","v":{"$error":"#N/A"}},null,null,null,null,null,null,{"$f":"J33+1","v":27},{"$f":"IF(OR(E34<>\"\", F34<>\"\", G34<>\"\", H34<>\"\"), 1, 0)","v":0},{"$f":"IF(AND(E34<>\"\", F34<>\"\", G34<>\"\", H34<>\"\"), 1, 0)","v":0}]
[{"$f":"LOOKUP(E35, Lists!A$236:A$245, Lists!B$236:B$245)","v":{"$error":"#N/A"}},null,{"$f":"VLOOKUP(F35, INDIRECT(\"Lists!$A$140:$B$\" & Lists!$C$245), 2, FALSE)","v":{"$error":"#N/A"}},null,null,null,null,null,null,{"$f":"J34+1","v":28},{"$f":"IF(OR(E35<>\"\", F35<>\"\", G35<>\"\", H35<>\"\"), 1, 0)","v":0},{"$f":"IF(AND(E35<>\"\", F35<>\"\", G35<>\"\", H35<>\"\"), 1, 0)","v":0}]
[{"$f":"LOOKUP(E36, Lists!A$236:A$245, Lists!B$236:B$245)","v":{"$error":"#N/A"}},null,{"$f":"VLOOKUP(F36, INDIRECT(\"Lists!$A$140:$B$\" & Lists!$C$245), 2, FALSE)","v":{"$error":"#N/A"}},null,null,null,null,null,null,{"$f":"J35+1","v":29},{"$f":"IF(OR(E36<>\"\", F36<>\"\", G36<>\"\", H36<>\"\"), 1, 0)","v":0},{"$f":"IF(AND(E36<>\"\", F36<>\"\", G36<>\"\", H36<>\"\"), 1, 0)","v":0}]
[{"$f":"LOOKUP(E37, Lists!A$236:A$245, Lists!B$236:B$245)","v":{"$error":"#N/A"}},null,{"$f":"VLOOKUP(F37, INDIRECT(\"Lists!$A$140:$B$\" & Lists!$C$245), 2, FALSE)","v":{"$error":"#N/A"}},null,null,null,null,null,null,{"$f":"J36+1","v":30},{"$f":"IF(OR(E37<>\"\", F37<>\"\", G37<>\"\", H37<>\"\"), 1, 0)","v":0},{"$f":"IF(AND(E37<>\"\", F37<>\"\", G37<>\"\", H37<>\"\"), 1, 0)","v":0}]
[{"$f":"LOOKUP(E38, Lists!A$236:A$245, Lists!B$236:B$245)","v":{"$error":"#N/A"}},null,{"$f":"VLOOKUP(F38, INDIRECT(\"Lists!$A$140:$B$\" & Lists!$C$245), 2, FALSE)","v":{"$error":"#N/A"}},null,null,null,null,null,null,{"$f":"J37+1","v":31},{"$f":"IF(OR(E38<>\"\", F38<>\"\", G38<>\"\", H38<>\"\"), 1, 0)","v":0},{"$f":"IF(AND(E38<>\"\", F38<>\"\", G38<>\"\", H38<>\"\"), 1, 0)","v":0}]
[{"$f":"LOOKUP(E39, Lists!A$236:A$245, Lists!B$236:B$245)","v":{"$error":"#N/A"}},null,{"$f":"VLOOKUP(F39, INDIRECT(\"Lists!$A$140:$B$\" & Lists!$C$245), 2, FALSE)","v":{"$error":"#N/A"}},null,null,null,null,null,null,{"$f":"J38+1","v":32},{"$f":"IF(OR(E39<>\"\", F39<>\"\", G39<>\"\", H39<>\"\"), 1, 0)","v":0},{"$f":"IF(AND(E39<>\"\", F39<>\"\", G39<>\"\", H39<>\"\"), 1, 0)","v":0}]
[{"$f":"LOOKUP(E40, Lists!A$236:A$245, Lists!B$236:B$245)","v":{"$error":"#N/A"}},null,{"$f":"VLOOKUP(F40, INDIRECT(\"Lists!$A$140:$B$\" & Lists!$C$245), 2, FALSE)","v":{"$error":"#N/A"}},null,null,null,null,null,null,{"$f":"J39+1","v":33},{"$f":"IF(OR(E40<>\"\", F40<>\"\", G40<>\"\", H40<>\"\"), 1, 0)","v":0},{"$f":"IF(AND(E40<>\"\", F40<>\"\", G40<>\"\", H40<>\"\"), 1, 0)","v":0}]
[{"$f":"LOOKUP(E41, Lists!A$236:A$245, Lists!B$236:B$245)","v":{"$error":"#N/A"}},null,{"$f":"VLOOKUP(F41, INDIRECT(\"Lists!$A$140:$B$\" & Lists!$C$245), 2, FALSE)","v":{"$error":"#N/A"}},null,null,null,null,null,null,{"$f":"J40+1","v":34},{"$f":"IF(OR(E41<>\"\", F41<>\"\", G41<>\"\", H41<>\"\"), 1, 0)","v":0},{"$f":"IF(AND(E41<>\"\", F41<>\"\", G41<>\"\", H41<>\"\"), 1, 0)","v":0}]
[{"$f":"LOOKUP(E42, Lists!A$236:A$245, Lists!B$236:B$245)","v":{"$error":"#N/A"}},null,{"$f":"VLOOKUP(F42, INDIRECT(\"Lists!$A$140:$B$\" & Lists!$C$245), 2, FALSE)","v":{"$error":"#N/A"}},null,null,null,null,null,null,{"$f":"J41+1","v":35},{"$f":"IF(OR(E42<>\"\", F42<>\"\", G42<>\"\", H42<>\"\"), 1, 0)","v":0},{"$f":"IF(AND(E42<>\"\", F42<>\"\", G42<>\"\", H42<>\"\"), 1, 0)","v":0}]
[{"$f":"LOOKUP(E43, Lists!A$236:A$245, Lists!B$236:B$245)","v":{"$error":"#N/A"}},null,{"$f":"VLOOKUP(F43, INDIRECT(\"Lists!$A$140:$B$\" & Lists!$C$245), 2, FALSE)","v":{"$error":"#N/A"}},null,null,null,null,null,null,36,0,0]
[null,null,null,"Other\nResources","Resource\n(Example:  Case Management Team)",null,"Team/POETE\n","Number Required\n"]
[null,null,null,null,null,null,null,null,null,null,null,null,1,{"$f":"IF(OR(E45<>\"\", H45<>\"\"), 1, 0)","v":0},{"$f":"IF(AND(E45<>\"\", H45<>\"\"), 1, 0)","v":0}]
[null,null,null,null,null,null,null,null,null,null,null,null,{"$f":"M45+1","v":2},{"$f":"IF(OR(E46<>\"\", H46<>\"\"), 1, 0)","v":0},{"$f":"IF(AND(E46<>\"\", H46<>\"\"), 1, 0)","v":0}]
[null,null,null,null,null,null,null,null,null,null,null,null,{"$f":"M46+1","v":3},{"$f":"IF(OR(E47<>\"\", H47<>\"\"), 1, 0)","v":0},{"$f":"IF(AND(E47<>\"\", H47<>\"\"), 1, 0)","v":0}]
[null,null,null,null,null,null,null,null,null,null,null,null,{"$f":"M47+1","v":4},{"$f":"IF(OR(E48<>\"\", H48<>\"\"), 1, 0)","v":0},{"$f":"IF(AND(E48<>\"\", H48<>\"\"), 1, 0)","v":0}]

{"sheet":"SPR #21 Mass Care","index":46,"n_rows":41,"n_cols":19,"rows_kept":41,"cut":false,"hidden":true,"merged":[[2,3,2,7],[3,3,3,7],[5,3,5,7],[7,3,7,7],[12,3,14,3],[14,4,14,7],[8,4,8,7],[9,4,9,7],[10,4,10,7],[30,3,30,7],[31,3,31,7],[33,3,33,7],[40,3,40,7],[16,3,17,3],[19,3,20,3],[22,3,24,3],[24,4,24,7],[26,3,28,3],[28,4,28,7]]}
[21]
[]
[{"$f":"MAX(B:B)","v":1},null,null,"Capability Target"]
[null,{"$f":"ROW()-3","v":1},null,{"$f":"INDIRECT(\"'THIRA Steps 1-3'!$C$93\")","v":0}]
[]
[null,null,null,"Capability Assessment"]
[]
[null,null,null,"Priority"]
[null,null,null,null,"Relative to the other core capabilities, efforts to build and/or sustain this core capability are of high importance to my jurisdiction’s preparedness activities.",null,null,null,null,null,null,null,null,null,null,0]
[null,null,null,null,"Relative to the other core capabilities, efforts to build and/or sustain this core capability are of medium importance to my jurisdiction’s preparedness activities."]
[null,null,null,null,"Relative to the other core capabilities, efforts to build and/or sustain this core capability are of low importance to my jurisdiction’s preparedness activities."]
[]
[null,null,null,"Planning","Rating\nInternal Capability","Rating\nInternal Capability + Mutual Aid","Gap Description","Recent Advances (optional)"]
[null,null,null,null,{"$f":"LOOKUP(P14, Lists!$C$2:$C$8, Lists!D2:D8)","v":"No selection made"},{"$f":"LOOKUP(Q14, Lists!$C$2:$C$8, Lists!D2:D8)","v":"No selection made"},null,null,null,null,null,null,null,null,null,1,1,{"$f":"COUNTIF(I15:AC15, \"TRUE\")","v":0},0]
[null,null,null,null,"Gap Description\nWhich of the following best represent your community's primary planning gaps?",null,null,null,false,false,false,false,false,false,false,false,false]
[]
[null,null,null,"Organization","Rating\nInternal Capability","Rating\nInternal Capability + Mutual Aid","Gap Description","Recent Advances (optional)"]
[null,null,null,null,{"$f":"LOOKUP(P18, Lists!$C$2:$C$8, Lists!E2:E8)","v":"No selection made"},{"$f":"LOOKUP(Q18, Lists!$C$2:$C$8, Lists!E2:E8)","v":"No selection made"},null,null,null,null,null,null,null,null,null,1,1,0]
[]
[null,null,null,"Equipment","Rating\nInternal Capability","Rating\nInternal Capability + Mutual Aid","Gap Description","Recent Advances (optional)"]
[null,null,null,null,{"$f":"LOOKUP(P21, Lists!$C$2:$C$8, Lists!F2:F8)","v":"No selection made"},{"$f":"LOOKUP(Q21, Lists!$C$2:$C$8, Lists!F2:F8)","v":"No selection made"},null,null,null,null,null,null,null,null,null,1,1,0]
[]
[null,null,null,"Training","Rating\nInternal Capability","Rating\nInternal Capability + Mutual Aid","Gap Description","Recent Advances (optional)"]
[null,null,null,null,{"$f":"LOOKUP(P24, Lists!$C$2:$C$8, Lists!G2:G8)","v":"No selection made"},{"$f":"LOOKUP(Q24, Lists!$C$2:$C$8, Lists!G2:G8)","v":"No selection made"},null,null,null,null,null,null,null,null,null,1,1,{"$f":"COUNTIF(I25:S25, \"TRUE\")","v":0},0]
[null,null,null,null,"Gap Description\nWhich of the following best represent your community's primary training gaps?",null,null,null,false,false,false,false,false,false,false,false,false,false,false]
[]
[null,null,null,"Exercises","Rating\nInternal Capability","Rating\nInternal Capability + Mutual Aid","Gap Description","Recent Advances (optional)"]
[null,null,null,null,{"$f":"LOOKUP(P28, Lists!$C$2:$C$8, Lists!H2:H8)","v":"No selection made"},{"$f":"LOOKUP(Q28, Lists!$C$2:$C$8, Lists!H2:H8)","v":"No selection made"},null,null,null,null,null,null,null,null,null,1,1,{"$f":"COUNTIF(I29:AA29, \"TRUE\")","v":0},0]
[null,null,null,null,"Gap Description\nWhich of the following best represent your community's primary exercises gaps?",null,null,null,false,false,false,false,false,false,false,false]
[]
[null,null,null,"Assessment Corroboration"]
[null,null,null,null,null,null,null,null,{"$f":"IF(J32=2,TRUE,IF(J32=3,FALSE,\"\"))","v":""},1]
[]
[null,null,null,"Responsibility for Filling Gap",null,null,null,null,null,null,null,null,null,null,null,0]
[]
[]
[]
[]
[]
[]
[null,null,null,"Journal Notes/Process Narrative (optional)"]

{"sheet":"THIRA #22 Mass SAR Ops","index":47,"n_rows":22,"n_cols":20,"rows_kept":22,"cut":false,"hidden":false,"merged":[[21,4,21,5],[2,3,2,7],[3,3,3,7],[3,13,3,14],[5,3,5,7],[6,3,16,3],[17,3,21,3],[17,4,17,5],[18,4,18,5],[19,4,19,5],[20,4,20,5]]}
[21]
[]
[{"$f":"MAX(B:B)","v":1},null,null,"Capability Target",null,null,null,null,null,null,null,null,null,null,null,null,null,null,"# NIMS Rows",{"$f":"MAX(J:J)","v":10}]
[null,{"$f":"ROW()-3","v":1},null,{"$f":"INDIRECT(\"'THIRA Steps 1-3'!$C$97\")","v":0},null,null,null,null,null,null,null,null,null,null,null,null,null,null,"# NIMS Started",{"$f":"SUM(K:K)","v":0}]
[null,null,null,null,null,null,null,null,null,null,null,null,null,null,null,null,null,null,"# NIMS Complete",{"$f":"SUM(L:L)","v":0}]
[null,null,null,"Resource Requirements",null,null,null,null,null,null,null,null,null,null,null,null,null,null,"# Other Rows",{"$f":"MAX(M:M)","v":4}]
[null,null,null,"NIMS-typed Resources","Category","Resource","Type","Number Required",null,null,null,null,null,null,null,null,null,null,"# Other Rows",{"$f":"SUM(N:N)","v":0}]
[{"$f":"LOOKUP(E8, Lists!A$236:A$245, Lists!B$236:B$245)","v":{"$error":"#N/A"}},null,{"$f":"VLOOKUP(F8, INDIRECT(\"Lists!$A$140:$B$\" & Lists!$C$245), 2, FALSE)","v":{"$error":"#N/A"}},null,null,null,null,null,null,1,{"$f":"IF(OR(E8<>\"\", F8<>\"\", G8<>\"\", H8<>\"\"), 1, 0)","v":0},{"$f":"IF(AND(E8<>\"\", F8<>\"\", G8<>\"\", H8<>\"\"), 1, 0)","v":0},null,null,null,null,null,null,"# Other",{"$f":"SUM(O:O)","v":0}]
[{"$f":"LOOKUP(E9, Lists!A$236:A$245, Lists!B$236:B$245)","v":{"$error":"#N/A"}},null,{"$f":"VLOOKUP(F9, INDIRECT(\"Lists!$A$140:$B$\" & Lists!$C$245), 2, FALSE)","v":{"$error":"#N/A"}},null,null,null,null,null,null,{"$f":"J8+1","v":2},{"$f":"IF(OR(E9<>\"\", F9<>\"\", G9<>\"\", H9<>\"\"), 1, 0)","v":0},{"$f":"IF(AND(E9<>\"\", F9<>\"\", G9<>\"\", H9<>\"\"), 1, 0)","v":0}]
[{"$f":"LOOKUP(E10, Lists!A$236:A$245, Lists!B$236:B$245)","v":{"$error":"#N/A"}},null,{"$f":"VLOOKUP(F10, INDIRECT(\"Lists!$A$140:$B$\" & Lists!$C$245), 2, FALSE)","v":{"$error":"#N/A"}},null,null,null,null,null,null,{"$f":"J9+1","v":3},{"$f":"IF(OR(E10<>\"\", F10<>\"\", G10<>\"\", H10<>\"\"), 1, 0)","v":0},{"$f":"IF(AND(E10<>\"\", F10<>\"\", G10<>\"\", H10<>\"\"), 1, 0)","v":0}]
[{"$f":"LOOKUP(E11, Lists!A$236:A$245, Lists!B$236:B$245)","v":{"$error":"#N/A"}},null,{"$f":"VLOOKUP(F11, INDIRECT(\"Lists!$A$140:$B$\" & Lists!$C$245), 2, FALSE)","v":{"$error":"#N/A"}},null,null,null,null,null,null,{"$f":"J10+1","v":4},{"$f":"IF(OR(E11<>\"\", F11<>\"\", G11<>\"\", H11<>\"\"), 1, 0)","v":0},{"$f":"IF(AND(E11<>\"\", F11<>\"\", G11<>\"\", H11<>\"\"), 1, 0)","v":0}]
[{"$f":"LOOKUP(E12, Lists!A$236:A$245, Lists!B$236:B$245)","v":{"$error":"#N/A"}},null,{"$f":"VLOOKUP(F12, INDIRECT(\"Lists!$A$140:$B$\" & Lists!$C$245), 2, FALSE)","v":{"$error":"#N/A"}},null,null,null,null,null,null,{"$f":"J11+1","v":5},{"$f":"IF(OR(E12<>\"\", F12<>\"\", G12<>\"\", H12<>\"\"), 1, 0)","v":0},{"$f":"IF(AND(E12<>\"\", F12<>\"\", G12<>\"\", H12<>\"\"), 1, 0)","v":0}]
[{"$f":"LOOKUP(E13, Lists!A$236:A$245, Lists!B$236:B$245)","v":{"$error":"#N/A"}},null,{"$f":"VLOOKUP(F13, INDIRECT(\"Lists!$A$140:$B$\" & Lists!$C$245), 2, FALSE)","v":{"$error":"#N/A"}},null,null,null,null,null,null,{"$f":"J12+1","v":6},{"$f":"IF(OR(E13<>\"\", F13<>\"\", G13<>\"\", H13<>\"\"), 1, 0)","v":0},{"$f":"IF(AND(E13<>\"\", F13<>\"\", G13<>\"\", H13<>\"\"), 1, 0)","v":0}]
[{"$f":"LOOKUP(E14, Lists!A$236:A$245, Lists!B$236:B$245)","v":{"$error":"#N/A"}},null,{"$f":"VLOOKUP(F14, INDIRECT(\"Lists!$A$140:$B$\" & Lists!$C$245), 2, FALSE)","v":{"$error":"#N/A"}},null,null,null,null,null,null,{"$f":"J13+1","v":7},{"$f":"IF(OR(E14<>\"\", F14<>\"\", G14<>\"\", H14<>\"\"), 1, 0)","v":0},{"$f":"IF(AND(E14<>\"\", F14<>\"\", G14<>\"\", H14<>\"\"), 1, 0)","v":0}]
[{"$f":"LOOKUP(E15, Lists!A$236:A$245, Lists!B$236:B$245)","v":{"$error":"#N/A"}},null,{"$f":"VLOOKUP(F15, INDIRECT(\"Lists!$A$140:$B$\" & Lists!$C$245), 2, FALSE)","v":{"$error":"#N/A"}},null,null,null,null,null,null,{"$f":"J14+1","v":8},{"$f":"IF(OR(E15<>\"\", F15<>\"\", G15<>\"\", H15<>\"\"), 1, 0)","v":0},{"$f":"IF(AND(E15<>\"\", F15<>\"\", G15<>\"\", H15<>\"\"), 1, 0)","v":0}]
[{"$f":"LOOKUP(E16, Lists!A$236:A$245, Lists!B$236:B$245)","v":{"$error":"#N/A"}},null,{"$f":"VLOOKUP(F16, INDIRECT(\"Lists!$A$140:$B$\" & Lists!$C$245), 2, FALSE)","v":{"$error":"#N/A"}},null,null,null,null,null,null,{"$f":"J15+1","v":9},{"$f":"IF(OR(E16<>\"\", F16<>\"\", G16<>\"\", H16<>\"\"), 1, 0)","v":0},{"$f":"IF(AND(E16<>\"\", F16<>\"\", G16<>\"\", H16<>\"\"), 1, 0)","v":0}]
[{"$f":"LOOKUP(E17, Lists!A$236:A$245, Lists!B$236:B$245)","v":{"$error":"#N/A"}},null,{"$f":"VLOOKUP(F17, INDIRECT(\"Lists!$A$140:$B$\" & Lists!$C$245), 2, FALSE)","v":{"$error":"#N/A"}},null,null,null,null,null,null,10,0,0]
[null,null,null,"Other\nResources","Resource\n(Example:  Case Management Team)",null,"Team/POETE\n","Number Required\n"]
[null,null,null,null,null,null,null,null,null,null,null,null,1,{"$f":"IF(OR(E19<>\"\", H19<>\"\"), 1, 0)","v":0},{"$f":"IF(AND(E19<>\"\", H19<>\"\"), 1, 0)","v":0}]
[null,null,null,null,null,null,null,null,null,null,null,null,{"$f":"M19+1","v":2},{"$f":"IF(OR(E20<>\"\", H20<>\"\"), 1, 0)","v":0},{"$f":"IF(AND(E20<>\"\", H20<>\"\"), 1, 0)","v":0}]
[null,null,null,null,null,null,null,null,null,null,null,null,{"$f":"M20+1","v":3},{"$f":"IF(OR(E21<>\"\", H21<>\"\"), 1, 0)","v":0},{"$f":"IF(AND(E21<>\"\", H21<>\"\"), 1, 0)","v":0}]
[null,null,null,null,null,null,null,null,null,null,null,null,{"$f":"M21+1","v":4},{"$f":"IF(OR(E22<>\"\", H22<>\"\"), 1, 0)","v":0},{"$f":"IF(AND(E22<>\"\", H22<>\"\"), 1, 0)","v":0}]

{"sheet":"SPR #22 Mass SAR Ops","index":48,"n_rows":41,"n_cols":19,"rows_kept":41,"cut":false,"hidden":true,"merged":[[2,3,2,7],[3,3,3,7],[5,3,5,7],[7,3,7,7],[12,3,14,3],[14,4,14,7],[8,4,8,7],[9,4,9,7],[10,4,10,7],[30,3,30,7],[31,3,31,7],[33,3,33,7],[40,3,40,7],[16,3,17,3],[19,3,20,3],[22,3,24,3],[24,4,24,7],[26,3,28,3],[28,4,28,7]]}
[21]
[]
[{"$f":"MAX(B:B)","v":1},null,null,"Capability Target"]
[null,{"$f":"ROW()-3","v":1},null,{"$f":"INDIRECT(\"'THIRA Steps 1-3'!$C$97\")","v":0}]
[]
[null,null,null,"Capability Assessment"]
[]
[null,null,null,"Priority"]
[null,null,null,null,"Relative to the other core capabilities, efforts to build and/or sustain this core capability are of high importance to my jurisdiction’s preparedness activities.",null,null,null,null,null,null,null,null,null,null,0]
[null,null,null,null,"Relative to the other core capabilities, efforts to build and/or sustain this core capability are of medium importance to my jurisdiction’s preparedness activities."]
[null,null,null,null,"Relative to the other core capabilities, efforts to build and/or sustain this core capability are of low importance to my jurisdiction’s preparedness activities."]
[]
[null,null,null,"Planning","Rating\nInternal Capability","Rating\nInternal Capability + Mutual Aid","Gap Description","Recent Advances (optional)"]
[null,null,null,null,{"$f":"LOOKUP(P14, Lists!$C$2:$C$8, Lists!D2:D8)","v":"No selection made"},{"$f":"LOOKUP(Q14, Lists!$C$2:$C$8, Lists!D2:D8)","v":"No selection made"},null,null,null,null,null,null,null,null,null,1,1,{"$f":"COUNTIF(I15:AC15, \"TRUE\")","v":0},0]
[null,null,null,null,"Gap Description\nWhich of the following best represent your community's primary planning gaps?",null,null,null,false,false,false,false,false,false,false,false,false]
[]
[null,null,null,"Organization","Rating\nInternal Capability","Rating\nInternal Capability + Mutual Aid","Gap Description","Recent Advances (optional)"]
[null,null,null,null,{"$f":"LOOKUP(P18, Lists!$C$2:$C$8, Lists!E2:E8)","v":"No selection made"},{"$f":"LOOKUP(Q18, Lists!$C$2:$C$8, Lists!E2:E8)","v":"No selection made"},null,null,null,null,null,null,null,null,null,1,1,0]
[]
[null,null,null,"Equipment","Rating\nInternal Capability","Rating\nInternal Capability + Mutual Aid","Gap Description","Recent Advances (optional)"]
[null,null,null,null,{"$f":"LOOKUP(P21, Lists!$C$2:$C$8, Lists!F2:F8)","v":"No selection made"},{"$f":"LOOKUP(Q21, Lists!$C$2:$C$8, Lists!F2:F8)","v":"No selection made"},null,null,null,null,null,null,null,null,null,1,1,0]
[]
[null,null,null,"Training","Rating\nInternal Capability","Rating\nInternal Capability + Mutual Aid","Gap Description","Recent Advances (optional)"]
[null,null,null,null,{"$f":"LOOKUP(P24, Lists!$C$2:$C$8, Lists!G2:G8)","v":"No selection made"},{"$f":"LOOKUP(Q24, Lists!$C$2:$C$8, Lists!G2:G8)","v":"No selection made"},null,null,null,null,null,null,null,null,null,1,1,{"$f":"COUNTIF(I25:S25, \"TRUE\")","v":0},0]
[null,null,null,null,"Gap Description\nWhich of the following best represent your community's primary training gaps?",null,null,null,false,false,false,false,false,false,false,false,false,false,false]
[]
[null,null,null,"Exercises","Rating\nInternal Capability","Rating\nInternal Capability + Mutual Aid","Gap Description","Recent Advances (optional)"]
[null,null,null,null,{"$f":"LOOKUP(P28, Lists!$C$2:$C$8, Lists!H2:H8)","v":"No selection made"},{"$f":"LOOKUP(Q28, Lists!$C$2:$C$8, Lists!H2:H8)","v":"No selection made"},null,null,null,null,null,null,null,null,null,1,1,{"$f":"COUNTIF(I29:AA29, \"TRUE\")","v":0},0]
[null,null,null,null,"Gap Description\nWhich of the following best represent your community's primary exercises gaps?",null,null,null,false,false,false,false,false,false,false,false]
[]
[null,null,null,"Assessment Corroboration"]
[null,null,null,null,null,null,null,null,{"$f":"IF(J32=2,TRUE,IF(J32=3,FALSE,\"\"))","v":""},1]
[]
[null,null,null,"Responsibility for Filling Gap",null,null,null,null,null,null,null,null,null,null,null,0]
[]
[]
[]
[]
[]
[]
[null,null,null,"Journal Notes/Process Narrative (optional)"]

{"sheet":"THIRA #23 Security Protection","index":49,"n_rows":18,"n_cols":20,"rows_kept":18,"cut":false,"hidden":false,"merged":[[17,4,17,5],[2,3,2,7],[3,3,3,7],[3,13,3,14],[5,3,5,7],[6,3,12,3],[13,3,17,3],[13,4,13,5],[14,4,14,5],[15,4,15,5],[16,4,16,5]]}
[21]
[]
[{"$f":"MAX(B:B)","v":1},null,null,"Capability Target",null,null,null,null,null,null,null,null,null,null,null,null,null,null,"# NIMS Rows",{"$f":"MAX(J:J)","v":6}]
[null,{"$f":"ROW()-3","v":1},null,{"$f":"INDIRECT(\"'THIRA Steps 1-3'!$C$101\")","v":0},null,null,null,null,null,null,null,null,null,null,null,null,null,null,"# NIMS Started",{"$f":"SUM(K:K)","v":0}]
[null,null,null,null,null,null,null,null,null,null,null,null,null,null,null,null,null,null,"# NIMS Complete",{"$f":"SUM(L:L)","v":0}]
[null,null,null,"Resource Requirements",null,null,null,null,null,null,null,null,null,null,null,null,null,null,"# Other Rows",{"$f":"MAX(M:M)","v":4}]
[null,null,null,"NIMS-typed Resources","Category","Resource","Type","Number Required",null,null,null,null,null,null,null,null,null,null,"# Other Rows",{"$f":"SUM(N:N)","v":0}]
[{"$f":"LOOKUP(E8, Lists!A$236:A$245, Lists!B$236:B$245)","v":{"$error":"#N/A"}},null,{"$f":"VLOOKUP(F8, INDIRECT(\"Lists!$A$140:$B$\" & Lists!$C$245), 2, FALSE)","v":{"$error":"#N/A"}},null,null,null,null,null,null,1,{"$f":"IF(OR(E8<>\"\", F8<>\"\", G8<>\"\", H8<>\"\"), 1, 0)","v":0},{"$f":"IF(AND(E8<>\"\", F8<>\"\", G8<>\"\", H8<>\"\"), 1, 0)","v":0},null,null,null,null,null,null,"# Other",{"$f":"SUM(O:O)","v":0}]
[{"$f":"LOOKUP(E9, Lists!A$236:A$245, Lists!B$236:B$245)","v":{"$error":"#N/A"}},null,{"$f":"VLOOKUP(F9, INDIRECT(\"Lists!$A$140:$B$\" & Lists!$C$245), 2, FALSE)","v":{"$error":"#N/A"}},null,null,null,null,null,null,{"$f":"J8+1","v":2},{"$f":"IF(OR(E9<>\"\", F9<>\"\", G9<>\"\", H9<>\"\"), 1, 0)","v":0},{"$f":"IF(AND(E9<>\"\", F9<>\"\", G9<>\"\", H9<>\"\"), 1, 0)","v":0}]
[{"$f":"LOOKUP(E10, Lists!A$236:A$245, Lists!B$236:B$245)","v":{"$error":"#N/A"}},null,{"$f":"VLOOKUP(F10, INDIRECT(\"Lists!$A$140:$B$\" & Lists!$C$245), 2, FALSE)","v":{"$error":"#N/A"}},null,null,null,null,null,null,{"$f":"J9+1","v":3},{"$f":"IF(OR(E10<>\"\", F10<>\"\", G10<>\"\", H10<>\"\"), 1, 0)","v":0},{"$f":"IF(AND(E10<>\"\", F10<>\"\", G10<>\"\", H10<>\"\"), 1, 0)","v":0}]
[{"$f":"LOOKUP(E11, Lists!A$236:A$245, Lists!B$236:B$245)","v":{"$error":"#N/A"}},null,{"$f":"VLOOKUP(F11, INDIRECT(\"Lists!$A$140:$B$\" & Lists!$C$245), 2, FALSE)","v":{"$error":"#N/A"}},null,null,null,null,null,null,{"$f":"J10+1","v":4},{"$f":"IF(OR(E11<>\"\", F11<>\"\", G11<>\"\", H11<>\"\"), 1, 0)","v":0},{"$f":"IF(AND(E11<>\"\", F11<>\"\", G11<>\"\", H11<>\"\"), 1, 0)","v":0}]
[{"$f":"LOOKUP(E12, Lists!A$236:A$245, Lists!B$236:B$245)","v":{"$error":"#N/A"}},null,{"$f":"VLOOKUP(F12, INDIRECT(\"Lists!$A$140:$B$\" & Lists!$C$245), 2, FALSE)","v":{"$error":"#N/A"}},null,null,null,null,null,null,{"$f":"J11+1","v":5},{"$f":"IF(OR(E12<>\"\", F12<>\"\", G12<>\"\", H12<>\"\"), 1, 0)","v":0},{"$f":"IF(AND(E12<>\"\", F12<>\"\", G12<>\"\", H12<>\"\"), 1, 0)","v":0}]
[{"$f":"LOOKUP(E13, Lists!A$236:A$245, Lists!B$236:B$245)","v":{"$error":"#N/A"}},null,{"$f":"VLOOKUP(F13, INDIRECT(\"Lists!$A$140:$B$\" & Lists!$C$245), 2, FALSE)","v":{"$error":"#N/A"}},null,null,null,null,null,null,6,0,0]
[null,null,null,"Other\nResources","Resource\n(Example:  Case Management Team)",null,"Team/POETE\n","Number Required\n"]
[null,null,null,null,null,null,null,null,null,null,null,null,1,{"$f":"IF(OR(E15<>\"\", H15<>\"\"), 1, 0)","v":0},{"$f":"IF(AND(E15<>\"\", H15<>\"\"), 1, 0)","v":0}]
[null,null,null,null,null,null,null,null,null,null,null,null,{"$f":"M15+1","v":2},{"$f":"IF(OR(E16<>\"\", H16<>\"\"), 1, 0)","v":0},{"$f":"IF(AND(E16<>\"\", H16<>\"\"), 1, 0)","v":0}]
[null,null,null,null,null,null,null,null,null,null,null,null,{"$f":"M16+1","v":3},{"$f":"IF(OR(E17<>\"\", H17<>\"\"), 1, 0)","v":0},{"$f":"IF(AND(E17<>\"\", H17<>\"\"), 1, 0)","v":0}]
[null,null,null,null,null,null,null,null,null,null,null,null,{"$f":"M17+1","v":4},{"$f":"IF(OR(E18<>\"\", H18<>\"\"), 1, 0)","v":0},{"$f":"IF(AND(E18<>\"\", H18<>\"\"), 1, 0)","v":0}]

{"sheet":"SPR #23 Security Protection","index":50,"n_rows":41,"n_cols":19,"rows_kept":41,"cut":false,"hidden":true,"merged":[[2,3,2,7],[3,3,3,7],[5,3,5,7],[7,3,7,7],[12,3,14,3],[14,4,14,7],[8,4,8,7],[9,4,9,7],[10,4,10,7],[30,3,30,7],[31,3,31,7],[33,3,33,7],[40,3,40,7],[16,3,17,3],[19,3,20,3],[22,3,24,3],[24,4,24,7],[26,3,28,3],[28,4,28,7]]}
[21]
[]
[{"$f":"MAX(B:B)","v":1},null,null,"Capability Target"]
[null,{"$f":"ROW()-3","v":1},null,{"$f":"INDIRECT(\"'THIRA Steps 1-3'!$C$101\")","v":0}]
[]
[null,null,null,"Capability Assessment"]
[]
[null,null,null,"Priority"]
[null,null,null,null,"Relative to the other core capabilities, efforts to build and/or sustain this core capability are of high importance to my jurisdiction’s preparedness activities.",null,null,null,null,null,null,null,null,null,null,0]
[null,null,null,null,"Relative to the other core capabilities, efforts to build and/or sustain this core capability are of medium importance to my jurisdiction’s preparedness activities."]
[null,null,null,null,"Relative to the other core capabilities, efforts to build and/or sustain this core capability are of low importance to my jurisdiction’s preparedness activities."]
[]
[null,null,null,"Planning","Rating\nInternal Capability","Rating\nInternal Capability + Mutual Aid","Gap Description","Recent Advances (optional)"]
[null,null,null,null,{"$f":"LOOKUP(P14, Lists!$C$2:$C$8, Lists!D2:D8)","v":"No selection made"},{"$f":"LOOKUP(Q14, Lists!$C$2:$C$8, Lists!D2:D8)","v":"No selection made"},null,null,null,null,null,null,null,null,null,1,1,{"$f":"COUNTIF(I15:AC15, \"TRUE\")","v":0},0]
[null,null,null,null,"Gap Description\nWhich of the following best represent your community's primary planning gaps?",null,null,null,false,false,false,false,false,false,false,false,false]
[]
[null,null,null,"Organization","Rating\nInternal Capability","Rating\nInternal Capability + Mutual Aid","Gap Description","Recent Advances (optional)"]
[null,null,null,null,{"$f":"LOOKUP(P18, Lists!$C$2:$C$8, Lists!E2:E8)","v":"No selection made"},{"$f":"LOOKUP(Q18, Lists!$C$2:$C$8, Lists!E2:E8)","v":"No selection made"},null,null,null,null,null,null,null,null,null,1,1,0]
[]
[null,null,null,"Equipment","Rating\nInternal Capability","Rating\nInternal Capability + Mutual Aid","Gap Description","Recent Advances (optional)"]
[null,null,null,null,{"$f":"LOOKUP(P21, Lists!$C$2:$C$8, Lists!F2:F8)","v":"No selection made"},{"$f":"LOOKUP(Q21, Lists!$C$2:$C$8, Lists!F2:F8)","v":"No selection made"},null,null,null,null,null,null,null,null,null,1,1,0]
[]
[null,null,null,"Training","Rating\nInternal Capability","Rating\nInternal Capability + Mutual Aid","Gap Description","Recent Advances (optional)"]
[null,null,null,null,{"$f":"LOOKUP(P24, Lists!$C$2:$C$8, Lists!G2:G8)","v":"No selection made"},{"$f":"LOOKUP(Q24, Lists!$C$2:$C$8, Lists!G2:G8)","v":"No selection made"},null,null,null,null,null,null,null,null,null,1,1,{"$f":"COUNTIF(I25:S25, \"TRUE\")","v":0},0]
[null,null,null,null,"Gap Description\nWhich of the following best represent your community's primary training gaps?",null,null,null,false,false,false,false,false,false,false,false,false,false,false]
[]
[null,null,null,"Exercises","Rating\nInternal Capability","Rating\nInternal Capability + Mutual Aid","Gap Description","Recent Advances (optional)"]
[null,null,null,null,{"$f":"LOOKUP(P28, Lists!$C$2:$C$8, Lists!H2:H8)","v":"No selection made"},{"$f":"LOOKUP(Q28, Lists!$C$2:$C$8, Lists!H2:H8)","v":"No selection made"},null,null,null,null,null,null,null,null,null,1,1,{"$f":"COUNTIF(I29:AA29, \"TRUE\")","v":0},0]
[null,null,null,null,"Gap Description\nWhich of the following best represent your community's primary exercises gaps?",null,null,null,false,false,false,false,false,false,false,false]
[]
[null,null,null,"Assessment Corroboration"]
[null,null,null,null,null,null,null,null,{"$f":"IF(J32=2,TRUE,IF(J32=3,FALSE,\"\"))","v":""},1]
[]
[null,null,null,"Responsibility for Filling Gap",null,null,null,null,null,null,null,null,null,null,null,0]
[]
[]
[]
[]
[]
[]
[null,null,null,"Journal Notes/Process Narrative (optional)"]

{"sheet":"THIRA #24 Op Comms","index":51,"n_rows":23,"n_cols":20,"rows_kept":23,"cut":false,"hidden":false,"merged":[[22,4,22,5],[2,3,2,7],[3,3,3,7],[3,13,3,14],[5,3,5,7],[6,3,17,3],[18,3,22,3],[18,4,18,5],[19,4,19,5],[20,4,20,5],[21,4,21,5]]}
[21]
[]
[{"$f":"MAX(B:B)","v":1},null,null,"Capability Target",null,null,null,null,null,null,null,null,null,null,null,null,null,null,"# NIMS Rows",{"$f":"MAX(J:J)","v":11}]
[null,{"$f":"ROW()-3","v":1},null,{"$f":"INDIRECT(\"'THIRA Steps 1-3'!$C$105\")","v":0},null,null,null,null,null,null,null,null,null,null,null,null,null,null,"# NIMS Started",{"$f":"SUM(K:K)","v":0}]
[null,null,null,null,null,null,null,null,null,null,null,null,null,null,null,null,null,null,"# NIMS Complete",{"$f":"SUM(L:L)","v":0}]
[null,null,null,"Resource Requirements",null,null,null,null,null,null,null,null,null,null,null,null,null,null,"# Other Rows",{"$f":"MAX(M:M)","v":4}]
[null,null,null,"NIMS-typed Resources","Category","Resource","Type","Number Required",null,null,null,null,null,null,null,null,null,null,"# Other Rows",{"$f":"SUM(N:N)","v":0}]
[{"$f":"LOOKUP(E8, Lists!A$236:A$245, Lists!B$236:B$245)","v":{"$error":"#N/A"}},null,{"$f":"VLOOKUP(F8, INDIRECT(\"Lists!$A$140:$B$\" & Lists!$C$245), 2, FALSE)","v":{"$error":"#N/A"}},null,null,null,null,null,null,1,{"$f":"IF(OR(E8<>\"\", F8<>\"\", G8<>\"\", H8<>\"\"), 1, 0)","v":0},{"$f":"IF(AND(E8<>\"\", F8<>\"\", G8<>\"\", H8<>\"\"), 1, 0)","v":0},null,null,null,null,null,null,"# Other",{"$f":"SUM(O:O)","v":0}]
[{"$f":"LOOKUP(E9, Lists!A$236:A$245, Lists!B$236:B$245)","v":{"$error":"#N/A"}},null,{"$f":"VLOOKUP(F9, INDIRECT(\"Lists!$A$140:$B$\" & Lists!$C$245), 2, FALSE)","v":{"$error":"#N/A"}},null,null,null,null,null,null,{"$f":"J8+1","v":2},{"$f":"IF(OR(E9<>\"\", F9<>\"\", G9<>\"\", H9<>\"\"), 1, 0)","v":0},{"$f":"IF(AND(E9<>\"\", F9<>\"\", G9<>\"\", H9<>\"\"), 1, 0)","v":0}]
[{"$f":"LOOKUP(E10, Lists!A$236:A$245, Lists!B$236:B$245)","v":{"$error":"#N/A"}},null,{"$f":"VLOOKUP(F10, INDIRECT(\"Lists!$A$140:$B$\" & Lists!$C$245), 2, FALSE)","v":{"$error":"#N/A"}},null,null,null,null,null,null,{"$f":"J9+1","v":3},{"$f":"IF(OR(E10<>\"\", F10<>\"\", G10<>\"\", H10<>\"\"), 1, 0)","v":0},{"$f":"IF(AND(E10<>\"\", F10<>\"\", G10<>\"\", H10<>\"\"), 1, 0)","v":0}]
[{"$f":"LOOKUP(E11, Lists!A$236:A$245, Lists!B$236:B$245)","v":{"$error":"#N/A"}},null,{"$f":"VLOOKUP(F11, INDIRECT(\"Lists!$A$140:$B$\" & Lists!$C$245), 2, FALSE)","v":{"$error":"#N/A"}},null,null,null,null,null,null,{"$f":"J10+1","v":4},{"$f":"IF(OR(E11<>\"\", F11<>\"\", G11<>\"\", H11<>\"\"), 1, 0)","v":0},{"$f":"IF(AND(E11<>\"\", F11<>\"\", G11<>\"\", H11<>\"\"), 1, 0)","v":0}]
[{"$f":"LOOKUP(E12, Lists!A$236:A$245, Lists!B$236:B$245)","v":{"$error":"#N/A"}},null,{"$f":"VLOOKUP(F12, INDIRECT(\"Lists!$A$140:$B$\" & Lists!$C$245), 2, FALSE)","v":{"$error":"#N/A"}},null,null,null,null,null,null,{"$f":"J11+1","v":5},{"$f":"IF(OR(E12<>\"\", F12<>\"\", G12<>\"\", H12<>\"\"), 1, 0)","v":0},{"$f":"IF(AND(E12<>\"\", F12<>\"\", G12<>\"\", H12<>\"\"), 1, 0)","v":0}]
[{"$f":"LOOKUP(E13, Lists!A$236:A$245, Lists!B$236:B$245)","v":{"$error":"#N/A"}},null,{"$f":"VLOOKUP(F13, INDIRECT(\"Lists!$A$140:$B$\" & Lists!$C$245), 2, FALSE)","v":{"$error":"#N/A"}},null,null,null,null,null,null,{"$f":"J12+1","v":6},{"$f":"IF(OR(E13<>\"\", F13<>\"\", G13<>\"\", H13<>\"\"), 1, 0)","v":0},{"$f":"IF(AND(E13<>\"\", F13<>\"\", G13<>\"\", H13<>\"\"), 1, 0)","v":0}]
[{"$f":"LOOKUP(E14, Lists!A$236:A$245, Lists!B$236:B$245)","v":{"$error":"#N/A"}},null,{"$f":"VLOOKUP(F14, INDIRECT(\"Lists!$A$140:$B$\" & Lists!$C$245), 2, FALSE)","v":{"$error":"#N/A"}},null,null,null,null,null,null,{"$f":"J13+1","v":7},{"$f":"IF(OR(E14<>\"\", F14<>\"\", G14<>\"\", H14<>\"\"), 1, 0)","v":0},{"$f":"IF(AND(E14<>\"\", F14<>\"\", G14<>\"\", H14<>\"\"), 1, 0)","v":0}]
[{"$f":"LOOKUP(E15, Lists!A$236:A$245, Lists!B$236:B$245)","v":{"$error":"#N/A"}},null,{"$f":"VLOOKUP(F15, INDIRECT(\"Lists!$A$140:$B$\" & Lists!$C$245), 2, FALSE)","v":{"$error":"#N/A"}},null,null,null,null,null,null,{"$f":"J14+1","v":8},{"$f":"IF(OR(E15<>\"\", F15<>\"\", G15<>\"\", H15<>\"\"), 1, 0)","v":0},{"$f":"IF(AND(E15<>\"\", F15<>\"\", G15<>\"\", H15<>\"\"), 1, 0)","v":0}]
[{"$f":"LOOKUP(E16, Lists!A$236:A$245, Lists!B$236:B$245)","v":{"$error":"#N/A"}},null,{"$f":"VLOOKUP(F16, INDIRECT(\"Lists!$A$140:$B$\" & Lists!$C$245), 2, FALSE)","v":{"$error":"#N/A"}},null,null,null,null,null,null,{"$f":"J15+1","v":9},{"$f":"IF(OR(E16<>\"\", F16<>\"\", G16<>\"\", H16<>\"\"), 1, 0)","v":0},{"$f":"IF(AND(E16<>\"\", F16<>\"\", G16<>\"\", H16<>\"\"), 1, 0)","v":0}]
[{"$f":"LOOKUP(E17, Lists!A$236:A$245, Lists!B$236:B$245)","v":{"$error":"#N/A"}},null,{"$f":"VLOOKUP(F17, INDIRECT(\"Lists!$A$140:$B$\" & Lists!$C$245), 2, FALSE)","v":{"$error":"#N/A"}},null,null,null,null,null,null,{"$f":"J16+1","v":10},{"$f":"IF(OR(E17<>\"\", F17<>\"\", G17<>\"\", H17<>\"\"), 1, 0)","v":0},{"$f":"IF(AND(E17<>\"\", F17<>\"\", G17<>\"\", H17<>\"\"), 1, 0)","v":0}]
[{"$f":"LOOKUP(E18, Lists!A$236:A$245, Lists!B$236:B$245)","v":{"$error":"#N/A"}},null,{"$f":"VLOOKUP(F18, INDIRECT(\"Lists!$A$140:$B$\" & Lists!$C$245), 2, FALSE)","v":{"$error":"#N/A"}},null,null,null,null,null,null,11,0,0]
[null,null,null,"Other\nResources","Resource\n(Example:  Case Management Team)",null,"Team/POETE\n","Number Required\n"]
[null,null,null,null,null,null,null,null,null,null,null,null,1,{"$f":"IF(OR(E20<>\"\", H20<>\"\"), 1, 0)","v":0},{"$f":"IF(AND(E20<>\"\", H20<>\"\"), 1, 0)","v":0}]
[null,null,null,null,null,null,null,null,null,null,null,null,{"$f":"M20+1","v":2},{"$f":"IF(OR(E21<>\"\", H21<>\"\"), 1, 0)","v":0},{"$f":"IF(AND(E21<>\"\", H21<>\"\"), 1, 0)","v":0}]
[null,null,null,null,null,null,null,null,null,null,null,null,{"$f":"M21+1","v":3},{"$f":"IF(OR(E22<>\"\", H22<>\"\"), 1, 0)","v":0},{"$f":"IF(AND(E22<>\"\", H22<>\"\"), 1, 0)","v":0}]
[null,null,null,null,null,null,null,null,null,null,null,null,{"$f":"M22+1","v":4},{"$f":"IF(OR(E23<>\"\", H23<>\"\"), 1, 0)","v":0},{"$f":"IF(AND(E23<>\"\", H23<>\"\"), 1, 0)","v":0}]

{"sheet":"SPR #24 Op Comms","index":52,"n_rows":41,"n_cols":19,"rows_kept":41,"cut":false,"hidden":true,"merged":[[2,3,2,7],[3,3,3,7],[5,3,5,7],[7,3,7,7],[12,3,14,3],[14,4,14,7],[8,4,8,7],[9,4,9,7],[10,4,10,7],[30,3,30,7],[31,3,31,7],[33,3,33,7],[40,3,40,7],[16,3,17,3],[19,3,20,3],[22,3,24,3],[24,4,24,7],[26,3,28,3],[28,4,28,7]]}
[21]
[]
[{"$f":"MAX(B:B)","v":1},null,null,"Capability Target"]
[null,{"$f":"ROW()-3","v":1},null,{"$f":"INDIRECT(\"'THIRA Steps 1-3'!$C$105\")","v":0}]
[]
[null,null,null,"Capability Assessment"]
[]
[null,null,null,"Priority"]
[null,null,null,null,"Relative to the other core capabilities, efforts to build and/or sustain this core capability are of high importance to my jurisdiction’s preparedness activities.",null,null,null,null,null,null,null,null,null,null,0]
[null,null,null,null,"Relative to the other core capabilities, efforts to build and/or sustain this core capability are of medium importance to my jurisdiction’s preparedness activities."]
[null,null,null,null,"Relative to the other core capabilities, efforts to build and/or sustain this core capability are of low importance to my jurisdiction’s preparedness activities."]
[]
[null,null,null,"Planning","Rating\nInternal Capability","Rating\nInternal Capability + Mutual Aid","Gap Description","Recent Advances (optional)"]
[null,null,null,null,{"$f":"LOOKUP(P14, Lists!$C$2:$C$8, Lists!D2:D8)","v":"No selection made"},{"$f":"LOOKUP(Q14, Lists!$C$2:$C$8, Lists!D2:D8)","v":"No selection made"},null,null,null,null,null,null,null,null,null,1,1,{"$f":"COUNTIF(I15:AC15, \"TRUE\")","v":0},0]
[null,null,null,null,"Gap Description\nWhich of the following best represent your community's primary planning gaps?",null,null,null,false,false,false,false,false,false,false,false,false]
[]
[null,null,null,"Organization","Rating\nInternal Capability","Rating\nInternal Capability + Mutual Aid","Gap Description","Recent Advances (optional)"]
[null,null,null,null,{"$f":"LOOKUP(P18, Lists!$C$2:$C$8, Lists!E2:E8)","v":"No selection made"},{"$f":"LOOKUP(Q18, Lists!$C$2:$C$8, Lists!E2:E8)","v":"No selection made"},null,null,null,null,null,null,null,null,null,1,1,0]
[]
[null,null,null,"Equipment","Rating\nInternal Capability","Rating\nInternal Capability + Mutual Aid","Gap Description","Recent Advances (optional)"]
[null,null,null,null,{"$f":"LOOKUP(P21, Lists!$C$2:$C$8, Lists!F2:F8)","v":"No selection made"},{"$f":"LOOKUP(Q21, Lists!$C$2:$C$8, Lists!F2:F8)","v":"No selection made"},null,null,null,null,null,null,null,null,null,1,1,0]
[]
[null,null,null,"Training","Rating\nInternal Capability","Rating\nInternal Capability + Mutual Aid","Gap Description","Recent Advances (optional)"]
[null,null,null,null,{"$f":"LOOKUP(P24, Lists!$C$2:$C$8, Lists!G2:G8)","v":"No selection made"},{"$f":"LOOKUP(Q24, Lists!$C$2:$C$8, Lists!G2:G8)","v":"No selection made"},null,null,null,null,null,null,null,null,null,1,1,{"$f":"COUNTIF(I25:S25, \"TRUE\")","v":0},0]
[null,null,null,null,"Gap Description\nWhich of the following best represent your community's primary training gaps?",null,null,null,false,false,false,false,false,false,false,false,false,false,false]
[]
[null,null,null,"Exercises","Rating\nInternal Capability","Rating\nInternal Capability + Mutual Aid","Gap Description","Recent Advances (optional)"]
[null,null,null,null,{"$f":"LOOKUP(P28, Lists!$C$2:$C$8, Lists!H2:H8)","v":"No selection made"},{"$f":"LOOKUP(Q28, Lists!$C$2:$C$8, Lists!H2:H8)","v":"No selection made"},null,null,null,null,null,null,null,null,null,1,1,{"$f":"COUNTIF(I29:AA29, \"TRUE\")","v":0},0]
[null,null,null,null,"Gap Description\nWhich of the following best represent your community's primary exercises gaps?",null,null,null,false,false,false,false,false,false,false,false]
[]
[null,null,null,"Assessment Corroboration"]
[null,null,null,null,null,null,null,null,{"$f":"IF(J32=2,TRUE,IF(J32=3,FALSE,\"\"))","v":""},1]
[]
[null,null,null,"Responsibility for Filling Gap",null,null,null,null,null,null,null,null,null,null,null,0]
[]
[]
[]
[]
[]
[]
[null,null,null,"Journal Notes/Process Narrative (optional)"]

{"sheet":"THIRA #25 Pub Private Services","index":53,"n_rows":25,"n_cols":20,"rows_kept":25,"cut":false,"hidden":false,"merged":[[24,4,24,5],[2,3,2,7],[3,3,3,7],[3,13,3,14],[5,3,5,7],[6,3,16,3],[17,3,24,3],[17,4,17,5],[18,4,18,5],[19,4,19,5],[23,4,23,5],[20,4,20,5],[21,4,21,5],[22,4,22,5]]}
[21]
[]
[{"$f":"MAX(B:B)","v":1},null,null,"Capability Target",null,null,null,null,null,null,null,null,null,null,null,null,null,null,"# NIMS Rows",{"$f":"MAX(J:J)","v":10}]
[null,{"$f":"ROW()-3","v":1},null,{"$f":"INDIRECT(\"'THIRA Steps 1-3'!$C$109\")","v":0},null,null,null,null,null,null,null,null,null,null,null,null,null,null,"# NIMS Started",{"$f":"SUM(K:K)","v":0}]
[null,null,null,null,null,null,null,null,null,null,null,null,null,null,null,null,null,null,"# NIMS Complete",{"$f":"SUM(L:L)","v":0}]
[null,null,null,"Resource Requirements",null,null,null,null,null,null,null,null,null,null,null,null,null,null,"# Other Rows",{"$f":"MAX(M:M)","v":7}]
[null,null,null,"NIMS-typed Resources","Category","Resource","Type","Number Required",null,null,null,null,null,null,null,null,null,null,"# Other Rows",{"$f":"SUM(N:N)","v":0}]
[{"$f":"LOOKUP(E8, Lists!A$236:A$245, Lists!B$236:B$245)","v":{"$error":"#N/A"}},null,{"$f":"VLOOKUP(F8, INDIRECT(\"Lists!$A$140:$B$\" & Lists!$C$245), 2, FALSE)","v":{"$error":"#N/A"}},null,null,null,null,null,null,1,{"$f":"IF(OR(E8<>\"\", F8<>\"\", G8<>\"\", H8<>\"\"), 1, 0)","v":0},{"$f":"IF(AND(E8<>\"\", F8<>\"\", G8<>\"\", H8<>\"\"), 1, 0)","v":0},null,null,null,null,null,null,"# Other",{"$f":"SUM(O:O)","v":0}]
[{"$f":"LOOKUP(E9, Lists!A$236:A$245, Lists!B$236:B$245)","v":{"$error":"#N/A"}},null,{"$f":"VLOOKUP(F9, INDIRECT(\"Lists!$A$140:$B$\" & Lists!$C$245), 2, FALSE)","v":{"$error":"#N/A"}},null,null,null,null,null,null,{"$f":"J8+1","v":2},{"$f":"IF(OR(E9<>\"\", F9<>\"\", G9<>\"\", H9<>\"\"), 1, 0)","v":0},{"$f":"IF(AND(E9<>\"\", F9<>\"\", G9<>\"\", H9<>\"\"), 1, 0)","v":0}]
[{"$f":"LOOKUP(E10, Lists!A$236:A$245, Lists!B$236:B$245)","v":{"$error":"#N/A"}},null,{"$f":"VLOOKUP(F10, INDIRECT(\"Lists!$A$140:$B$\" & Lists!$C$245), 2, FALSE)","v":{"$error":"#N/A"}},null,null,null,null,null,null,{"$f":"J9+1","v":3},{"$f":"IF(OR(E10<>\"\", F10<>\"\", G10<>\"\", H10<>\"\"), 1, 0)","v":0},{"$f":"IF(AND(E10<>\"\", F10<>\"\", G10<>\"\", H10<>\"\"), 1, 0)","v":0}]
[{"$f":"LOOKUP(E11, Lists!A$236:A$245, Lists!B$236:B$245)","v":{"$error":"#N/A"}},null,{"$f":"VLOOKUP(F11, INDIRECT(\"Lists!$A$140:$B$\" & Lists!$C$245), 2, FALSE)","v":{"$error":"#N/A"}},null,null,null,null,null,null,{"$f":"J10+1","v":4},{"$f":"IF(OR(E11<>\"\", F11<>\"\", G11<>\"\", H11<>\"\"), 1, 0)","v":0},{"$f":"IF(AND(E11<>\"\", F11<>\"\", G11<>\"\", H11<>\"\"), 1, 0)","v":0}]
[{"$f":"LOOKUP(E12, Lists!A$236:A$245, Lists!B$236:B$245)","v":{"$error":"#N/A"}},null,{"$f":"VLOOKUP(F12, INDIRECT(\"Lists!$A$140:$B$\" & Lists!$C$245), 2, FALSE)","v":{"$error":"#N/A"}},null,null,null,null,null,null,{"$f":"J11+1","v":5},{"$f":"IF(OR(E12<>\"\", F12<>\"\", G12<>\"\", H12<>\"\"), 1, 0)","v":0},{"$f":"IF(AND(E12<>\"\", F12<>\"\", G12<>\"\", H12<>\"\"), 1, 0)","v":0}]
[{"$f":"LOOKUP(E13, Lists!A$236:A$245, Lists!B$236:B$245)","v":{"$error":"#N/A"}},null,{"$f":"VLOOKUP(F13, INDIRECT(\"Lists!$A$140:$B$\" & Lists!$C$245), 2, FALSE)","v":{"$error":"#N/A"}},null,null,null,null,null,null,{"$f":"J12+1","v":6},{"$f":"IF(OR(E13<>\"\", F13<>\"\", G13<>\"\", H13<>\"\"), 1, 0)","v":0},{"$f":"IF(AND(E13<>\"\", F13<>\"\", G13<>\"\", H13<>\"\"), 1, 0)","v":0}]
[{"$f":"LOOKUP(E14, Lists!A$236:A$245, Lists!B$236:B$245)","v":{"$error":"#N/A"}},null,{"$f":"VLOOKUP(F14, INDIRECT(\"Lists!$A$140:$B$\" & Lists!$C$245), 2, FALSE)","v":{"$error":"#N/A"}},null,null,null,null,null,null,{"$f":"J13+1","v":7},{"$f":"IF(OR(E14<>\"\", F14<>\"\", G14<>\"\", H14<>\"\"), 1, 0)","v":0},{"$f":"IF(AND(E14<>\"\", F14<>\"\", G14<>\"\", H14<>\"\"), 1, 0)","v":0}]
[{"$f":"LOOKUP(E15, Lists!A$236:A$245, Lists!B$236:B$245)","v":{"$error":"#N/A"}},null,{"$f":"VLOOKUP(F15, INDIRECT(\"Lists!$A$140:$B$\" & Lists!$C$245), 2, FALSE)","v":{"$error":"#N/A"}},null,null,null,null,null,null,{"$f":"J14+1","v":8},{"$f":"IF(OR(E15<>\"\", F15<>\"\", G15<>\"\", H15<>\"\"), 1, 0)","v":0},{"$f":"IF(AND(E15<>\"\", F15<>\"\", G15<>\"\", H15<>\"\"), 1, 0)","v":0}]
[{"$f":"LOOKUP(E16, Lists!A$236:A$245, Lists!B$236:B$245)","v":{"$error":"#N/A"}},null,{"$f":"VLOOKUP(F16, INDIRECT(\"Lists!$A$140:$B$\" & Lists!$C$245), 2, FALSE)","v":{"$error":"#N/A"}},null,null,null,null,null,null,9,{"$f":"IF(OR(E16<>\"\", F16<>\"\", G16<>\"\", H16<>\"\"), 1, 0)","v":0},{"$f":"IF(AND(E16<>\"\", F16<>\"\", G16<>\"\", H16<>\"\"), 1, 0)","v":0}]
[{"$f":"LOOKUP(E17, Lists!A$236:A$245, Lists!B$236:B$245)","v":{"$error":"#N/A"}},null,{"$f":"VLOOKUP(F17, INDIRECT(\"Lists!$A$140:$B$\" & Lists!$C$245), 2, FALSE)","v":{"$error":"#N/A"}},null,null,null,null,null,null,10,0,0]
[null,null,null,"Other\nResources","Resource\n(Example:  Case Management Team)",null,"Team/POETE\n","Number Required\n"]
[null,null,null,null,null,null,null,null,null,null,null,null,1,{"$f":"IF(OR(E19<>\"\", H19<>\"\"), 1, 0)","v":0},{"$f":"IF(AND(E19<>\"\", H19<>\"\"), 1, 0)","v":0}]
[null,null,null,null,null,null,null,null,null,null,null,null,{"$f":"M19+1","v":2},{"$f":"IF(OR(E20<>\"\", H20<>\"\"), 1, 0)","v":0},{"$f":"IF(AND(E20<>\"\", H20<>\"\"), 1, 0)","v":0}]
[null,null,null,null,null,null,null,null,null,null,null,null,{"$f":"M20+1","v":3},{"$f":"IF(OR(E21<>\"\", H21<>\"\"), 1, 0)","v":0},{"$f":"IF(AND(E21<>\"\", H21<>\"\"), 1, 0)","v":0}]
[null,null,null,null,null,null,null,null,null,null,null,null,{"$f":"M21+1","v":4},{"$f":"IF(OR(E22<>\"\", H22<>\"\"), 1, 0)","v":0},{"$f":"IF(AND(E22<>\"\", H22<>\"\"), 1, 0)","v":0}]
[null,null,null,null,null,null,null,null,null,null,null,null,{"$f":"M22+1","v":5},{"$f":"IF(OR(E23<>\"\", H23<>\"\"), 1, 0)","v":0},{"$f":"IF(AND(E23<>\"\", H23<>\"\"), 1, 0)","v":0}]
[null,null,null,null,null,null,null,null,null,null,null,null,6,0,0]
[null,null,null,null,null,null,null,null,null,null,null,null,7,0,0]

{"sheet":"SPR #25 Pub Private Services","index":54,"n_rows":41,"n_cols":19,"rows_kept":41,"cut":false,"hidden":true,"merged":[[2,3,2,7],[3,3,3,7],[5,3,5,7],[7,3,7,7],[12,3,14,3],[14,4,14,7],[8,4,8,7],[9,4,9,7],[10,4,10,7],[30,3,30,7],[31,3,31,7],[33,3,33,7],[40,3,40,7],[16,3,17,3],[19,3,20,3],[22,3,24,3],[24,4,24,7],[26,3,28,3],[28,4,28,7]]}
[21]
[]
[{"$f":"MAX(B:B)","v":1},null,null,"Capability Target"]
[null,{"$f":"ROW()-3","v":1},null,{"$f":"INDIRECT(\"'THIRA Steps 1-3'!$C$109\")","v":0}]
[]
[null,null,null,"Capability Assessment"]
[]
[null,null,null,"Priority"]
[null,null,null,null,"Relative to the other core capabilities, efforts to build and/or sustain this core capability are of high importance to my jurisdiction’s preparedness activities.",null,null,null,null,null,null,null,null,null,null,0]
[null,null,null,null,"Relative to the other core capabilities, efforts to build and/or sustain this core capability are of medium importance to my jurisdiction’s preparedness activities."]
[null,null,null,null,"Relative to the other core capabilities, efforts to build and/or sustain this core capability are of low importance to my jurisdiction’s preparedness activities."]
[]
[null,null,null,"Planning","Rating\nInternal Capability","Rating\nInternal Capability + Mutual Aid","Gap Description","Recent Advances (optional)"]
[null,null,null,null,{"$f":"LOOKUP(P14, Lists!$C$2:$C$8, Lists!D2:D8)","v":"No selection made"},{"$f":"LOOKUP(Q14, Lists!$C$2:$C$8, Lists!D2:D8)","v":"No selection made"},null,null,null,null,null,null,null,null,null,1,1,{"$f":"COUNTIF(I15:AC15, \"TRUE\")","v":0},0]
[null,null,null,null,"Gap Description\nWhich of the following best represent your community's primary planning gaps?",null,null,null,false,false,false,false,false,false,false,false,false]
[]
[null,null,null,"Organization","Rating\nInternal Capability","Rating\nInternal Capability + Mutual Aid","Gap Description","Recent Advances (optional)"]
[null,null,null,null,{"$f":"LOOKUP(P18, Lists!$C$2:$C$8, Lists!E2:E8)","v":"No selection made"},{"$f":"LOOKUP(Q18, Lists!$C$2:$C$8, Lists!E2:E8)","v":"No selection made"},null,null,null,null,null,null,null,null,null,1,1,0]
[]
[null,null,null,"Equipment","Rating\nInternal Capability","Rating\nInternal Capability + Mutual Aid","Gap Description","Recent Advances (optional)"]
[null,null,null,null,{"$f":"LOOKUP(P21, Lists!$C$2:$C$8, Lists!F2:F8)","v":"No selection made"},{"$f":"LOOKUP(Q21, Lists!$C$2:$C$8, Lists!F2:F8)","v":"No selection made"},null,null,null,null,null,null,null,null,null,1,1,0]
[]
[null,null,null,"Training","Rating\nInternal Capability","Rating\nInternal Capability + Mutual Aid","Gap Description","Recent Advances (optional)"]
[null,null,null,null,{"$f":"LOOKUP(P24, Lists!$C$2:$C$8, Lists!G2:G8)","v":"No selection made"},{"$f":"LOOKUP(Q24, Lists!$C$2:$C$8, Lists!G2:G8)","v":"No selection made"},null,null,null,null,null,null,null,null,null,1,1,{"$f":"COUNTIF(I25:S25, \"TRUE\")","v":0},0]
[null,null,null,null,"Gap Description\nWhich of the following best represent your community's primary training gaps?",null,null,null,false,false,false,false,false,false,false,false,false,false,false]
[]
[null,null,null,"Exercises","Rating\nInternal Capability","Rating\nInternal Capability + Mutual Aid","Gap Description","Recent Advances (optional)"]
[null,null,null,null,{"$f":"LOOKUP(P28, Lists!$C$2:$C$8, Lists!H2:H8)","v":"No selection made"},{"$f":"LOOKUP(Q28, Lists!$C$2:$C$8, Lists!H2:H8)","v":"No selection made"},null,null,null,null,null,null,null,null,null,1,1,{"$f":"COUNTIF(I29:AA29, \"TRUE\")","v":0},0]
[null,null,null,null,"Gap Description\nWhich of the following best represent your community's primary exercises gaps?",null,null,null,false,false,false,false,false,false,false,false]
[]
[null,null,null,"Assessment Corroboration"]
[null,null,null,null,null,null,null,null,{"$f":"IF(J32=2,TRUE,IF(J32=3,FALSE,\"\"))","v":""},1]
[]
[null,null,null,"Responsibility for Filling Gap",null,null,null,null,null,null,null,null,null,null,null,0]
[]
[]
[]
[]
[]
[]
[null,null,null,"Journal Notes/Process Narrative (optional)"]

{"sheet":"THIRA #26 Public Health Medical","index":55,"n_rows":27,"n_cols":20,"rows_kept":27,"cut":false,"hidden":false,"merged":[[26,4,26,5],[2,3,2,7],[3,3,3,7],[3,13,3,14],[5,3,5,7],[6,3,21,3],[22,3,26,3],[22,4,22,5],[23,4,23,5],[24,4,24,5],[25,4,25,5]]}
[21]
[]
[{"$f":"MAX(B:B)","v":1},null,null,"Capability Target",null,null,null,null,null,null,null,null,null,null,null,null,null,null,"# NIMS Rows",{"$f":"MAX(J:J)","v":15}]
[null,{"$f":"ROW()-3","v":1},null,{"$f":"INDIRECT(\"'THIRA Steps 1-3'!$C$113\")","v":0},null,null,null,null,null,null,null,null,null,null,null,null,null,null,"# NIMS Started",{"$f":"SUM(K:K)","v":0}]
[null,null,null,null,null,null,null,null,null,null,null,null,null,null,null,null,null,null,"# NIMS Complete",{"$f":"SUM(L:L)","v":0}]
[null,null,null,"Resource Requirements",null,null,null,null,null,null,null,null,null,null,null,null,null,null,"# Other Rows",{"$f":"MAX(M:M)","v":4}]
[null,null,null,"NIMS-typed Resources","Category","Resource","Type","Number Required",null,null,null,null,null,null,null,null,null,null,"# Other Rows",{"$f":"SUM(N:N)","v":0}]
[{"$f":"LOOKUP(E8, Lists!A$236:A$245, Lists!B$236:B$245)","v":{"$error":"#N/A"}},null,{"$f":"VLOOKUP(F8, INDIRECT(\"Lists!$A$140:$B$\" & Lists!$C$245), 2, FALSE)","v":{"$error":"#N/A"}},null,null,null,null,null,null,1,{"$f":"IF(OR(E8<>\"\", F8<>\"\", G8<>\"\", H8<>\"\"), 1, 0)","v":0},{"$f":"IF(AND(E8<>\"\", F8<>\"\", G8<>\"\", H8<>\"\"), 1, 0)","v":0},null,null,null,null,null,null,"# Other",{"$f":"SUM(O:O)","v":0}]
[{"$f":"LOOKUP(E9, Lists!A$236:A$245, Lists!B$236:B$245)","v":{"$error":"#N/A"}},null,{"$f":"VLOOKUP(F9, INDIRECT(\"Lists!$A$140:$B$\" & Lists!$C$245), 2, FALSE)","v":{"$error":"#N/A"}},null,null,null,null,null,null,{"$f":"J8+1","v":2},{"$f":"IF(OR(E9<>\"\", F9<>\"\", G9<>\"\", H9<>\"\"), 1, 0)","v":0},{"$f":"IF(AND(E9<>\"\", F9<>\"\", G9<>\"\", H9<>\"\"), 1, 0)","v":0}]
[{"$f":"LOOKUP(E10, Lists!A$236:A$245, Lists!B$236:B$245)","v":{"$error":"#N/A"}},null,{"$f":"VLOOKUP(F10, INDIRECT(\"Lists!$A$140:$B$\" & Lists!$C$245), 2, FALSE)","v":{"$error":"#N/A"}},null,null,null,null,null,null,{"$f":"J9+1","v":3},{"$f":"IF(OR(E10<>\"\", F10<>\"\", G10<>\"\", H10<>\"\"), 1, 0)","v":0},{"$f":"IF(AND(E10<>\"\", F10<>\"\", G10<>\"\", H10<>\"\"), 1, 0)","v":0}]
[{"$f":"LOOKUP(E11, Lists!A$236:A$245, Lists!B$236:B$245)","v":{"$error":"#N/A"}},null,{"$f":"VLOOKUP(F11, INDIRECT(\"Lists!$A$140:$B$\" & Lists!$C$245), 2, FALSE)","v":{"$error":"#N/A"}},null,null,null,null,null,null,{"$f":"J10+1","v":4},{"$f":"IF(OR(E11<>\"\", F11<>\"\", G11<>\"\", H11<>\"\"), 1, 0)","v":0},{"$f":"IF(AND(E11<>\"\", F11<>\"\", G11<>\"\", H11<>\"\"), 1, 0)","v":0}]
[{"$f":"LOOKUP(E12, Lists!A$236:A$245, Lists!B$236:B$245)","v":{"$error":"#N/A"}},null,{"$f":"VLOOKUP(F12, INDIRECT(\"Lists!$A$140:$B$\" & Lists!$C$245), 2, FALSE)","v":{"$error":"#N/A"}},null,null,null,null,null,null,{"$f":"J11+1","v":5},{"$f":"IF(OR(E12<>\"\", F12<>\"\", G12<>\"\", H12<>\"\"), 1, 0)","v":0},{"$f":"IF(AND(E12<>\"\", F12<>\"\", G12<>\"\", H12<>\"\"), 1, 0)","v":0}]
[{"$f":"LOOKUP(E13, Lists!A$236:A$245, Lists!B$236:B$245)","v":{"$error":"#N/A"}},null,{"$f":"VLOOKUP(F13, INDIRECT(\"Lists!$A$140:$B$\" & Lists!$C$245), 2, FALSE)","v":{"$error":"#N/A"}},null,null,null,null,null,null,{"$f":"J12+1","v":6},{"$f":"IF(OR(E13<>\"\", F13<>\"\", G13<>\"\", H13<>\"\"), 1, 0)","v":0},{"$f":"IF(AND(E13<>\"\", F13<>\"\", G13<>\"\", H13<>\"\"), 1, 0)","v":0}]
[{"$f":"LOOKUP(E14, Lists!A$236:A$245, Lists!B$236:B$245)","v":{"$error":"#N/A"}},null,{"$f":"VLOOKUP(F14, INDIRECT(\"Lists!$A$140:$B$\" & Lists!$C$245), 2, FALSE)","v":{"$error":"#N/A"}},null,null,null,null,null,null,{"$f":"J13+1","v":7},{"$f":"IF(OR(E14<>\"\", F14<>\"\", G14<>\"\", H14<>\"\"), 1, 0)","v":0},{"$f":"IF(AND(E14<>\"\", F14<>\"\", G14<>\"\", H14<>\"\"), 1, 0)","v":0}]
[{"$f":"LOOKUP(E15, Lists!A$236:A$245, Lists!B$236:B$245)","v":{"$error":"#N/A"}},null,{"$f":"VLOOKUP(F15, INDIRECT(\"Lists!$A$140:$B$\" & Lists!$C$245), 2, FALSE)","v":{"$error":"#N/A"}},null,null,null,null,null,null,{"$f":"J14+1","v":8},{"$f":"IF(OR(E15<>\"\", F15<>\"\", G15<>\"\", H15<>\"\"), 1, 0)","v":0},{"$f":"IF(AND(E15<>\"\", F15<>\"\", G15<>\"\", H15<>\"\"), 1, 0)","v":0}]
[{"$f":"LOOKUP(E16, Lists!A$236:A$245, Lists!B$236:B$245)","v":{"$error":"#N/A"}},null,{"$f":"VLOOKUP(F16, INDIRECT(\"Lists!$A$140:$B$\" & Lists!$C$245), 2, FALSE)","v":{"$error":"#N/A"}},null,null,null,null,null,null,{"$f":"J15+1","v":9},{"$f":"IF(OR(E16<>\"\", F16<>\"\", G16<>\"\", H16<>\"\"), 1, 0)","v":0},{"$f":"IF(AND(E16<>\"\", F16<>\"\", G16<>\"\", H16<>\"\"), 1, 0)","v":0}]
[{"$f":"LOOKUP(E17, Lists!A$236:A$245, Lists!B$236:B$245)","v":{"$error":"#N/A"}},null,{"$f":"VLOOKUP(F17, INDIRECT(\"Lists!$A$140:$B$\" & Lists!$C$245), 2, FALSE)","v":{"$error":"#N/A"}},null,null,null,null,null,null,{"$f":"J16+1","v":10},{"$f":"IF(OR(E17<>\"\", F17<>\"\", G17<>\"\", H17<>\"\"), 1, 0)","v":0},{"$f":"IF(AND(E17<>\"\", F17<>\"\", G17<>\"\", H17<>\"\"), 1, 0)","v":0}]
[{"$f":"LOOKUP(E18, Lists!A$236:A$245, Lists!B$236:B$245)","v":{"$error":"#N/A"}},null,{"$f":"VLOOKUP(F18, INDIRECT(\"Lists!$A$140:$B$\" & Lists!$C$245), 2, FALSE)","v":{"$error":"#N/A"}},null,null,null,null,null,null,{"$f":"J17+1","v":11},{"$f":"IF(OR(E18<>\"\", F18<>\"\", G18<>\"\", H18<>\"\"), 1, 0)","v":0},{"$f":"IF(AND(E18<>\"\", F18<>\"\", G18<>\"\", H18<>\"\"), 1, 0)","v":0}]
[{"$f":"LOOKUP(E19, Lists!A$236:A$245, Lists!B$236:B$245)","v":{"$error":"#N/A"}},null,{"$f":"VLOOKUP(F19, INDIRECT(\"Lists!$A$140:$B$\" & Lists!$C$245), 2, FALSE)","v":{"$error":"#N/A"}},null,null,null,null,null,null,{"$f":"J18+1","v":12},{"$f":"IF(OR(E19<>\"\", F19<>\"\", G19<>\"\", H19<>\"\"), 1, 0)","v":0},{"$f":"IF(AND(E19<>\"\", F19<>\"\", G19<>\"\", H19<>\"\"), 1, 0)","v":0}]
[{"$f":"LOOKUP(E20, Lists!A$236:A$245, Lists!B$236:B$245)","v":{"$error":"#N/A"}},null,{"$f":"VLOOKUP(F20, INDIRECT(\"Lists!$A$140:$B$\" & Lists!$C$245), 2, FALSE)","v":{"$error":"#N/A"}},null,null,null,null,null,null,{"$f":"J19+1","v":13},{"$f":"IF(OR(E20<>\"\", F20<>\"\", G20<>\"\", H20<>\"\"), 1, 0)","v":0},{"$f":"IF(AND(E20<>\"\", F20<>\"\", G20<>\"\", H20<>\"\"), 1, 0)","v":0}]
[{"$f":"LOOKUP(E21, Lists!A$236:A$245, Lists!B$236:B$245)","v":{"$error":"#N/A"}},null,{"$f":"VLOOKUP(F21, INDIRECT(\"Lists!$A$140:$B$\" & Lists!$C$245), 2, FALSE)","v":{"$error":"#N/A"}},null,null,null,null,null,null,{"$f":"J20+1","v":14},{"$f":"IF(OR(E21<>\"\", F21<>\"\", G21<>\"\", H21<>\"\"), 1, 0)","v":0},{"$f":"IF(AND(E21<>\"\", F21<>\"\", G21<>\"\", H21<>\"\"), 1, 0)","v":0}]
[{"$f":"LOOKUP(E22, Lists!A$236:A$245, Lists!B$236:B$245)","v":{"$error":"#N/A"}},null,{"$f":"VLOOKUP(F22, INDIRECT(\"Lists!$A$140:$B$\" & Lists!$C$245), 2, FALSE)","v":{"$error":"#N/A"}},null,null,null,null,null,null,15,0,0]
[null,null,null,"Other\nResources","Resource\n(Example:  Case Management Team)",null,"Team/POETE\n","Number Required\n"]
[null,null,null,null,null,null,null,null,null,null,null,null,1,{"$f":"IF(OR(E24<>\"\", H24<>\"\"), 1, 0)","v":0},{"$f":"IF(AND(E24<>\"\", H24<>\"\"), 1, 0)","v":0}]
[null,null,null,null,null,null,null,null,null,null,null,null,{"$f":"M24+1","v":2},{"$f":"IF(OR(E25<>\"\", H25<>\"\"), 1, 0)","v":0},{"$f":"IF(AND(E25<>\"\", H25<>\"\"), 1, 0)","v":0}]
[null,null,null,null,null,null,null,null,null,null,null,null,{"$f":"M25+1","v":3},{"$f":"IF(OR(E26<>\"\", H26<>\"\"), 1, 0)","v":0},{"$f":"IF(AND(E26<>\"\", H26<>\"\"), 1, 0)","v":0}]
[null,null,null,null,null,null,null,null,null,null,null,null,{"$f":"M26+1","v":4},{"$f":"IF(OR(E27<>\"\", H27<>\"\"), 1, 0)","v":0},{"$f":"IF(AND(E27<>\"\", H27<>\"\"), 1, 0)","v":0}]

{"sheet":"SPR #26 Public Health Medical","index":56,"n_rows":41,"n_cols":19,"rows_kept":41,"cut":false,"hidden":true,"merged":[[2,3,2,7],[3,3,3,7],[5,3,5,7],[7,3,7,7],[12,3,14,3],[14,4,14,7],[8,4,8,7],[9,4,9,7],[10,4,10,7],[30,3,30,7],[31,3,31,7],[33,3,33,7],[40,3,40,7],[16,3,17,3],[19,3,20,3],[22,3,24,3],[24,4,24,7],[26,3,28,3],[28,4,28,7]]}
[21]
[]
[{"$f":"MAX(B:B)","v":1},null,null,"Capability Target"]
[null,{"$f":"ROW()-3","v":1},null,{"$f":"INDIRECT(\"'THIRA Steps 1-3'!$C$113\")","v":0}]
[]
[null,null,null,"Capability Assessment"]
[]
[null,null,null,"Priority"]
[null,null,null,null,"Relative to the other core capabilities, efforts to build and/or sustain this core capability are of high importance to my jurisdiction’s preparedness activities.",null,null,null,null,null,null,null,null,null,null,0]
[null,null,null,null,"Relative to the other core capabilities, efforts to build and/or sustain this core capability are of medium importance to my jurisdiction’s preparedness activities."]
[null,null,null,null,"Relative to the other core capabilities, efforts to build and/or sustain this core capability are of low importance to my jurisdiction’s preparedness activities."]
[]
[null,null,null,"Planning","Rating\nInternal Capability","Rating\nInternal Capability + Mutual Aid","Gap Description","Recent Advances (optional)"]
[null,null,null,null,{"$f":"LOOKUP(P14, Lists!$C$2:$C$8, Lists!D2:D8)","v":"No selection made"},{"$f":"LOOKUP(Q14, Lists!$C$2:$C$8, Lists!D2:D8)","v":"No selection made"},null,null,null,null,null,null,null,null,null,1,1,{"$f":"COUNTIF(I15:AC15, \"TRUE\")","v":0},0]
[null,null,null,null,"Gap Description\nWhich of the following best represent your community's primary planning gaps?",null,null,null,false,false,false,false,false,false,false,false,false]
[]
[null,null,null,"Organization","Rating\nInternal Capability","Rating\nInternal Capability + Mutual Aid","Gap Description","Recent Advances (optional)"]
[null,null,null,null,{"$f":"LOOKUP(P18, Lists!$C$2:$C$8, Lists!E2:E8)","v":"No selection made"},{"$f":"LOOKUP(Q18, Lists!$C$2:$C$8, Lists!E2:E8)","v":"No selection made"},null,null,null,null,null,null,null,null,null,1,1,0]
[]
[null,null,null,"Equipment","Rating\nInternal Capability","Rating\nInternal Capability + Mutual Aid","Gap Description","Recent Advances (optional)"]
[null,null,null,null,{"$f":"LOOKUP(P21, Lists!$C$2:$C$8, Lists!F2:F8)","v":"No selection made"},{"$f":"LOOKUP(Q21, Lists!$C$2:$C$8, Lists!F2:F8)","v":"No selection made"},null,null,null,null,null,null,null,null,null,1,1,0]
[]
[null,null,null,"Training","Rating\nInternal Capability","Rating\nInternal Capability + Mutual Aid","Gap Description","Recent Advances (optional)"]
[null,null,null,null,{"$f":"LOOKUP(P24, Lists!$C$2:$C$8, Lists!G2:G8)","v":"No selection made"},{"$f":"LOOKUP(Q24, Lists!$C$2:$C$8, Lists!G2:G8)","v":"No selection made"},null,null,null,null,null,null,null,null,null,1,1,{"$f":"COUNTIF(I25:S25, \"TRUE\")","v":0},0]
[null,null,null,null,"Gap Description\nWhich of the following best represent your community's primary training gaps?",null,null,null,false,false,false,false,false,false,false,false,false,false,false]
[]
[null,null,null,"Exercises","Rating\nInternal Capability","Rating\nInternal Capability + Mutual Aid","Gap Description","Recent Advances (optional)"]
[null,null,null,null,{"$f":"LOOKUP(P28, Lists!$C$2:$C$8, Lists!H2:H8)","v":"No selection made"},{"$f":"LOOKUP(Q28, Lists!$C$2:$C$8, Lists!H2:H8)","v":"No selection made"},null,null,null,null,null,null,null,null,null,1,1,{"$f":"COUNTIF(I29:AA29, \"TRUE\")","v":0},0]
[null,null,null,null,"Gap Description\nWhich of the following best represent your community's primary exercises gaps?",null,null,null,false,false,false,false,false,false,false,false]
[]
[null,null,null,"Assessment Corroboration"]
[null,null,null,null,null,null,null,null,{"$f":"IF(J32=2,TRUE,IF(J32=3,FALSE,\"\"))","v":""},1]
[]
[null,null,null,"Responsibility for Filling Gap",null,null,null,null,null,null,null,null,null,null,null,0]
[]
[]
[]
[]
[]
[]
[null,null,null,"Journal Notes/Process Narrative (optional)"]

{"sheet":"THIRA #27 Sit Assessment","index":57,"n_rows":19,"n_cols":20,"rows_kept":19,"cut":false,"hidden":false,"merged":[[18,4,18,5],[2,3,2,7],[3,3,3,7],[3,13,3,14],[5,3,5,7],[6,3,13,3],[14,3,18,3],[14,4,14,5],[15,4,15,5],[16,4,16,5],[17,4,17,5]]}
[21]
[]
[{"$f":"MAX(B:B)","v":1},null,null,"Capability Target",null,null,null,null,null,null,null,null,null,null,null,null,null,null,"# NIMS Rows",{"$f":"MAX(J:J)","v":7}]
[null,{"$f":"ROW()-3","v":1},null,{"$f":"INDIRECT(\"'THIRA Steps 1-3'!$C$117\")","v":0},null,null,null,null,null,null,null,null,null,null,null,null,null,null,"# NIMS Started",{"$f":"SUM(K:K)","v":0}]
[null,null,null,null,null,null,null,null,null,null,null,null,null,null,null,null,null,null,"# NIMS Complete",{"$f":"SUM(L:L)","v":0}]
[null,null,null,"Resource Requirements",null,null,null,null,null,null,null,null,null,null,null,null,null,null,"# Other Rows",{"$f":"MAX(M:M)","v":4}]
[null,null,null,"NIMS-typed Resources","Category","Resource","Type","Number Required",null,null,null,null,null,null,null,null,null,null,"# Other Rows",{"$f":"SUM(N:N)","v":0}]
[{"$f":"LOOKUP(E8, Lists!A$236:A$245, Lists!B$236:B$245)","v":{"$error":"#N/A"}},null,{"$f":"VLOOKUP(F8, INDIRECT(\"Lists!$A$140:$B$\" & Lists!$C$245), 2, FALSE)","v":{"$error":"#N/A"}},null,null,null,null,null,null,1,{"$f":"IF(OR(E8<>\"\", F8<>\"\", G8<>\"\", H8<>\"\"), 1, 0)","v":0},{"$f":"IF(AND(E8<>\"\", F8<>\"\", G8<>\"\", H8<>\"\"), 1, 0)","v":0},null,null,null,null,null,null,"# Other",{"$f":"SUM(O:O)","v":0}]
[{"$f":"LOOKUP(E9, Lists!A$236:A$245, Lists!B$236:B$245)","v":{"$error":"#N/A"}},null,{"$f":"VLOOKUP(F9, INDIRECT(\"Lists!$A$140:$B$\" & Lists!$C$245), 2, FALSE)","v":{"$error":"#N/A"}},null,null,null,null,null,null,{"$f":"J8+1","v":2},{"$f":"IF(OR(E9<>\"\", F9<>\"\", G9<>\"\", H9<>\"\"), 1, 0)","v":0},{"$f":"IF(AND(E9<>\"\", F9<>\"\", G9<>\"\", H9<>\"\"), 1, 0)","v":0}]
[{"$f":"LOOKUP(E10, Lists!A$236:A$245, Lists!B$236:B$245)","v":{"$error":"#N/A"}},null,{"$f":"VLOOKUP(F10, INDIRECT(\"Lists!$A$140:$B$\" & Lists!$C$245), 2, FALSE)","v":{"$error":"#N/A"}},null,null,null,null,null,null,{"$f":"J9+1","v":3},{"$f":"IF(OR(E10<>\"\", F10<>\"\", G10<>\"\", H10<>\"\"), 1, 0)","v":0},{"$f":"IF(AND(E10<>\"\", F10<>\"\", G10<>\"\", H10<>\"\"), 1, 0)","v":0}]
[{"$f":"LOOKUP(E11, Lists!A$236:A$245, Lists!B$236:B$245)","v":{"$error":"#N/A"}},null,{"$f":"VLOOKUP(F11, INDIRECT(\"Lists!$A$140:$B$\" & Lists!$C$245), 2, FALSE)","v":{"$error":"#N/A"}},null,null,null,null,null,null,{"$f":"J10+1","v":4},{"$f":"IF(OR(E11<>\"\", F11<>\"\", G11<>\"\", H11<>\"\"), 1, 0)","v":0},{"$f":"IF(AND(E11<>\"\", F11<>\"\", G11<>\"\", H11<>\"\"), 1, 0)","v":0}]
[{"$f":"LOOKUP(E12, Lists!A$236:A$245, Lists!B$236:B$245)","v":{"$error":"#N/A"}},null,{"$f":"VLOOKUP(F12, INDIRECT(\"Lists!$A$140:$B$\" & Lists!$C$245), 2, FALSE)","v":{"$error":"#N/A"}},null,null,null,null,null,null,{"$f":"J11+1","v":5},{"$f":"IF(OR(E12<>\"\", F12<>\"\", G12<>\"\", H12<>\"\"), 1, 0)","v":0},{"$f":"IF(AND(E12<>\"\", F12<>\"\", G12<>\"\", H12<>\"\"), 1, 0)","v":0}]
[{"$f":"LOOKUP(E13, Lists!A$236:A$245, Lists!B$236:B$245)","v":{"$error":"#N/A"}},null,{"$f":"VLOOKUP(F13, INDIRECT(\"Lists!$A$140:$B$\" & Lists!$C$245), 2, FALSE)","v":{"$error":"#N/A"}},null,null,null,null,null,null,{"$f":"J12+1","v":6},{"$f":"IF(OR(E13<>\"\", F13<>\"\", G13<>\"\", H13<>\"\"), 1, 0)","v":0},{"$f":"IF(AND(E13<>\"\", F13<>\"\", G13<>\"\", H13<>\"\"), 1, 0)","v":0}]
[{"$f":"LOOKUP(E14, Lists!A$236:A$245, Lists!B$236:B$245)","v":{"$error":"#N/A"}},null,{"$f":"VLOOKUP(F14, INDIRECT(\"Lists!$A$140:$B$\" & Lists!$C$245), 2, FALSE)","v":{"$error":"#N/A"}},null,null,null,null,null,null,7,0,0]
[null,null,null,"Other\nResources","Resource\n(Example:  Case Management Team)",null,"Team/POETE\n","Number Required\n"]
[null,null,null,null,null,null,null,null,null,null,null,null,1,{"$f":"IF(OR(E16<>\"\", H16<>\"\"), 1, 0)","v":0},{"$f":"IF(AND(E16<>\"\", H16<>\"\"), 1, 0)","v":0}]
[null,null,null,null,null,null,null,null,null,null,null,null,{"$f":"M16+1","v":2},{"$f":"IF(OR(E17<>\"\", H17<>\"\"), 1, 0)","v":0},{"$f":"IF(AND(E17<>\"\", H17<>\"\"), 1, 0)","v":0}]
[null,null,null,null,null,null,null,null,null,null,null,null,{"$f":"M17+1","v":3},{"$f":"IF(OR(E18<>\"\", H18<>\"\"), 1, 0)","v":0},{"$f":"IF(AND(E18<>\"\", H18<>\"\"), 1, 0)","v":0}]
[null,null,null,null,null,null,null,null,null,null,null,null,{"$f":"M18+1","v":4},{"$f":"IF(OR(E19<>\"\", H19<>\"\"), 1, 0)","v":0},{"$f":"IF(AND(E19<>\"\", H19<>\"\"), 1, 0)","v":0}]

{"sheet":"SPR #27 Sit Assessment","index":58,"n_rows":41,"n_cols":19,"rows_kept":41,"cut":false,"hidden":true,"merged":[[2,3,2,7],[3,3,3,7],[5,3,5,7],[7,3,7,7],[12,3,14,3],[14,4,14,7],[8,4,8,7],[9,4,9,7],[10,4,10,7],[30,3,30,7],[31,3,31,7],[33,3,33,7],[40,3,40,7],[16,3,17,3],[19,3,20,3],[22,3,24,3],[24,4,24,7],[26,3,28,3],[28,4,28,7]]}
[21]
[]
[{"$f":"MAX(B:B)","v":1},null,null,"Capability Target"]
[null,{"$f":"ROW()-3","v":1},null,{"$f":"INDIRECT(\"'THIRA Steps 1-3'!$C$117\")","v":0}]
[]
[null,null,null,"Capability Assessment"]
[]
[null,null,null,"Priority"]
[null,null,null,null,"Relative to the other core capabilities, efforts to build and/or sustain this core capability are of high importance to my jurisdiction’s preparedness activities.",null,null,null,null,null,null,null,null,null,null,0]
[null,null,null,null,"Relative to the other core capabilities, efforts to build and/or sustain this core capability are of medium importance to my jurisdiction’s preparedness activities."]
[null,null,null,null,"Relative to the other core capabilities, efforts to build and/or sustain this core capability are of low importance to my jurisdiction’s preparedness activities."]
[]
[null,null,null,"Planning","Rating\nInternal Capability","Rating\nInternal Capability + Mutual Aid","Gap Description","Recent Advances (optional)"]
[null,null,null,null,{"$f":"LOOKUP(P14, Lists!$C$2:$C$8, Lists!D2:D8)","v":"No selection made"},{"$f":"LOOKUP(Q14, Lists!$C$2:$C$8, Lists!D2:D8)","v":"No selection made"},null,null,null,null,null,null,null,null,null,1,1,{"$f":"COUNTIF(I15:AC15, \"TRUE\")","v":0},0]
[null,null,null,null,"Gap Description\nWhich of the following best represent your community's primary planning gaps?",null,null,null,false,false,false,false,false,false,false,false,false]
[]
[null,null,null,"Organization","Rating\nInternal Capability","Rating\nInternal Capability + Mutual Aid","Gap Description","Recent Advances (optional)"]
[null,null,null,null,{"$f":"LOOKUP(P18, Lists!$C$2:$C$8, Lists!E2:E8)","v":"No selection made"},{"$f":"LOOKUP(Q18, Lists!$C$2:$C$8, Lists!E2:E8)","v":"No selection made"},null,null,null,null,null,null,null,null,null,1,1,0]
[]
[null,null,null,"Equipment","Rating\nInternal Capability","Rating\nInternal Capability + Mutual Aid","Gap Description","Recent Advances (optional)"]
[null,null,null,null,{"$f":"LOOKUP(P21, Lists!$C$2:$C$8, Lists!F2:F8)","v":"No selection made"},{"$f":"LOOKUP(Q21, Lists!$C$2:$C$8, Lists!F2:F8)","v":"No selection made"},null,null,null,null,null,null,null,null,null,1,1,0]
[]
[null,null,null,"Training","Rating\nInternal Capability","Rating\nInternal Capability + Mutual Aid","Gap Description","Recent Advances (optional)"]
[null,null,null,null,{"$f":"LOOKUP(P24, Lists!$C$2:$C$8, Lists!G2:G8)","v":"No selection made"},{"$f":"LOOKUP(Q24, Lists!$C$2:$C$8, Lists!G2:G8)","v":"No selection made"},null,null,null,null,null,null,null,null,null,1,1,{"$f":"COUNTIF(I25:S25, \"TRUE\")","v":0},0]
[null,null,null,null,"Gap Description\nWhich of the following best represent your community's primary training gaps?",null,null,null,false,false,false,false,false,false,false,false,false,false,false]
[]
[null,null,null,"Exercises","Rating\nInternal Capability","Rating\nInternal Capability + Mutual Aid","Gap Description","Recent Advances (optional)"]
[null,null,null,null,{"$f":"LOOKUP(P28, Lists!$C$2:$C$8, Lists!H2:H8)","v":"No selection made"},{"$f":"LOOKUP(Q28, Lists!$C$2:$C$8, Lists!H2:H8)","v":"No selection made"},null,null,null,null,null,null,null,null,null,1,1,{"$f":"COUNTIF(I29:AA29, \"TRUE\")","v":0},0]
[null,null,null,null,"Gap Description\nWhich of the following best represent your community's primary exercises gaps?",null,null,null,false,false,false,false,false,false,false,false]
[]
[null,null,null,"Assessment Corroboration"]
[null,null,null,null,null,null,null,null,{"$f":"IF(J32=2,TRUE,IF(J32=3,FALSE,\"\"))","v":""},1]
[]
[null,null,null,"Responsibility for Filling Gap",null,null,null,null,null,null,null,null,null,null,null,0]
[]
[]
[]
[]
[]
[]
[null,null,null,"Journal Notes/Process Narrative (optional)"]

{"sheet":"THIRA #28 Econ Recovery","index":59,"n_rows":16,"n_cols":20,"rows_kept":16,"cut":false,"hidden":false,"merged":[[15,4,15,5],[2,3,2,7],[3,3,3,7],[3,13,3,14],[5,3,5,7],[6,3,10,3],[11,3,15,3],[11,4,11,5],[12,4,12,5],[13,4,13,5],[14,4,14,5]]}
[21]
[]
[{"$f":"MAX(B:B)","v":1},null,null,"Capability Target",null,null,null,null,null,null,null,null,null,null,null,null,null,null,"# NIMS Rows",{"$f":"MAX(J:J)","v":4}]
[null,{"$f":"ROW()-3","v":1},null,{"$f":"INDIRECT(\"'THIRA Steps 1-3'!$C$121\")","v":0},null,null,null,null,null,null,null,null,null,null,null,null,null,null,"# NIMS Started",{"$f":"SUM(K:K)","v":0}]
[null,null,null,null,null,null,null,null,null,null,null,null,null,null,null,null,null,null,"# NIMS Complete",{"$f":"SUM(L:L)","v":0}]
[null,null,null,"Resource Requirements",null,null,null,null,null,null,null,null,null,null,null,null,null,null,"# Other Rows",{"$f":"MAX(M:M)","v":4}]
[null,null,null,"NIMS-typed Resources","Category","Resource","Type","Number Required",null,null,null,null,null,null,null,null,null,null,"# Other Rows",{"$f":"SUM(N:N)","v":0}]
[{"$f":"LOOKUP(E8, Lists!A$236:A$245, Lists!B$236:B$245)","v":{"$error":"#N/A"}},null,{"$f":"VLOOKUP(F8, INDIRECT(\"Lists!$A$140:$B$\" & Lists!$C$245), 2, FALSE)","v":{"$error":"#N/A"}},null,null,null,null,null,null,1,{"$f":"IF(OR(E8<>\"\", F8<>\"\", G8<>\"\", H8<>\"\"), 1, 0)","v":0},{"$f":"IF(AND(E8<>\"\", F8<>\"\", G8<>\"\", H8<>\"\"), 1, 0)","v":0},null,null,null,null,null,null,"# Other",{"$f":"SUM(O:O)","v":0}]
[{"$f":"LOOKUP(E9, Lists!A$236:A$245, Lists!B$236:B$245)","v":{"$error":"#N/A"}},null,{"$f":"VLOOKUP(F9, INDIRECT(\"Lists!$A$140:$B$\" & Lists!$C$245), 2, FALSE)","v":{"$error":"#N/A"}},null,null,null,null,null,null,{"$f":"J8+1","v":2},{"$f":"IF(OR(E9<>\"\", F9<>\"\", G9<>\"\", H9<>\"\"), 1, 0)","v":0},{"$f":"IF(AND(E9<>\"\", F9<>\"\", G9<>\"\", H9<>\"\"), 1, 0)","v":0}]
[{"$f":"LOOKUP(E10, Lists!A$236:A$245, Lists!B$236:B$245)","v":{"$error":"#N/A"}},null,{"$f":"VLOOKUP(F10, INDIRECT(\"Lists!$A$140:$B$\" & Lists!$C$245), 2, FALSE)","v":{"$error":"#N/A"}},null,null,null,null,null,null,{"$f":"J9+1","v":3},{"$f":"IF(OR(E10<>\"\", F10<>\"\", G10<>\"\", H10<>\"\"), 1, 0)","v":0},{"$f":"IF(AND(E10<>\"\", F10<>\"\", G10<>\"\", H10<>\"\"), 1, 0)","v":0}]
[{"$f":"LOOKUP(E11, Lists!A$236:A$245, Lists!B$236:B$245)","v":{"$error":"#N/A"}},null,{"$f":"VLOOKUP(F11, INDIRECT(\"Lists!$A$140:$B$\" & Lists!$C$245), 2, FALSE)","v":{"$error":"#N/A"}},null,null,null,null,null,null,{"$f":"J10+1","v":4},{"$f":"IF(OR(E11<>\"\", F11<>\"\", G11<>\"\", H11<>\"\"), 1, 0)","v":0},{"$f":"IF(AND(E11<>\"\", F11<>\"\", G11<>\"\", H11<>\"\"), 1, 0)","v":0}]
[null,null,null,"Other\nResources","Resource\n(Example:  Case Management Team)",null,"Team/POETE\n","Number Required\n"]
[null,null,null,null,null,null,null,null,null,null,null,null,1,{"$f":"IF(OR(E13<>\"\", H13<>\"\"), 1, 0)","v":0},{"$f":"IF(AND(E13<>\"\", H13<>\"\"), 1, 0)","v":0}]
[null,null,null,null,null,null,null,null,null,null,null,null,{"$f":"M13+1","v":2},{"$f":"IF(OR(E14<>\"\", H14<>\"\"), 1, 0)","v":0},{"$f":"IF(AND(E14<>\"\", H14<>\"\"), 1, 0)","v":0}]
[null,null,null,null,null,null,null,null,null,null,null,null,{"$f":"M14+1","v":3},{"$f":"IF(OR(E15<>\"\", H15<>\"\"), 1, 0)","v":0},{"$f":"IF(AND(E15<>\"\", H15<>\"\"), 1, 0)","v":0}]
[null,null,null,null,null,null,null,null,null,null,null,null,{"$f":"M15+1","v":4},{"$f":"IF(OR(E16<>\"\", H16<>\"\"), 1, 0)","v":0},{"$f":"IF(AND(E16<>\"\", H16<>\"\"), 1, 0)","v":0}]

{"sheet":"SPR #28 Econ Recovery","index":60,"n_rows":41,"n_cols":19,"rows_kept":41,"cut":false,"hidden":true,"merged":[[2,3,2,7],[3,3,3,7],[5,3,5,7],[7,3,7,7],[12,3,14,3],[14,4,14,7],[8,4,8,7],[9,4,9,7],[10,4,10,7],[30,3,30,7],[31,3,31,7],[33,3,33,7],[40,3,40,7],[16,3,17,3],[19,3,20,3],[22,3,24,3],[24,4,24,7],[26,3,28,3],[28,4,28,7]]}
[21]
[]
[{"$f":"MAX(B:B)","v":1},null,null,"Capability Target"]
[null,{"$f":"ROW()-3","v":1},null,{"$f":"INDIRECT(\"'THIRA Steps 1-3'!$C$121\")","v":0}]
[]
[null,null,null,"Capability Assessment"]
[]
[null,null,null,"Priority"]
[null,null,null,null,"Relative to the other core capabilities, efforts to build and/or sustain this core capability are of high importance to my jurisdiction’s preparedness activities.",null,null,null,null,null,null,null,null,null,null,0]
[null,null,null,null,"Relative to the other core capabilities, efforts to build and/or sustain this core capability are of medium importance to my jurisdiction’s preparedness activities."]
[null,null,null,null,"Relative to the other core capabilities, efforts to build and/or sustain this core capability are of low importance to my jurisdiction’s preparedness activities."]
[]
[null,null,null,"Planning","Rating\nInternal Capability","Rating\nInternal Capability + Mutual Aid","Gap Description","Recent Advances (optional)"]
[null,null,null,null,{"$f":"LOOKUP(P14, Lists!$C$2:$C$8, Lists!D2:D8)","v":"No selection made"},{"$f":"LOOKUP(Q14, Lists!$C$2:$C$8, Lists!D2:D8)","v":"No selection made"},null,null,null,null,null,null,null,null,null,1,1,{"$f":"COUNTIF(I15:AC15, \"TRUE\")","v":0},0]
[null,null,null,null,"Gap Description\nWhich of the following best represent your community's primary planning gaps?",null,null,null,false,false,false,false,false,false,false,false,false]
[]
[null,null,null,"Organization","Rating\nInternal Capability","Rating\nInternal Capability + Mutual Aid","Gap Description","Recent Advances (optional)"]
[null,null,null,null,{"$f":"LOOKUP(P18, Lists!$C$2:$C$8, Lists!E2:E8)","v":"No selection made"},{"$f":"LOOKUP(Q18, Lists!$C$2:$C$8, Lists!E2:E8)","v":"No selection made"},null,null,null,null,null,null,null,null,null,1,1,0]
[]
[null,null,null,"Equipment","Rating\nInternal Capability","Rating\nInternal Capability + Mutual Aid","Gap Description","Recent Advances (optional)"]
[null,null,null,null,{"$f":"LOOKUP(P21, Lists!$C$2:$C$8, Lists!F2:F8)","v":"No selection made"},{"$f":"LOOKUP(Q21, Lists!$C$2:$C$8, Lists!F2:F8)","v":"No selection made"},null,null,null,null,null,null,null,null,null,1,1,0]
[]
[null,null,null,"Training","Rating\nInternal Capability","Rating\nInternal Capability + Mutual Aid","Gap Description","Recent Advances (optional)"]
[null,null,null,null,{"$f":"LOOKUP(P24, Lists!$C$2:$C$8, Lists!G2:G8)","v":"No selection made"},{"$f":"LOOKUP(Q24, Lists!$C$2:$C$8, Lists!G2:G8)","v":"No selection made"},null,null,null,null,null,null,null,null,null,1,1,{"$f":"COUNTIF(I25:S25, \"TRUE\")","v":0},0]
[null,null,null,null,"Gap Description\nWhich of the following best represent your community's primary training gaps?",null,null,null,false,false,false,false,false,false,false,false,false,false,false]
[]
[null,null,null,"Exercises","Rating\nInternal Capability","Rating\nInternal Capability + Mutual Aid","Gap Description","Recent Advances (optional)"]
[null,null,null,null,{"$f":"LOOKUP(P28, Lists!$C$2:$C$8, Lists!H2:H8)","v":"No selection made"},{"$f":"LOOKUP(Q28, Lists!$C$2:$C$8, Lists!H2:H8)","v":"No selection made"},null,null,null,null,null,null,null,null,null,1,1,{"$f":"COUNTIF(I29:AA29, \"TRUE\")","v":0},0]
[null,null,null,null,"Gap Description\nWhich of the following best represent your community's primary exercises gaps?",null,null,null,false,false,false,false,false,false,false,false]
[]
[null,null,null,"Assessment Corroboration"]
[null,null,null,null,null,null,null,null,{"$f":"IF(J32=2,TRUE,IF(J32=3,FALSE,\"\"))","v":""},1]
[]
[null,null,null,"Responsibility for Filling Gap",null,null,null,null,null,null,null,null,null,null,null,0]
[]
[]
[]
[]
[]
[]
[null,null,null,"Journal Notes/Process Narrative (optional)"]

{"sheet":"THIRA #29 Health Soc Services","index":61,"n_rows":19,"n_cols":20,"rows_kept":19,"cut":false,"hidden":false,"merged":[[18,4,18,5],[2,3,2,7],[3,3,3,7],[3,13,3,14],[5,3,5,7],[6,3,13,3],[14,3,18,3],[14,4,14,5],[15,4,15,5],[16,4,16,5],[17,4,17,5]]}
[21]
[]
[{"$f":"MAX(B:B)","v":1},null,null,"Capability Target",null,null,null,null,null,null,null,null,null,null,null,null,null,null,"# NIMS Rows",{"$f":"MAX(J:J)","v":7}]
[null,{"$f":"ROW()-3","v":1},null,{"$f":"INDIRECT(\"'THIRA Steps 1-3'!$C$125\")","v":0},null,null,null,null,null,null,null,null,null,null,null,null,null,null,"# NIMS Started",{"$f":"SUM(K:K)","v":0}]
[null,null,null,null,null,null,null,null,null,null,null,null,null,null,null,null,null,null,"# NIMS Complete",{"$f":"SUM(L:L)","v":0}]
[null,null,null,"Resource Requirements",null,null,null,null,null,null,null,null,null,null,null,null,null,null,"# Other Rows",{"$f":"MAX(M:M)","v":4}]
[null,null,null,"NIMS-typed Resources","Category","Resource","Type","Number Required",null,null,null,null,null,null,null,null,null,null,"# Other Rows",{"$f":"SUM(N:N)","v":0}]
[{"$f":"LOOKUP(E8, Lists!A$236:A$245, Lists!B$236:B$245)","v":{"$error":"#N/A"}},null,{"$f":"VLOOKUP(F8, INDIRECT(\"Lists!$A$140:$B$\" & Lists!$C$245), 2, FALSE)","v":{"$error":"#N/A"}},null,null,null,null,null,null,1,{"$f":"IF(OR(E8<>\"\", F8<>\"\", G8<>\"\", H8<>\"\"), 1, 0)","v":0},{"$f":"IF(AND(E8<>\"\", F8<>\"\", G8<>\"\", H8<>\"\"), 1, 0)","v":0},null,null,null,null,null,null,"# Other",{"$f":"SUM(O:O)","v":0}]
[{"$f":"LOOKUP(E9, Lists!A$236:A$245, Lists!B$236:B$245)","v":{"$error":"#N/A"}},null,{"$f":"VLOOKUP(F9, INDIRECT(\"Lists!$A$140:$B$\" & Lists!$C$245), 2, FALSE)","v":{"$error":"#N/A"}},null,null,null,null,null,null,{"$f":"J8+1","v":2},{"$f":"IF(OR(E9<>\"\", F9<>\"\", G9<>\"\", H9<>\"\"), 1, 0)","v":0},{"$f":"IF(AND(E9<>\"\", F9<>\"\", G9<>\"\", H9<>\"\"), 1, 0)","v":0}]
[{"$f":"LOOKUP(E10, Lists!A$236:A$245, Lists!B$236:B$245)","v":{"$error":"#N/A"}},null,{"$f":"VLOOKUP(F10, INDIRECT(\"Lists!$A$140:$B$\" & Lists!$C$245), 2, FALSE)","v":{"$error":"#N/A"}},null,null,null,null,null,null,{"$f":"J9+1","v":3},{"$f":"IF(OR(E10<>\"\", F10<>\"\", G10<>\"\", H10<>\"\"), 1, 0)","v":0},{"$f":"IF(AND(E10<>\"\", F10<>\"\", G10<>\"\", H10<>\"\"), 1, 0)","v":0}]
[{"$f":"LOOKUP(E11, Lists!A$236:A$245, Lists!B$236:B$245)","v":{"$error":"#N/A"}},null,{"$f":"VLOOKUP(F11, INDIRECT(\"Lists!$A$140:$B$\" & Lists!$C$245), 2, FALSE)","v":{"$error":"#N/A"}},null,null,null,null,null,null,{"$f":"J10+1","v":4},{"$f":"IF(OR(E11<>\"\", F11<>\"\", G11<>\"\", H11<>\"\"), 1, 0)","v":0},{"$f":"IF(AND(E11<>\"\", F11<>\"\", G11<>\"\", H11<>\"\"), 1, 0)","v":0}]
[{"$f":"LOOKUP(E12, Lists!A$236:A$245, Lists!B$236:B$245)","v":{"$error":"#N/A"}},null,{"$f":"VLOOKUP(F12, INDIRECT(\"Lists!$A$140:$B$\" & Lists!$C$245), 2, FALSE)","v":{"$error":"#N/A"}},null,null,null,null,null,null,5,{"$f":"IF(OR(E12<>\"\", F12<>\"\", G12<>\"\", H12<>\"\"), 1, 0)","v":0},{"$f":"IF(AND(E12<>\"\", F12<>\"\", G12<>\"\", H12<>\"\"), 1, 0)","v":0}]
[{"$f":"LOOKUP(E13, Lists!A$236:A$245, Lists!B$236:B$245)","v":{"$error":"#N/A"}},null,{"$f":"VLOOKUP(F13, INDIRECT(\"Lists!$A$140:$B$\" & Lists!$C$245), 2, FALSE)","v":{"$error":"#N/A"}},null,null,null,null,null,null,6,{"$f":"IF(OR(E13<>\"\", F13<>\"\", G13<>\"\", H13<>\"\"), 1, 0)","v":0},{"$f":"IF(AND(E13<>\"\", F13<>\"\", G13<>\"\", H13<>\"\"), 1, 0)","v":0}]
[{"$f":"LOOKUP(E14, Lists!A$236:A$245, Lists!B$236:B$245)","v":{"$error":"#N/A"}},null,{"$f":"VLOOKUP(F14, INDIRECT(\"Lists!$A$140:$B$\" & Lists!$C$245), 2, FALSE)","v":{"$error":"#N/A"}},null,null,null,null,null,null,7,0,0]
[null,null,null,"Other\nResources","Resource\n(Example:  Case Management Team)",null,"Team/POETE\n","Number Required\n"]
[null,null,null,null,null,null,null,null,null,null,null,null,1,{"$f":"IF(OR(E16<>\"\", H16<>\"\"), 1, 0)","v":0},{"$f":"IF(AND(E16<>\"\", H16<>\"\"), 1, 0)","v":0}]
[null,null,null,null,null,null,null,null,null,null,null,null,{"$f":"M16+1","v":2},{"$f":"IF(OR(E17<>\"\", H17<>\"\"), 1, 0)","v":0},{"$f":"IF(AND(E17<>\"\", H17<>\"\"), 1, 0)","v":0}]
[null,null,null,null,null,null,null,null,null,null,null,null,{"$f":"M17+1","v":3},{"$f":"IF(OR(E18<>\"\", H18<>\"\"), 1, 0)","v":0},{"$f":"IF(AND(E18<>\"\", H18<>\"\"), 1, 0)","v":0}]
[null,null,null,null,null,null,null,null,null,null,null,null,{"$f":"M18+1","v":4},{"$f":"IF(OR(E19<>\"\", H19<>\"\"), 1, 0)","v":0},{"$f":"IF(AND(E19<>\"\", H19<>\"\"), 1, 0)","v":0}]

{"sheet":"SPR #29 Health Soc Services","index":62,"n_rows":41,"n_cols":19,"rows_kept":41,"cut":false,"hidden":true,"merged":[[2,3,2,7],[3,3,3,7],[5,3,5,7],[7,3,7,7],[12,3,14,3],[14,4,14,7],[8,4,8,7],[9,4,9,7],[10,4,10,7],[30,3,30,7],[31,3,31,7],[33,3,33,7],[40,3,40,7],[16,3,17,3],[19,3,20,3],[22,3,24,3],[24,4,24,7],[26,3,28,3],[28,4,28,7]]}
[21]
[]
[{"$f":"MAX(B:B)","v":1},null,null,"Capability Target"]
[null,{"$f":"ROW()-3","v":1},null,{"$f":"INDIRECT(\"'THIRA Steps 1-3'!$C$125\")","v":0}]
[]
[null,null,null,"Capability Assessment"]
[]
[null,null,null,"Priority"]
[null,null,null,null,"Relative to the other core capabilities, efforts to build and/or sustain this core capability are of high importance to my jurisdiction’s preparedness activities.",null,null,null,null,null,null,null,null,null,null,0]
[null,null,null,null,"Relative to the other core capabilities, efforts to build and/or sustain this core capability are of medium importance to my jurisdiction’s preparedness activities."]
[null,null,null,null,"Relative to the other core capabilities, efforts to build and/or sustain this core capability are of low importance to my jurisdiction’s preparedness activities."]
[]
[null,null,null,"Planning","Rating\nInternal Capability","Rating\nInternal Capability + Mutual Aid","Gap Description","Recent Advances (optional)"]
[null,null,null,null,{"$f":"LOOKUP(P14, Lists!$C$2:$C$8, Lists!D2:D8)","v":"No selection made"},{"$f":"LOOKUP(Q14, Lists!$C$2:$C$8, Lists!D2:D8)","v":"No selection made"},null,null,null,null,null,null,null,null,null,1,1,{"$f":"COUNTIF(I15:AC15, \"TRUE\")","v":0},0]
[null,null,null,null,"Gap Description\nWhich of the following best represent your community's primary planning gaps?",null,null,null,false,false,false,false,false,false,false,false,false]
[]
[null,null,null,"Organization","Rating\nInternal Capability","Rating\nInternal Capability + Mutual Aid","Gap Description","Recent Advances (optional)"]
[null,null,null,null,{"$f":"LOOKUP(P18, Lists!$C$2:$C$8, Lists!E2:E8)","v":"No selection made"},{"$f":"LOOKUP(Q18, Lists!$C$2:$C$8, Lists!E2:E8)","v":"No selection made"},null,null,null,null,null,null,null,null,null,1,1,0]
[]
[null,null,null,"Equipment","Rating\nInternal Capability","Rating\nInternal Capability + Mutual Aid","Gap Description","Recent Advances (optional)"]
[null,null,null,null,{"$f":"LOOKUP(P21, Lists!$C$2:$C$8, Lists!F2:F8)","v":"No selection made"},{"$f":"LOOKUP(Q21, Lists!$C$2:$C$8, Lists!F2:F8)","v":"No selection made"},null,null,null,null,null,null,null,null,null,1,1,0]
[]
[null,null,null,"Training","Rating\nInternal Capability","Rating\nInternal Capability + Mutual Aid","Gap Description","Recent Advances (optional)"]
[null,null,null,null,{"$f":"LOOKUP(P24, Lists!$C$2:$C$8, Lists!G2:G8)","v":"No selection made"},{"$f":"LOOKUP(Q24, Lists!$C$2:$C$8, Lists!G2:G8)","v":"No selection made"},null,null,null,null,null,null,null,null,null,1,1,{"$f":"COUNTIF(I25:S25, \"TRUE\")","v":0},0]
[null,null,null,null,"Gap Description\nWhich of the following best represent your community's primary training gaps?",null,null,null,false,false,false,false,false,false,false,false,false,false,false]
[]
[null,null,null,"Exercises","Rating\nInternal Capability","Rating\nInternal Capability + Mutual Aid","Gap Description","Recent Advances (optional)"]
[null,null,null,null,{"$f":"LOOKUP(P28, Lists!$C$2:$C$8, Lists!H2:H8)","v":"No selection made"},{"$f":"LOOKUP(Q28, Lists!$C$2:$C$8, Lists!H2:H8)","v":"No selection made"},null,null,null,null,null,null,null,null,null,1,1,{"$f":"COUNTIF(I29:AA29, \"TRUE\")","v":0},0]
[null,null,null,null,"Gap Description\nWhich of the following best represent your community's primary exercises gaps?",null,null,null,false,false,false,false,false,false,false,false]
[]
[null,null,null,"Assessment Corroboration"]
[null,null,null,null,null,null,null,null,{"$f":"IF(J32=2,TRUE,IF(J32=3,FALSE,\"\"))","v":""},1]
[]
[null,null,null,"Responsibility for Filling Gap",null,null,null,null,null,null,null,null,null,null,null,0]
[]
[]
[]
[]
[]
[]
[null,null,null,"Journal Notes/Process Narrative (optional)"]

{"sheet":"THIRA #30 Housing","index":63,"n_rows":16,"n_cols":20,"rows_kept":16,"cut":false,"hidden":false,"merged":[[15,4,15,5],[2,3,2,7],[3,3,3,7],[3,13,3,14],[5,3,5,7],[6,3,10,3],[11,3,15,3],[11,4,11,5],[12,4,12,5],[13,4,13,5],[14,4,14,5]]}
[21]
[]
[{"$f":"MAX(B:B)","v":1},null,null,"Capability Target",null,null,null,null,null,null,null,null,null,null,null,null,null,null,"# NIMS Rows",{"$f":"MAX(J:J)","v":4}]
[null,{"$f":"ROW()-3","v":1},null,{"$f":"INDIRECT(\"'THIRA Steps 1-3'!$C$129\")","v":0},null,null,null,null,null,null,null,null,null,null,null,null,null,null,"# NIMS Started",{"$f":"SUM(K:K)","v":0}]
[null,null,null,null,null,null,null,null,null,null,null,null,null,null,null,null,null,null,"# NIMS Complete",{"$f":"SUM(L:L)","v":0}]
[null,null,null,"Resource Requirements",null,null,null,null,null,null,null,null,null,null,null,null,null,null,"# Other Rows",{"$f":"MAX(M:M)","v":4}]
[null,null,null,"NIMS-typed Resources","Category","Resource","Type","Number Required",null,null,null,null,null,null,null,null,null,null,"# Other Rows",{"$f":"SUM(N:N)","v":0}]
[{"$f":"LOOKUP(E8, Lists!A$236:A$245, Lists!B$236:B$245)","v":{"$error":"#N/A"}},null,{"$f":"VLOOKUP(F8, INDIRECT(\"Lists!$A$140:$B$\" & Lists!$C$245), 2, FALSE)","v":{"$error":"#N/A"}},null,null,null,null,null,null,1,{"$f":"IF(OR(E8<>\"\", F8<>\"\", G8<>\"\", H8<>\"\"), 1, 0)","v":0},{"$f":"IF(AND(E8<>\"\", F8<>\"\", G8<>\"\", H8<>\"\"), 1, 0)","v":0},null,null,null,null,null,null,"# Other",{"$f":"SUM(O:O)","v":0}]
[{"$f":"LOOKUP(E9, Lists!A$236:A$245, Lists!B$236:B$245)","v":{"$error":"#N/A"}},null,{"$f":"VLOOKUP(F9, INDIRECT(\"Lists!$A$140:$B$\" & Lists!$C$245), 2, FALSE)","v":{"$error":"#N/A"}},null,null,null,null,null,null,{"$f":"J8+1","v":2},{"$f":"IF(OR(E9<>\"\", F9<>\"\", G9<>\"\", H9<>\"\"), 1, 0)","v":0},{"$f":"IF(AND(E9<>\"\", F9<>\"\", G9<>\"\", H9<>\"\"), 1, 0)","v":0}]
[{"$f":"LOOKUP(E10, Lists!A$236:A$245, Lists!B$236:B$245)","v":{"$error":"#N/A"}},null,{"$f":"VLOOKUP(F10, INDIRECT(\"Lists!$A$140:$B$\" & Lists!$C$245), 2, FALSE)","v":{"$error":"#N/A"}},null,null,null,null,null,null,{"$f":"J9+1","v":3},{"$f":"IF(OR(E10<>\"\", F10<>\"\", G10<>\"\", H10<>\"\"), 1, 0)","v":0},{"$f":"IF(AND(E10<>\"\", F10<>\"\", G10<>\"\", H10<>\"\"), 1, 0)","v":0}]
[{"$f":"LOOKUP(E11, Lists!A$236:A$245, Lists!B$236:B$245)","v":{"$error":"#N/A"}},null,{"$f":"VLOOKUP(F11, INDIRECT(\"Lists!$A$140:$B$\" & Lists!$C$245), 2, FALSE)","v":{"$error":"#N/A"}},null,null,null,null,null,null,{"$f":"J10+1","v":4},{"$f":"IF(OR(E11<>\"\", F11<>\"\", G11<>\"\", H11<>\"\"), 1, 0)","v":0},{"$f":"IF(AND(E11<>\"\", F11<>\"\", G11<>\"\", H11<>\"\"), 1, 0)","v":0}]
[null,null,null,"Other\nResources","Resource\n(Example:  Case Management Team)",null,"Team/POETE\n","Number Required\n"]
[null,null,null,null,null,null,null,null,null,null,null,null,1,{"$f":"IF(OR(E13<>\"\", H13<>\"\"), 1, 0)","v":0},{"$f":"IF(AND(E13<>\"\", H13<>\"\"), 1, 0)","v":0}]
[null,null,null,null,null,null,null,null,null,null,null,null,{"$f":"M13+1","v":2},{"$f":"IF(OR(E14<>\"\", H14<>\"\"), 1, 0)","v":0},{"$f":"IF(AND(E14<>\"\", H14<>\"\"), 1, 0)","v":0}]
[null,null,null,null,null,null,null,null,null,null,null,null,{"$f":"M14+1","v":3},{"$f":"IF(OR(E15<>\"\", H15<>\"\"), 1, 0)","v":0},{"$f":"IF(AND(E15<>\"\", H15<>\"\"), 1, 0)","v":0}]
[null,null,null,null,null,null,null,null,null,null,null,null,{"$f":"M15+1","v":4},{"$f":"IF(OR(E16<>\"\", H16<>\"\"), 1, 0)","v":0},{"$f":"IF(AND(E16<>\"\", H16<>\"\"), 1, 0)","v":0}]

{"sheet":"SPR #30 Housing","index":64,"n_rows":41,"n_cols":19,"rows_kept":41,"cut":false,"hidden":true,"merged":[[2,3,2,7],[3,3,3,7],[5,3,5,7],[7,3,7,7],[12,3,14,3],[14,4,14,7],[8,4,8,7],[9,4,9,7],[10,4,10,7],[30,3,30,7],[31,3,31,7],[33,3,33,7],[40,3,40,7],[16,3,17,3],[19,3,20,3],[22,3,24,3],[24,4,24,7],[26,3,28,3],[28,4,28,7]]}
[21]
[]
[{"$f":"MAX(B:B)","v":1},null,null,"Capability Target"]
[null,{"$f":"ROW()-3","v":1},null,{"$f":"INDIRECT(\"'THIRA Steps 1-3'!$C$129\")","v":0}]
[]
[null,null,null,"Capability Assessment"]
[]
[null,null,null,"Priority"]
[null,null,null,null,"Relative to the other core capabilities, efforts to build and/or sustain this core capability are of high importance to my jurisdiction’s preparedness activities.",null,null,null,null,null,null,null,null,null,null,0]
[null,null,null,null,"Relative to the other core capabilities, efforts to build and/or sustain this core capability are of medium importance to my jurisdiction’s preparedness activities."]
[null,null,null,null,"Relative to the other core capabilities, efforts to build and/or sustain this core capability are of low importance to my jurisdiction’s preparedness activities."]
[]
[null,null,null,"Planning","Rating\nInternal Capability","Rating\nInternal Capability + Mutual Aid","Gap Description","Recent Advances (optional)"]
[null,null,null,null,{"$f":"LOOKUP(P14, Lists!$C$2:$C$8, Lists!D2:D8)","v":"No selection made"},{"$f":"LOOKUP(Q14, Lists!$C$2:$C$8, Lists!D2:D8)","v":"No selection made"},null,null,null,null,null,null,null,null,null,1,1,{"$f":"COUNTIF(I15:AC15, \"TRUE\")","v":0},0]
[null,null,null,null,"Gap Description\nWhich of the following best represent your community's primary planning gaps?",null,null,null,false,false,false,false,false,false,false,false,false]
[]
[null,null,null,"Organization","Rating\nInternal Capability","Rating\nInternal Capability + Mutual Aid","Gap Description","Recent Advances (optional)"]
[null,null,null,null,{"$f":"LOOKUP(P18, Lists!$C$2:$C$8, Lists!E2:E8)","v":"No selection made"},{"$f":"LOOKUP(Q18, Lists!$C$2:$C$8, Lists!E2:E8)","v":"No selection made"},null,null,null,null,null,null,null,null,null,1,1,0]
[]
[null,null,null,"Equipment","Rating\nInternal Capability","Rating\nInternal Capability + Mutual Aid","Gap Description","Recent Advances (optional)"]
[null,null,null,null,{"$f":"LOOKUP(P21, Lists!$C$2:$C$8, Lists!F2:F8)","v":"No selection made"},{"$f":"LOOKUP(Q21, Lists!$C$2:$C$8, Lists!F2:F8)","v":"No selection made"},null,null,null,null,null,null,null,null,null,1,1,0]
[]
[null,null,null,"Training","Rating\nInternal Capability","Rating\nInternal Capability + Mutual Aid","Gap Description","Recent Advances (optional)"]
[null,null,null,null,{"$f":"LOOKUP(P24, Lists!$C$2:$C$8, Lists!G2:G8)","v":"No selection made"},{"$f":"LOOKUP(Q24, Lists!$C$2:$C$8, Lists!G2:G8)","v":"No selection made"},null,null,null,null,null,null,null,null,null,1,1,{"$f":"COUNTIF(I25:S25, \"TRUE\")","v":0},0]
[null,null,null,null,"Gap Description\nWhich of the following best represent your community's primary training gaps?",null,null,null,false,false,false,false,false,false,false,false,false,false,false]
[]
[null,null,null,"Exercises","Rating\nInternal Capability","Rating\nInternal Capability + Mutual Aid","Gap Description","Recent Advances (optional)"]
[null,null,null,null,{"$f":"LOOKUP(P28, Lists!$C$2:$C$8, Lists!H2:H8)","v":"No selection made"},{"$f":"LOOKUP(Q28, Lists!$C$2:$C$8, Lists!H2:H8)","v":"No selection made"},null,null,null,null,null,null,null,null,null,1,1,{"$f":"COUNTIF(I29:AA29, \"TRUE\")","v":0},0]
[null,null,null,null,"Gap Description\nWhich of the following best represent your community's primary exercises gaps?",null,null,null,false,false,false,false,false,false,false,false]
[]
[null,null,null,"Assessment Corroboration"]
[null,null,null,null,null,null,null,null,{"$f":"IF(J32=2,TRUE,IF(J32=3,FALSE,\"\"))","v":""},1]
[]
[null,null,null,"Responsibility for Filling Gap",null,null,null,null,null,null,null,null,null,null,null,0]
[]
[]
[]
[]
[]
[]
[null,null,null,"Journal Notes/Process Narrative (optional)"]

{"sheet":"THIRA #31 Nat Cult Resources","index":65,"n_rows":16,"n_cols":20,"rows_kept":16,"cut":false,"hidden":false,"merged":[[15,4,15,5],[2,3,2,7],[3,3,3,7],[3,13,3,14],[5,3,5,7],[6,3,10,3],[11,3,15,3],[11,4,11,5],[12,4,12,5],[13,4,13,5],[14,4,14,5]]}
[21]
[]
[{"$f":"MAX(B:B)","v":1},null,null,"Capability Target",null,null,null,null,null,null,null,null,null,null,null,null,null,null,"# NIMS Rows",{"$f":"MAX(J:J)","v":4}]
[null,{"$f":"ROW()-3","v":1},null,{"$f":"INDIRECT(\"'THIRA Steps 1-3'!$C$133\")","v":0},null,null,null,null,null,null,null,null,null,null,null,null,null,null,"# NIMS Started",{"$f":"SUM(K:K)","v":0}]
[null,null,null,null,null,null,null,null,null,null,null,null,null,null,null,null,null,null,"# NIMS Complete",{"$f":"SUM(L:L)","v":0}]
[null,null,null,"Resource Requirements",null,null,null,null,null,null,null,null,null,null,null,null,null,null,"# Other Rows",{"$f":"MAX(M:M)","v":4}]
[null,null,null,"NIMS-typed Resources","Category","Resource","Type","Number Required",null,null,null,null,null,null,null,null,null,null,"# Other Rows",{"$f":"SUM(N:N)","v":0}]
[{"$f":"LOOKUP(E8, Lists!A$236:A$245, Lists!B$236:B$245)","v":{"$error":"#N/A"}},null,{"$f":"VLOOKUP(F8, INDIRECT(\"Lists!$A$140:$B$\" & Lists!$C$245), 2, FALSE)","v":{"$error":"#N/A"}},null,null,null,null,null,null,1,{"$f":"IF(OR(E8<>\"\", F8<>\"\", G8<>\"\", H8<>\"\"), 1, 0)","v":0},{"$f":"IF(AND(E8<>\"\", F8<>\"\", G8<>\"\", H8<>\"\"), 1, 0)","v":0},null,null,null,null,null,null,"# Other",{"$f":"SUM(O:O)","v":0}]
[{"$f":"LOOKUP(E9, Lists!A$236:A$245, Lists!B$236:B$245)","v":{"$error":"#N/A"}},null,{"$f":"VLOOKUP(F9, INDIRECT(\"Lists!$A$140:$B$\" & Lists!$C$245), 2, FALSE)","v":{"$error":"#N/A"}},null,null,null,null,null,null,{"$f":"J8+1","v":2},{"$f":"IF(OR(E9<>\"\", F9<>\"\", G9<>\"\", H9<>\"\"), 1, 0)","v":0},{"$f":"IF(AND(E9<>\"\", F9<>\"\", G9<>\"\", H9<>\"\"), 1, 0)","v":0}]
[{"$f":"LOOKUP(E10, Lists!A$236:A$245, Lists!B$236:B$245)","v":{"$error":"#N/A"}},null,{"$f":"VLOOKUP(F10, INDIRECT(\"Lists!$A$140:$B$\" & Lists!$C$245), 2, FALSE)","v":{"$error":"#N/A"}},null,null,null,null,null,null,{"$f":"J9+1","v":3},{"$f":"IF(OR(E10<>\"\", F10<>\"\", G10<>\"\", H10<>\"\"), 1, 0)","v":0},{"$f":"IF(AND(E10<>\"\", F10<>\"\", G10<>\"\", H10<>\"\"), 1, 0)","v":0}]
[{"$f":"LOOKUP(E11, Lists!A$236:A$245, Lists!B$236:B$245)","v":{"$error":"#N/A"}},null,{"$f":"VLOOKUP(F11, INDIRECT(\"Lists!$A$140:$B$\" & Lists!$C$245), 2, FALSE)","v":{"$error":"#N/A"}},null,null,null,null,null,null,{"$f":"J10+1","v":4},{"$f":"IF(OR(E11<>\"\", F11<>\"\", G11<>\"\", H11<>\"\"), 1, 0)","v":0},{"$f":"IF(AND(E11<>\"\", F11<>\"\", G11<>\"\", H11<>\"\"), 1, 0)","v":0}]
[null,null,null,"Other\nResources","Resource\n(Example:  Case Management Team)",null,"Team/POETE\n","Number Required\n"]
[null,null,null,null,null,null,null,null,null,null,null,null,1,{"$f":"IF(OR(E13<>\"\", H13<>\"\"), 1, 0)","v":0},{"$f":"IF(AND(E13<>\"\", H13<>\"\"), 1, 0)","v":0}]
[null,null,null,null,null,null,null,null,null,null,null,null,{"$f":"M13+1","v":2},{"$f":"IF(OR(E14<>\"\", H14<>\"\"), 1, 0)","v":0},{"$f":"IF(AND(E14<>\"\", H14<>\"\"), 1, 0)","v":0}]
[null,null,null,null,null,null,null,null,null,null,null,null,{"$f":"M14+1","v":3},{"$f":"IF(OR(E15<>\"\", H15<>\"\"), 1, 0)","v":0},{"$f":"IF(AND(E15<>\"\", H15<>\"\"), 1, 0)","v":0}]
[null,null,null,null,null,null,null,null,null,null,null,null,{"$f":"M15+1","v":4},{"$f":"IF(OR(E16<>\"\", H16<>\"\"), 1, 0)","v":0},{"$f":"IF(AND(E16<>\"\", H16<>\"\"), 1, 0)","v":0}]

{"sheet":"SPR #31 Nat Cult Resources","index":66,"n_rows":41,"n_cols":19,"rows_kept":41,"cut":false,"hidden":true,"merged":[[2,3,2,7],[3,3,3,7],[5,3,5,7],[7,3,7,7],[12,3,14,3],[14,4,14,7],[8,4,8,7],[9,4,9,7],[10,4,10,7],[30,3,30,7],[31,3,31,7],[33,3,33,7],[40,3,40,7],[16,3,17,3],[19,3,20,3],[22,3,24,3],[24,4,24,7],[26,3,28,3],[28,4,28,7]]}
[21]
[]
[{"$f":"MAX(B:B)","v":1},null,null,"Capability Target"]
[null,{"$f":"ROW()-3","v":1},null,{"$f":"INDIRECT(\"'THIRA Steps 1-3'!$C$133\")","v":0}]
[]
[null,null,null,"Capability Assessment"]
[]
[null,null,null,"Priority"]
[null,null,null,null,"Relative to the other core capabilities, efforts to build and/or sustain this core capability are of high importance to my jurisdiction’s preparedness activities.",null,null,null,null,null,null,null,null,null,null,0]
[null,null,null,null,"Relative to the other core capabilities, efforts to build and/or sustain this core capability are of medium importance to my jurisdiction’s preparedness activities."]
[null,null,null,null,"Relative to the other core capabilities, efforts to build and/or sustain this core capability are of low importance to my jurisdiction’s preparedness activities."]
[]
[null,null,null,"Planning","Rating\nInternal Capability","Rating\nInternal Capability + Mutual Aid","Gap Description","Recent Advances (optional)"]
[null,null,null,null,{"$f":"LOOKUP(P14, Lists!$C$2:$C$8, Lists!D2:D8)","v":"No selection made"},{"$f":"LOOKUP(Q14, Lists!$C$2:$C$8, Lists!D2:D8)","v":"No selection made"},null,null,null,null,null,null,null,null,null,1,1,{"$f":"COUNTIF(I15:AC15, \"TRUE\")","v":0},0]
[null,null,null,null,"Gap Description\nWhich of the following best represent your community's primary planning gaps?",null,null,null,false,false,false,false,false,false,false,false,false]
[]
[null,null,null,"Organization","Rating\nInternal Capability","Rating\nInternal Capability + Mutual Aid","Gap Description","Recent Advances (optional)"]
[null,null,null,null,{"$f":"LOOKUP(P18, Lists!$C$2:$C$8, Lists!E2:E8)","v":"No selection made"},{"$f":"LOOKUP(Q18, Lists!$C$2:$C$8, Lists!E2:E8)","v":"No selection made"},null,null,null,null,null,null,null,null,null,1,1,0]
[]
[null,null,null,"Equipment","Rating\nInternal Capability","Rating\nInternal Capability + Mutual Aid","Gap Description","Recent Advances (optional)"]
[null,null,null,null,{"$f":"LOOKUP(P21, Lists!$C$2:$C$8, Lists!F2:F8)","v":"No selection made"},{"$f":"LOOKUP(Q21, Lists!$C$2:$C$8, Lists!F2:F8)","v":"No selection made"},null,null,null,null,null,null,null,null,null,1,1,0]
[]
[null,null,null,"Training","Rating\nInternal Capability","Rating\nInternal Capability + Mutual Aid","Gap Description","Recent Advances (optional)"]
[null,null,null,null,{"$f":"LOOKUP(P24, Lists!$C$2:$C$8, Lists!G2:G8)","v":"No selection made"},{"$f":"LOOKUP(Q24, Lists!$C$2:$C$8, Lists!G2:G8)","v":"No selection made"},null,null,null,null,null,null,null,null,null,1,1,{"$f":"COUNTIF(I25:S25, \"TRUE\")","v":0},0]
[null,null,null,null,"Gap Description\nWhich of the following best represent your community's primary training gaps?",null,null,null,false,false,false,false,false,false,false,false,false,false,false]
[]
[null,null,null,"Exercises","Rating\nInternal Capability","Rating\nInternal Capability + Mutual Aid","Gap Description","Recent Advances (optional)"]
[null,null,null,null,{"$f":"LOOKUP(P28, Lists!$C$2:$C$8, Lists!H2:H8)","v":"No selection made"},{"$f":"LOOKUP(Q28, Lists!$C$2:$C$8, Lists!H2:H8)","v":"No selection made"},null,null,null,null,null,null,null,null,null,1,1,{"$f":"COUNTIF(I29:AA29, \"TRUE\")","v":0},0]
[null,null,null,null,"Gap Description\nWhich of the following best represent your community's primary exercises gaps?",null,null,null,false,false,false,false,false,false,false,false]
[]
[null,null,null,"Assessment Corroboration"]
[null,null,null,null,null,null,null,null,{"$f":"IF(J32=2,TRUE,IF(J32=3,FALSE,\"\"))","v":""},1]
[]
[null,null,null,"Responsibility for Filling Gap",null,null,null,null,null,null,null,null,null,null,null,0]
[]
[]
[]
[]
[]
[]
[null,null,null,"Journal Notes/Process Narrative (optional)"]

{"sheet":"THIRA Post-Assessment","index":67,"n_rows":157,"n_cols":23,"rows_kept":157,"cut":false,"hidden":false,"merged":[[71,1,71,6],[73,2,99,5],[104,2,120,5],[125,2,141,5],[10,1,10,6],[33,1,34,6],[55,1,55,6]]}
[null,null,null,null,null,null,null,null,null,null,null,null,null,null,null,null,null,null,null,null,null,{"$f":"AND(W14>0,W37>0,W59>0,V105>0,V126>0,V146>0)","v":false}]
[]
[]
[]
[]
[]
[]
[]
[]
[]
[null,"1.  Which of the following types of governmental departments and agencies participated in the THIRA process, and how many departments/agencies of each type participated?"]
[]
[]
[null,null,"Department/Agency","Number Participating",null,null,null,null,null,null,null,null,null,null,null,null,null,null,null,null,null,null,{"$f":"IF(SUM($W$15:$W$32)>0,1,0)","v":0}]
[null,null,"Emergency Management",null,null,null,null,null,null,null,null,null,null,null,null,null,null,null,null,null,null,null,{"$f":"$D$15","v":0}]
[null,null,"Homeland Security",null,null,null,null,null,null,null,null,null,null,null,null,null,null,null,null,null,null,null,{"$f":"$D$16","v":0}]
[null,null,"Fusion Center",null,null,null,null,null,null,null,null,null,null,null,null,null,null,null,null,null,null,null,{"$f":"$D$17","v":0}]
[null,null,"Law Enforcement/Public Safety",null,null,null,null,null,null,null,null,null,null,null,null,null,null,null,null,null,null,null,{"$f":"$D$18","v":0}]
[null,null,"Fire/EMS",null,null,null,null,null,null,null,null,null,null,null,null,null,null,null,null,null,null,null,{"$f":"$D$19","v":0}]
[null,null,"Public Health",null,null,null,null,null,null,null,null,null,null,null,null,null,null,null,null,null,null,null,{"$f":"$D$20","v":0}]
[null,null,"Historic/Cultural Resources",null,null,null,null,null,null,null,null,null,null,null,null,null,null,null,null,null,null,null,{"$f":"$D$21","v":0}]
[null,null,"Environment",null,null,null,null,null,null,null,null,null,null,null,null,null,null,null,null,null,null,null,{"$f":"$D$22","v":0}]
[null,null,"Transportation",null,null,null,null,null,null,null,null,null,null,null,null,null,null,null,null,null,null,null,{"$f":"$D$23","v":0}]
[null,null,"Agriculture",null,null,null,null,null,null,null,null,null,null,null,null,null,null,null,null,null,null,null,{"$f":"$D$24","v":0}]
[null,null,"Executive Branch",null,null,null,null,null,null,null,null,null,null,null,null,null,null,null,null,null,null,null,{"$f":"$D$25","v":0}]
[null,null,"Other (specify)",null,null,null,null,null,null,null,null,null,null,null,null,null,null,null,null,null,null,{"$f":"C26","v":"Other (specify)"},{"$f":"$D$26","v":0}]
[null,null,"Other (specify)",null,null,null,null,null,null,null,null,null,null,null,null,null,null,null,null,null,null,"Other (specify)",{"$f":"$D$27","v":0}]
[null,null,"Other (specify)",null,null,null,null,null,null,null,null,null,null,null,null,null,null,null,null,null,null,"Other (specify)",{"$f":"$D$28","v":0}]
[null,null,"Other (specify)",null,null,null,null,null,null,null,null,null,null,null,null,null,null,null,null,null,null,"Other (specify)",{"$f":"$D$29","v":0}]
[null,null,"Other (specify)",null,null,null,null,null,null,null,null,null,null,null,null,null,null,null,null,null,null,"Other (specify)",{"$f":"$D$30","v":0}]
[null,null,"Other (specify)",null,null,null,null,null,null,null,null,null,null,null,null,null,null,null,null,null,null,"Other (specify)",{"$f":"$D$31","v":0}]
[null,null,"Not Applicable",false,null,null,null,null,null,null,null,null,null,null,null,null,null,null,null,null,null,null,{"$f":"IF($D$32=TRUE,1,0)","v":0}]
[]
[null,"2.  Which of the following non-governmental stakeholders participated in the THIRA process, and how many organizations of each type participated?"]
[]
[]
[null,null,"Non-governmental organization","Number participating",null,null,null,null,null,null,null,null,null,null,null,null,null,null,null,null,null,null,{"$f":"SUM($W$38:$W$53)","v":0}]
[null,null,"American Red Cross",null,null,null,null,null,null,null,null,null,null,null,null,null,null,null,null,null,null,null,{"$f":"$D$38","v":0}]
[null,null,"Faith-based organization",null,null,null,null,null,null,null,null,null,null,null,null,null,null,null,null,null,null,null,{"$f":"$D$39","v":0}]
[null,null,"Other VOAD",null,null,null,null,null,null,null,null,null,null,null,null,null,null,null,null,null,null,null,{"$f":"$D$40","v":0}]
[null,null,"Disability or access/functional needs community",null,null,null,null,null,null,null,null,null,null,null,null,null,null,null,null,null,null,null,{"$f":"$D$41","v":0}]
[null,null,"Community advocacy group",null,null,null,null,null,null,null,null,null,null,null,null,null,null,null,null,null,null,null,{"$f":"$D$42","v":0}]
[null,null,"Education community",null,null,null,null,null,null,null,null,null,null,null,null,null,null,null,null,null,null,null,{"$f":"$D$43","v":0}]
[null,null,"Hospital/Healthcare organization",null,null,null,null,null,null,null,null,null,null,null,null,null,null,null,null,null,null,null,{"$f":"$D$44","v":0}]
[null,null,"Utilities/Public works",null,null,null,null,null,null,null,null,null,null,null,null,null,null,null,null,null,null,null,{"$f":"$D$45","v":0}]
[null,null,"Private sector/Business",null,null,null,null,null,null,null,null,null,null,null,null,null,null,null,null,null,null,null,{"$f":"$D$46","v":0}]
[null,null,"Port authority/Other port organization",null,null,null,null,null,null,null,null,null,null,null,null,null,null,null,null,null,null,null,{"$f":"$D$47","v":0}]
[null,null,"Other (specify)",null,null,null,null,null,null,null,null,null,null,null,null,null,null,null,null,null,null,{"$f":"C48","v":"Other (specify)"},{"$f":"$D$48","v":0}]
[null,null,"Other (specify)",null,null,null,null,null,null,null,null,null,null,null,null,null,null,null,null,null,null,{"$f":"C49","v":"Other (specify)"},{"$f":"$D$49","v":0}]
[null,null,"Other (specify)",null,null,null,null,null,null,null,null,null,null,null,null,null,null,null,null,null,null,{"$f":"C50","v":"Other (specify)"},{"$f":"$D$50","v":0}]
[null,null,"Other (specify)",null,null,null,null,null,null,null,null,null,null,null,null,null,null,null,null,null,null,{"$f":"C51","v":"Other (specify)"},{"$f":"$D$51","v":0}]
[null,null,"Other (specify)",null,null,null,null,null,null,null,null,null,null,null,null,null,null,null,null,null,null,{"$f":"C52","v":"Other (specify)"},{"$f":"$D$52","v":0}]
[null,null,"Not Applicable",false,null,null,null,null,null,null,null,null,null,null,null,null,null,null,null,null,null,null,{"$f":"IF($D$53=TRUE,1,0)","v":0}]
[]
[]
[null,"3.  In addition to your jurisdiction, which of the following other governmental  entities participated in the THIRA process, and how many organizations of each type participated?"]
[]
[]
[null,null,"Level of government","Number participating",null,null,null,null,null,null,null,null,null,null,null,null,null,null,null,null,null,null,{"$f":"SUM($W$60:$W$69)","v":0}]
[null,null,"Federal government",null,null,null,null,null,null,null,null,null,null,null,null,null,null,null,null,null,null,null,{"$f":"$D$60","v":0}]
[null,null,"State/Territory",null,null,null,null,null,null,null,null,null,null,null,null,null,null,null,null,null,null,null,{"$f":"$D$61","v":0}]
[null,null,"County",null,null,null,null,null,null,null,null,null,null,null,null,null,null,null,null,null,null,null,{"$f":"$D$62","v":0}]
[null,null,"UASI",null,null,null,null,null,null,null,null,null,null,null,null,null,null,null,null,null,null,null,{"$f":"$D$63","v":0}]
[null,null,"Other city",null,null,null,null,null,null,null,null,null,null,null,null,null,null,null,null,null,null,null,{"$f":"$D$64","v":0}]
[null,null,"Tribe",null,null,null,null,null,null,null,null,null,null,null,null,null,null,null,null,null,null,null,{"$f":"$D$65","v":0}]
[null,null,"Other (specify)",null,null,null,null,null,null,null,null,null,null,null,null,null,null,null,null,null,null,{"$f":"C66","v":"Other (specify)"},{"$f":"$D$66","v":0}]
[null,null,"Other (specify)",null,null,null,null,null,null,null,null,null,null,null,null,null,null,null,null,null,null,{"$f":"C67","v":"Other (specify)"},{"$f":"$D$67","v":0}]
[null,null,"Other (specify)",null,null,null,null,null,null,null,null,null,null,null,null,null,null,null,null,null,null,{"$f":"C68","v":"Other (specify)"},{"$f":"$D$68","v":0}]
[null,null,"Not Applicable",false,null,null,null,null,null,null,null,null,null,null,null,null,null,null,null,null,null,{"$f":"C69","v":"Not Applicable"},{"$f":"IF($D$69=TRUE,1,0)","v":0}]
[]
[]
[null,"4.  (Optional)  List the individual departments/agencies, non-governmental organizations, and jurisdictions that participated in the THIRA process."]
[]
[]
[]
[]
[]
[]
[]
[]
[]
[]
[]
[]
[]
[]
[]
[]
[]
[]
[]
[]
[]
[]
[]
[]
[]
[]
[]
[]
[]
[]
[null,"5.  What data sources were used to inform your THIRA?"]
[]
[null,null,null,null,null,null,null,null,null,null,null,null,null,null,null,null,null,null,null,null,null,{"$f":"IF($C$105 = \"\",0,1)","v":0}]
[]
[]
[]
[]
[]
[]
[]
[]
[]
[]
[]
[]
[]
[]
[]
[]
[]
[]
[null,"6.  What limitations, if any, did you find in the data to support the development of the THIRA? "]
[]
[null,null,null,null,null,null,null,null,null,null,null,null,null,null,null,null,null,null,null,null,null,{"$f":"IF($C$126 = \"\",0,1)","v":0}]
[]
[]
[]
[]
[]
[]
[]
[]
[]
[]
[]
[]
[]
[]
[]
[]
[]
[]
[null,"7.  What modeling or visualization tools were used to inform the THIRA? "]
[null,null,null,null,null,null,null,null,null,null,null,null,null,null,null,null,null,null,null,null,null,{"$f":"COUNTIF($V$147:$V$157,\"=TRUE\")","v":0}]
[null,null,null,null,null,null,null,null,null,null,null,null,null,null,null,null,null,null,null,null,null,false]
[null,null,null,null,null,null,null,null,null,null,null,null,null,null,null,null,null,null,null,null,null,false]
[null,null,null,null,null,null,null,null,null,null,null,null,null,null,null,null,null,null,null,null,null,false]
[null,null,null,null,null,null,null,null,null,null,null,null,null,null,null,null,null,null,null,null,null,false]
[null,null,null,null,null,null,null,null,null,null,null,null,null,null,null,null,null,null,null,null,null,false]
[null,null,null,null,null,null,null,null,null,null,null,null,null,null,null,null,null,null,null,null,null,false]
[null,null,null,null,null,null,null,null,null,null,null,null,null,null,null,null,null,null,null,null,null,false]
[null,null,null,null,null,null,null,null,null,null,null,null,null,null,null,null,null,null,null,null,null,false]
[null,null,null,null,null,null,null,null,null,null,null,null,null,null,null,null,null,null,null,null,null,false]
[null,null,null,null,null,null,null,null,null,null,null,null,null,null,null,null,null,null,null,null,null,false]
[null,null,null,null,null,null,null,null,null,null,null,null,null,null,null,null,null,null,null,null,null,false]

{"sheet":"SPR Post-Assessment","index":68,"n_rows":186,"n_cols":23,"rows_kept":186,"cut":false,"hidden":false,"merged":[[172,1,172,6],[174,2,180,5],[183,1,183,6],[185,2,193,5],[137,1,137,6],[102,1,102,6],[71,1,71,6],[73,2,99,5],[10,1,10,6],[33,1,34,6],[55,1,55,6]]}
[null,null,null,null,null,null,null,null,null,null,null,null,null,null,null,null,null,null,null,null,null,{"$f":"AND(W14>0,W37>0,W59>0,V140>0,W103 = 3,W138=3, W175 = 1, W186 = 1)","v":false}]
[]
[]
[]
[]
[]
[]
[]
[]
[]
[null,"1.  Which of the following types of governmental departments and agencies participated in the SPR process, and how many departments/agencies of each type participated?"]
[]
[]
[null,null,"Department/Agency","Number Participating",null,null,null,null,null,null,null,null,null,null,null,null,null,null,null,null,null,null,{"$f":"IF(SUM($W$15:$W$32)>0,1,0)","v":0}]
[null,null,"Emergency Management",null,null,null,null,null,null,null,null,null,null,null,null,null,null,null,null,null,null,null,{"$f":"$D$15","v":0}]
[null,null,"Homeland Security",null,null,null,null,null,null,null,null,null,null,null,null,null,null,null,null,null,null,null,{"$f":"$D$16","v":0}]
[null,null,"Fusion Center",null,null,null,null,null,null,null,null,null,null,null,null,null,null,null,null,null,null,null,{"$f":"$D$17","v":0}]
[null,null,"Law Enforcement/Public Safety",null,null,null,null,null,null,null,null,null,null,null,null,null,null,null,null,null,null,null,{"$f":"$D$18","v":0}]
[null,null,"Fire/EMS",null,null,null,null,null,null,null,null,null,null,null,null,null,null,null,null,null,null,null,{"$f":"$D$19","v":0}]
[null,null,"Public Health",null,null,null,null,null,null,null,null,null,null,null,null,null,null,null,null,null,null,null,{"$f":"$D$20","v":0}]
[null,null,"Historic/Cultural Resources",null,null,null,null,null,null,null,null,null,null,null,null,null,null,null,null,null,null,null,{"$f":"$D$21","v":0}]
[null,null,"Environment",null,null,null,null,null,null,null,null,null,null,null,null,null,null,null,null,null,null,null,{"$f":"$D$22","v":0}]
[null,null,"Transportation",null,null,null,null,null,null,null,null,null,null,null,null,null,null,null,null,null,null,null,{"$f":"$D$23","v":0}]
[null,null,"Agriculture",null,null,null,null,null,null,null,null,null,null,null,null,null,null,null,null,null,null,null,{"$f":"$D$24","v":0}]
[null,null,"Executive Branch",null,null,null,null,null,null,null,null,null,null,null,null,null,null,null,null,null,null,null,{"$f":"$D$25","v":0}]
[null,null,"Other (specify)",null,null,null,null,null,null,null,null,null,null,null,null,null,null,null,null,null,null,{"$f":"C26","v":"Other (specify)"},{"$f":"$D$26","v":0}]
[null,null,"Other (specify)",null,null,null,null,null,null,null,null,null,null,null,null,null,null,null,null,null,null,"Other (specify)",{"$f":"$D$27","v":0}]
[null,null,"Other (specify)",null,null,null,null,null,null,null,null,null,null,null,null,null,null,null,null,null,null,"Other (specify)",{"$f":"$D$28","v":0}]
[null,null,"Other (specify)",null,null,null,null,null,null,null,null,null,null,null,null,null,null,null,null,null,null,"Other (specify)",{"$f":"$D$29","v":0}]
[null,null,"Other (specify)",null,null,null,null,null,null,null,null,null,null,null,null,null,null,null,null,null,null,"Other (specify)",{"$f":"$D$30","v":0}]
[null,null,"Other (specify)",null,null,null,null,null,null,null,null,null,null,null,null,null,null,null,null,null,null,"Other (specify)",{"$f":"$D$31","v":0}]
[null,null,"Not Applicable",false,null,null,null,null,null,null,null,null,null,null,null,null,null,null,null,null,null,null,{"$f":"IF($D$32=TRUE,1,0)","v":0}]
[]
[null,"2.  Which of the following non-governmental stakeholders participated in the SPR process, and how many organizations of each type participated?"]
[]
[]
[null,null,"Non-governmental organization","Number participating",null,null,null,null,null,null,null,null,null,null,null,null,null,null,null,null,null,null,{"$f":"SUM($W$38:$W$53)","v":0}]
[null,null,"American Red Cross",null,null,null,null,null,null,null,null,null,null,null,null,null,null,null,null,null,null,null,{"$f":"$D$38","v":0}]
[null,null,"Faith-based organization",null,null,null,null,null,null,null,null,null,null,null,null,null,null,null,null,null,null,null,{"$f":"$D$39","v":0}]
[null,null,"Other VOAD",null,null,null,null,null,null,null,null,null,null,null,null,null,null,null,null,null,null,null,{"$f":"$D$40","v":0}]
[null,null,"Disability or access/functional needs community",null,null,null,null,null,null,null,null,null,null,null,null,null,null,null,null,null,null,null,{"$f":"$D$41","v":0}]
[null,null,"Community advocacy group",null,null,null,null,null,null,null,null,null,null,null,null,null,null,null,null,null,null,null,{"$f":"$D$42","v":0}]
[null,null,"Education community",null,null,null,null,null,null,null,null,null,null,null,null,null,null,null,null,null,null,null,{"$f":"$D$43","v":0}]
[null,null,"Hospital/Healthcare organization",null,null,null,null,null,null,null,null,null,null,null,null,null,null,null,null,null,null,null,{"$f":"$D$44","v":0}]
[null,null,"Utilities/Public works",null,null,null,null,null,null,null,null,null,null,null,null,null,null,null,null,null,null,null,{"$f":"$D$45","v":0}]
[null,null,"Private sector/Business",null,null,null,null,null,null,null,null,null,null,null,null,null,null,null,null,null,null,null,{"$f":"$D$46","v":0}]
[null,null,"Port authority/Other port organization",null,null,null,null,null,null,null,null,null,null,null,null,null,null,null,null,null,null,null,{"$f":"$D$47","v":0}]
[null,null,"Other (specify)",null,null,null,null,null,null,null,null,null,null,null,null,null,null,null,null,null,null,{"$f":"C48","v":"Other (specify)"},{"$f":"$D$48","v":0}]
[null,null,"Other (specify)",null,null,null,null,null,null,null,null,null,null,null,null,null,null,null,null,null,null,{"$f":"C49","v":"Other (specify)"},{"$f":"$D$49","v":0}]
[null,null,"Other (specify)",null,null,null,null,null,null,null,null,null,null,null,null,null,null,null,null,null,null,{"$f":"C50","v":"Other (specify)"},{"$f":"$D$50","v":0}]
[null,null,"Other (specify)",null,null,null,null,null,null,null,null,null,null,null,null,null,null,null,null,null,null,{"$f":"C51","v":"Other (specify)"},{"$f":"$D$51","v":0}]
[null,null,"Other (specify)",null,null,null,null,null,null,null,null,null,null,null,null,null,null,null,null,null,null,{"$f":"C52","v":"Other (specify)"},{"$f":"$D$52","v":0}]
[null,null,"Not Applicable",false,null,null,null,null,null,null,null,null,null,null,null,null,null,null,null,null,null,null,{"$f":"IF($D$53=TRUE,1,0)","v":0}]
[]
[]
[null,"3.  In addition to your jurisdiction, which of the following other governmental  entities participated in the SPR process, and how many organizations of each type participated?"]
[]
[]
[null,null,"Non-governmental organization","Number participating",null,null,null,null,null,null,null,null,null,null,null,null,null,null,null,null,null,null,{"$f":"SUM($W$60:$W$69)","v":0}]
[null,null,"Federal government",null,null,null,null,null,null,null,null,null,null,null,null,null,null,null,null,null,null,null,{"$f":"$D$60","v":0}]
[null,null,"State/Territory",null,null,null,null,null,null,null,null,null,null,null,null,null,null,null,null,null,null,null,{"$f":"$D$61","v":0}]
[null,null,"County",null,null,null,null,null,null,null,null,null,null,null,null,null,null,null,null,null,null,null,{"$f":"$D$62","v":0}]
[null,null,"UASI",null,null,null,null,null,null,null,null,null,null,null,null,null,null,null,null,null,null,null,{"$f":"$D$63","v":0}]
[null,null,"Other city",null,null,null,null,null,null,null,null,null,null,null,null,null,null,null,null,null,null,null,{"$f":"$D$64","v":0}]
[null,null,"Tribe",null,null,null,null,null,null,null,null,null,null,null,null,null,null,null,null,null,null,null,{"$f":"$D$65","v":0}]
[null,null,"Other (specify)",null,null,null,null,null,null,null,null,null,null,null,null,null,null,null,null,null,null,{"$f":"C66","v":"Other (specify)"},{"$f":"$D$66","v":0}]
[null,null,"Other (specify)",null,null,null,null,null,null,null,null,null,null,null,null,null,null,null,null,null,null,{"$f":"C67","v":"Other (specify)"},{"$f":"$D$67","v":0}]
[null,null,"Other (specify)",null,null,null,null,null,null,null,null,null,null,null,null,null,null,null,null,null,null,{"$f":"C68","v":"Other (specify)"},{"$f":"$D$68","v":0}]
[null,null,"Not Applicable",false,null,null,null,null,null,null,null,null,null,null,null,null,null,null,null,null,null,{"$f":"C69","v":"Not Applicable"},{"$f":"IF($D$69=TRUE,1,0)","v":0}]
[]
[]
[null,"4.  (Optional)  List the individual departments/agencies, non-governmental organizations, and jurisdictions that participated in the SPR process."]
[]
[]
[]
[]
[]
[]
[]
[]
[]
[]
[]
[]
[]
[]
[]
[]
[]
[]
[]
[]
[]
[]
[]
[]
[]
[]
[]
[]
[]
[]
[null,"5.  Over the past year, in which three core capabilities has your jurisdiction made the most progress? (Select three)",null,null,null,null,null,null,null,null,null,null,null,null,null,null,null,null,null,null,null,null,{"$f":"COUNTIF($W$105:$W$135,\"=true\")","v":0}]
[]
[null,null,null,null,null,null,null,null,null,null,null,null,null,null,null,null,null,null,null,null,null,null,false]
[null,null,null,null,null,null,null,null,null,null,null,null,null,null,null,null,null,null,null,null,null,null,false]
[null,null,null,null,null,null,null,null,null,null,null,null,null,null,null,null,null,null,null,null,null,null,false]
[null,null,null,null,null,null,null,null,null,null,null,null,null,null,null,null,null,null,null,null,null,null,false]
[null,null,null,null,null,null,null,null,null,null,null,null,null,null,null,null,null,null,null,null,null,null,false]
[null,null,null,null,null,null,null,null,null,null,null,null,null,null,null,null,null,null,null,null,null,null,false]
[null,null,null,null,null,null,null,null,null,null,null,null,null,null,null,null,null,null,null,null,null,null,false]
[null,null,null,null,null,null,null,null,null,null,null,null,null,null,null,null,null,null,null,null,null,null,false]
[null,null,null,null,null,null,null,null,null,null,null,null,null,null,null,null,null,null,null,null,null,null,false]
[null,null,null,null,null,null,null,null,null,null,null,null,null,null,null,null,null,null,null,null,null,null,false]
[null,null,null,null,null,null,null,null,null,null,null,null,null,null,null,null,null,null,null,null,null,null,false]
[null,null,null,null,null,null,null,null,null,null,null,null,null,null,null,null,null,null,null,null,null,null,false]
[null,null,null,null,null,null,null,null,null,null,null,null,null,null,null,null,null,null,null,null,null,null,false]
[null,null,null,null,null,null,null,null,null,null,null,null,null,null,null,null,null,null,null,null,null,null,false]
[null,null,null,null,null,null,null,null,null,null,null,null,null,null,null,null,null,null,null,null,null,null,false]
[null,null,null,null,null,null,null,null,null,null,null,null,null,null,null,null,null,null,null,null,null,null,false]
[null,null,null,null,null,null,null,null,null,null,null,null,null,null,null,null,null,null,null,null,null,null,false]
[null,null,null,null,null,null,null,null,null,null,null,null,null,null,null,null,null,null,null,null,null,null,false]
[null,null,null,null,null,null,null,null,null,null,null,null,null,null,null,null,null,null,null,null,null,null,false]
[null,null,null,null,null,null,null,null,null,null,null,null,null,null,null,null,null,null,null,null,null,null,false]
[null,null,null,null,null,null,null,null,null,null,null,null,null,null,null,null,null,null,null,null,null,null,false]
[null,null,null,null,null,null,null,null,null,null,null,null,null,null,null,null,null,null,null,null,null,null,false]
[null,null,null,null,null,null,null,null,null,null,null,null,null,null,null,null,null,null,null,null,null,null,false]
[null,null,null,null,null,null,null,null,null,null,null,null,null,null,null,null,null,null,null,null,null,null,false]
[null,null,null,null,null,null,null,null,null,null,null,null,null,null,null,null,null,null,null,null,null,null,false]
[null,null,null,null,null,null,null,null,null,null,null,null,null,null,null,null,null,null,null,null,null,null,false]
[null,null,null,null,null,null,null,null,null,null,null,null,null,null,null,null,null,null,null,null,null,null,false]
[null,null,null,null,null,null,null,null,null,null,null,null,null,null,null,null,null,null,null,null,null,null,false]
[null,null,null,null,null,null,null,null,null,null,null,null,null,null,null,null,null,null,null,null,null,null,false]
[null,null,null,null,null,null,null,null,null,null,null,null,null,null,null,null,null,null,null,null,null,null,false]
[null,null,null,null,null,null,null,null,null,null,null,null,null,null,null,null,null,null,null,null,null,null,false]
[]
[]
[null,"6.  In which three core capabilities are your community's capability levels in greatest danger of decreasing?  (Select three)",null,null,null,null,null,null,null,null,null,null,null,null,null,null,null,null,null,null,null,null,{"$f":"COUNTIF($W$140:$W$170,\"=true\")","v":0}]
[]
[null,null,null,null,null,null,null,null,null,null,null,null,null,null,null,null,null,null,null,null,null,null,false]
[null,null,null,null,null,null,null,null,null,null,null,null,null,null,null,null,null,null,null,null,null,null,false]
[null,null,null,null,null,null,null,null,null,null,null,null,null,null,null,null,null,null,null,null,null,null,false]
[null,null,null,null,null,null,null,null,null,null,null,null,null,null,null,null,null,null,null,null,null,null,false]
[null,null,null,null,null,null,null,null,null,null,null,null,null,null,null,null,null,null,null,null,null,null,false]
[null,null,null,null,null,null,null,null,null,null,null,null,null,null,null,null,null,null,null,null,null,null,false]
[null,null,null,null,null,null,null,null,null,null,null,null,null,null,null,null,null,null,null,null,null,null,false]
[null,null,null,null,null,null,null,null,null,null,null,null,null,null,null,null,null,null,null,null,null,null,false]
[null,null,null,null,null,null,null,null,null,null,null,null,null,null,null,null,null,null,null,null,null,null,false]
[null,null,null,null,null,null,null,null,null,null,null,null,null,null,null,null,null,null,null,null,null,null,false]
[null,null,null,null,null,null,null,null,null,null,null,null,null,null,null,null,null,null,null,null,null,null,false]
[null,null,null,null,null,null,null,null,null,null,null,null,null,null,null,null,null,null,null,null,null,null,false]
[null,null,null,null,null,null,null,null,null,null,null,null,null,null,null,null,null,null,null,null,null,null,false]
[null,null,null,null,null,null,null,null,null,null,null,null,null,null,null,null,null,null,null,null,null,null,false]
[null,null,null,null,null,null,null,null,null,null,null,null,null,null,null,null,null,null,null,null,null,null,false]
[null,null,null,null,null,null,null,null,null,null,null,null,null,null,null,null,null,null,null,null,null,null,false]
[null,null,null,null,null,null,null,null,null,null,null,null,null,null,null,null,null,null,null,null,null,null,false]
[null,null,null,null,null,null,null,null,null,null,null,null,null,null,null,null,null,null,null,null,null,null,false]
[null,null,null,null,null,null,null,null,null,null,null,null,null,null,null,null,null,null,null,null,null,null,false]
[null,null,null,null,null,null,null,null,null,null,null,null,null,null,null,null,null,null,null,null,null,null,false]
[null,null,null,null,null,null,null,null,null,null,null,null,null,null,null,null,null,null,null,null,null,null,false]
[null,null,null,null,null,null,null,null,null,null,null,null,null,null,null,null,null,null,null,null,null,null,false]
[null,null,null,null,null,null,null,null,null,null,null,null,null,null,null,null,null,null,null,null,null,null,false]
[null,null,null,null,null,null,null,null,null,null,null,null,null,null,null,null,null,null,null,null,null,null,false]
[null,null,null,null,null,null,null,null,null,null,null,null,null,null,null,null,null,null,null,null,null,null,false]
[null,null,null,null,null,null,null,null,null,null,null,null,null,null,null,null,null,null,null,null,null,null,false]
[null,null,null,null,null,null,null,null,null,null,null,null,null,null,null,null,null,null,null,null,null,null,false]
[null,null,null,null,null,null,null,null,null,null,null,null,null,null,null,null,null,null,null,null,null,null,false]
[null,null,null,null,null,null,null,null,null,null,null,null,null,null,null,null,null,null,null,null,null,null,false]
[null,null,null,null,null,null,null,null,null,null,null,null,null,null,null,null,null,null,null,null,null,null,false]
[null,null,null,null,null,null,null,null,null,null,null,null,null,null,null,null,null,null,null,null,null,null,false]
[]
[]
[null,"7.  Please list three key training and education course requirements that will assist you in building and sustaining core capabilities identified as shortfalls."]
[]
[null,null,null,null,null,null,null,null,null,null,null,null,null,null,null,null,null,null,null,null,null,null,{"$f":"IF($C$175=\"\",0,1)","v":0}]
[]
[]
[]
[]
[]
[]
[]
[]
[null,"8.  Identify any additional recent promising practices or accomplishments  that your jurisdiction attributes to multi-jurisdictional collaboration."]
[]
[null,null,"\n",null,null,null,null,null,null,null,null,null,null,null,null,null,null,null,null,null,null,null,{"$f":"IF($C$186=\"\",0,1)","v":1}]

{"sheet":"Capability Ratings Data","index":69,"n_rows":35,"n_cols":49,"rows_kept":35,"cut":false,"hidden":false,"merged":[[2,3,2,10],[2,12,2,19]]}
[]
[]
[null,null,null,"Internal Capability Ratings",null,null,null,null,null,null,null,null,"Internal Capability Plus Mutual Aid Ratings",null,null,null,null,null,null,null,null,null,null,null,null,null,"Average",null,null,null,"Planning",null,null,null,"Organization",null,null,null,"Equipment",null,null,null,"Training",null,null,null,"Exercises"]
[null,"Core Capability",null,"Planning","Organization","Equipment","Training","Exercises",null,"Count","Average",null,"Planning","Organization","Equipment","Training","Exercises",null,"Count","Average",null,"Priority",null,"Gap Responsibility",null,null,"Core Capability","Internal Capability","Internal Capability with Mutual Aid",null,{"$f":"AA4","v":"Core Capability"},{"$f":"AB4","v":"Internal Capability"},{"$f":"AC4","v":"Internal Capability with Mutual Aid"},null,"Core Capability","Internal Capability","Internal Capability with Mutual Aid",null,"Core Capability","Internal Capability","Internal Capability with Mutual Aid",null,"Core Capability","Internal Capability","Internal Capability with Mutual Aid",null,"Core Capability","Internal Capability"]
[null,"Planning",null,{"$f":"IF(AND(INDIRECT(\"'SPR \"&Lists!P1&\"'!P14\")>1,INDIRECT(\"'SPR \"&Lists!P1&\"'!P14\")<7),INDIRECT(\"'SPR \"&Lists!P1&\"'!P14\")-1,IF(INDIRECT(\"'SPR \"&Lists!P1&\"'!P14\")=7,\"N/A\",\"\"))","v":""},{"$f":"IF(AND(INDIRECT(\"'SPR \"&Lists!P1&\"'!P18\")>1,INDIRECT(\"'SPR \"&Lists!P1&\"'!P18\")<7),INDIRECT(\"'SPR \"&Lists!P1&\"'!P18\")-1,IF(INDIRECT(\"'SPR \"&Lists!P1&\"'!P18\")=7,\"N/A\",\"\"))","v":""},{"$f":"IF(AND(INDIRECT(\"'SPR \"&Lists!P1&\"'!P21\")>1,INDIRECT(\"'SPR \"&Lists!P1&\"'!P21\")<7),INDIRECT(\"'SPR \"&Lists!P1&\"'!P21\")-1,IF(INDIRECT(\"'SPR \"&Lists!P1&\"'!P21\")=7,\"N/A\",\"\"))","v":""},{"$f":"IF(AND(INDIRECT(\"'SPR \"&Lists!P1&\"'!P24\")>1,INDIRECT(\"'SPR \"&Lists!P1&\"'!P24\")<7),INDIRECT(\"'SPR \"&Lists!P1&\"'!P24\")-1,IF(INDIRECT(\"'SPR \"&Lists!P1&\"'!P24\")=7,\"N/A\",\"\"))","v":""},{"$f":"IF(AND(INDIRECT(\"'SPR \"&Lists!P1&\"'!P28\")>1,INDIRECT(\"'SPR \"&Lists!P1&\"'!P28\")<7),INDIRECT(\"'SPR \"&Lists!P1&\"'!P28\")-1,IF(INDIRECT(\"'SPR \"&Lists!P1&\"'!P28\")=7,\"N/A\",\"\"))","v":""},null,{"$f":"COUNTIF(D5:H5,\">0\")","v":0},{"$f":"IF(J5>0,SUM(D5:H5)/J5,\"\")","v":""},null,{"$f":"IF(AND(INDIRECT(\"'SPR \"&Lists!P1&\"'!q14\")>1,INDIRECT(\"'SPR \"&Lists!P1&\"'!q14\")<7),INDIRECT(\"'SPR \"&Lists!P1&\"'!q14\")-1,IF(INDIRECT(\"'SPR \"&Lists!P1&\"'!q14\")=7,\"N/A\",\"\"))","v":""},{"$f":"IF(AND(INDIRECT(\"'SPR \"&Lists!P1&\"'!q18\")>1,INDIRECT(\"'SPR \"&Lists!P1&\"'!q18\")<7),INDIRECT(\"'SPR \"&Lists!P1&\"'!q18\")-1,IF(INDIRECT(\"'SPR \"&Lists!P1&\"'!q18\")=7,\"N/A\",\"\"))","v":""},{"$f":"IF(AND(INDIRECT(\"'SPR \"&Lists!P1&\"'!q21\")>1,INDIRECT(\"'SPR \"&Lists!P1&\"'!q21\")<7),INDIRECT(\"'SPR \"&Lists!P1&\"'!q21\")-1,IF(INDIRECT(\"'SPR \"&Lists!P1&\"'!q21\")=7,\"N/A\",\"\"))","v":""},{"$f":"IF(AND(INDIRECT(\"'SPR \"&Lists!P1&\"'!q24\")>1,INDIRECT(\"'SPR \"&Lists!P1&\"'!q24\")<7),INDIRECT(\"'SPR \"&Lists!P1&\"'!q24\")-1,IF(INDIRECT(\"'SPR \"&Lists!P1&\"'!q24\")=7,\"N/A\",\"\"))","v":""},{"$f":"IF(AND(INDIRECT(\"'SPR \"&Lists!P1&\"'!q28\")>1,INDIRECT(\"'SPR \"&Lists!P1&\"'!q28\")<7),INDIRECT(\"'SPR \"&Lists!P1&\"'!q28\")-1,IF(INDIRECT(\"'SPR \"&Lists!P1&\"'!q28\")=7,\"N/A\",\"\"))","v":""},null,{"$f":"COUNTIF(M5:Q5,\">0\")","v":0},{"$f":"IF(S5>0,SUM(M5:Q5)/S5,\"\")","v":""},null,{"$f":"IF(INDIRECT(\"'SPR \"&Lists!P1&\"'!P9\")=1,\"High\",IF(INDIRECT(\"'SPR \"&Lists!P1&\"'!P9\")=2,\"Medium\",IF(INDIRECT(\"'SPR \"&Lists!P1&\"'!P9\")=3,\"Low\",\"\")))","v":""},null,{"$f":"IF(INDIRECT(\"'SPR \"&Lists!P1&\"'!P34\")=1,\"No gap\",IF(INDIRECT(\"'SPR \"&Lists!P1&\"'!P34\")=2,\"Entirely the jurisdiction's responsibility\",IF(INDIRECT(\"'SPR \"&Lists!P1&\"'!P34\")=3,\"Mostly the jurisdiction's responsibility\",IF(INDIRECT(\"'SPR \"&Lists!P1&\"'!P34\")=4,\"Mostly higher-level government's responsibility\",IF(INDIRECT(\"'SPR \"&Lists!P1&\"'!P34\")=5,\"Entirely higher-level government's responsibility\",\"\")))))","v":""},null,null,{"$f":"B5","v":"Planning"},{"$f":"IF(K5<>\"N/A\",K5,\"\")","v":""},{"$f":"IF(OR(T5 = \"\", K5=\"\",T5=\"N/A\",K5=\"N/A\"),\"\",MAX(T5-K5,0))","v":""},null,{"$f":"AA5","v":"Planning"},{"$f":"IF(D5<>\"N/A\",D5,\"\")","v":""},{"$f":"IF(OR(D5 = \"\", M5=\"\",D5=\"N/A\",M5=\"N/A\"),\"\",MAX(M5-D5,0))","v":""},null,{"$f":"AE5","v":"Planning"},{"$f":"IF(E5<>\"N/A\",E5,\"\")","v":""},{"$f":"IF(OR(E5 = \"\", N5=\"\",N5=\"N/A\",E5=\"N/A\"),\"\",MAX(N5-E5,0))","v":""},null,{"$f":"AI5","v":"Planning"},{"$f":"IF(F5<>\"N/A\",F5,\"\")","v":""},{"$f":"IF(OR(F5 = \"\", O5=\"\",F5=\"N/A\",O5=\"N/A\"),\"\",MAX(O5-F5,0))","v":""},null,{"$f":"AM5","v":"Planning"},{"$f":"IF(G5<>\"N/A\",G5,\"\")","v":""},{"$f":"IF(OR(G5 = \"\", P5=\"\",G5=\"N/A\",P5=\"N/A\"),\"\",MAX(P5-G5,0))","v":""},null,{"$f":"AQ5","v":"Planning"},{"$f":"IF(H5<>\"N/A\",H5,\"\")","v":""},{"$f":"IF(OR(H5 = \"\", Q5=\"\",H5=\"N/A\",Q5=\"N/A\"),\"\",MAX(Q5-H5,0))","v":""}]
[null,"Public Information and Warning",null,{"$f":"IF(AND(INDIRECT(\"'SPR \"&Lists!P2&\"'!P14\")>1,INDIRECT(\"'SPR \"&Lists!P2&\"'!P14\")<7),INDIRECT(\"'SPR \"&Lists!P2&\"'!P14\")-1,IF(INDIRECT(\"'SPR \"&Lists!P2&\"'!P14\")=7,\"N/A\",\"\"))","v":""},{"$f":"IF(AND(INDIRECT(\"'SPR \"&Lists!P2&\"'!P18\")>1,INDIRECT(\"'SPR \"&Lists!P2&\"'!P18\")<7),INDIRECT(\"'SPR \"&Lists!P2&\"'!P18\")-1,IF(INDIRECT(\"'SPR \"&Lists!P2&\"'!P18\")=7,\"N/A\",\"\"))","v":""},{"$f":"IF(AND(INDIRECT(\"'SPR \"&Lists!P2&\"'!P21\")>1,INDIRECT(\"'SPR \"&Lists!P2&\"'!P21\")<7),INDIRECT(\"'SPR \"&Lists!P2&\"'!P21\")-1,IF(INDIRECT(\"'SPR \"&Lists!P2&\"'!P21\")=7,\"N/A\",\"\"))","v":""},{"$f":"IF(AND(INDIRECT(\"'SPR \"&Lists!P2&\"'!P24\")>1,INDIRECT(\"'SPR \"&Lists!P2&\"'!P24\")<7),INDIRECT(\"'SPR \"&Lists!P2&\"'!P24\")-1,IF(INDIRECT(\"'SPR \"&Lists!P2&\"'!P24\")=7,\"N/A\",\"\"))","v":""},{"$f":"IF(AND(INDIRECT(\"'SPR \"&Lists!P2&\"'!P28\")>1,INDIRECT(\"'SPR \"&Lists!P2&\"'!P28\")<7),INDIRECT(\"'SPR \"&Lists!P2&\"'!P28\")-1,IF(INDIRECT(\"'SPR \"&Lists!P2&\"'!P28\")=7,\"N/A\",\"\"))","v":""},null,{"$f":"COUNTIF(D6:H6,\">0\")","v":0},"",null,{"$f":"IF(AND(INDIRECT(\"'SPR \"&Lists!P2&\"'!q14\")>1,INDIRECT(\"'SPR \"&Lists!P2&\"'!q14\")<7),INDIRECT(\"'SPR \"&Lists!P2&\"'!q14\")-1,IF(INDIRECT(\"'SPR \"&Lists!P2&\"'!q14\")=7,\"N/A\",\"\"))","v":""},{"$f":"IF(AND(INDIRECT(\"'SPR \"&Lists!P2&\"'!q18\")>1,INDIRECT(\"'SPR \"&Lists!P2&\"'!q18\")<7),INDIRECT(\"'SPR \"&Lists!P2&\"'!q18\")-1,IF(INDIRECT(\"'SPR \"&Lists!P2&\"'!q18\")=7,\"N/A\",\"\"))","v":""},{"$f":"IF(AND(INDIRECT(\"'SPR \"&Lists!P2&\"'!q21\")>1,INDIRECT(\"'SPR \"&Lists!P2&\"'!q21\")<7),INDIRECT(\"'SPR \"&Lists!P2&\"'!q21\")-1,IF(INDIRECT(\"'SPR \"&Lists!P2&\"'!q21\")=7,\"N/A\",\"\"))","v":""},{"$f":"IF(AND(INDIRECT(\"'SPR \"&Lists!P2&\"'!q24\")>1,INDIRECT(\"'SPR \"&Lists!P2&\"'!q24\")<7),INDIRECT(\"'SPR \"&Lists!P2&\"'!q24\")-1,IF(INDIRECT(\"'SPR \"&Lists!P2&\"'!q24\")=7,\"N/A\",\"\"))","v":""},{"$f":"IF(AND(INDIRECT(\"'SPR \"&Lists!P2&\"'!q28\")>1,INDIRECT(\"'SPR \"&Lists!P2&\"'!q28\")<7),INDIRECT(\"'SPR \"&Lists!P2&\"'!q28\")-1,IF(INDIRECT(\"'SPR \"&Lists!P2&\"'!q28\")=7,\"N/A\",\"\"))","v":""},null,{"$f":"COUNTIF(M6:Q6,\">0\")","v":0},"",null,{"$f":"IF(INDIRECT(\"'SPR \"&Lists!P2&\"'!P9\")=1,\"High\",IF(INDIRECT(\"'SPR \"&Lists!P2&\"'!P9\")=2,\"Medium\",IF(INDIRECT(\"'SPR \"&Lists!P2&\"'!P9\")=3,\"Low\",\"\")))","v":""},null,{"$f":"IF(INDIRECT(\"'SPR \"&Lists!P2&\"'!P34\")=1,\"No gap\",IF(INDIRECT(\"'SPR \"&Lists!P2&\"'!P34\")=2,\"Entirely the jurisdiction's responsibility\",IF(INDIRECT(\"'SPR \"&Lists!P2&\"'!P34\")=3,\"Mostly the jurisdiction's responsibility\",IF(INDIRECT(\"'SPR \"&Lists!P2&\"'!P34\")=4,\"Mostly higher-level government's responsibility\",IF(INDIRECT(\"'SPR \"&Lists!P2&\"'!P34\")=5,\"Entirely higher-level government's responsibility\",\"\")))))","v":""},null,null,{"$f":"B6","v":"Public Information and Warning"},{"$f":"IF(K6<>\"N/A\",K6,\"\")","v":""},{"$f":"IF(OR(T6 = \"\", K6=\"\",T6=\"N/A\",K6=\"N/A\"),\"\",MAX(T6-K6,0))","v":""},null,{"$f":"AA6","v":"Public Information and Warning"},{"$f":"IF(D6<>\"N/A\",D6,\"\")","v":""},{"$f":"IF(OR(D6 = \"\", M6=\"\",D6=\"N/A\",M6=\"N/A\"),\"\",MAX(M6-D6,0))","v":""},null,{"$f":"AE6","v":"Public Information and Warning"},{"$f":"IF(E6<>\"N/A\",E6,\"\")","v":""},{"$f":"IF(OR(E6 = \"\", N6=\"\",N6=\"N/A\",E6=\"N/A\"),\"\",MAX(N6-E6,0))","v":""},null,{"$f":"AI6","v":"Public Information and Warning"},{"$f":"IF(F6<>\"N/A\",F6,\"\")","v":""},{"$f":"IF(OR(F6 = \"\", O6=\"\",F6=\"N/A\",O6=\"N/A\"),\"\",MAX(O6-F6,0))","v":""},null,{"$f":"AM6","v":"Public Information and Warning"},{"$f":"IF(G6<>\"N/A\",G6,\"\")","v":""},{"$f":"IF(OR(G6 = \"\", P6=\"\",G6=\"N/A\",P6=\"N/A\"),\"\",MAX(P6-G6,0))","v":""},null,{"$f":"AQ6","v":"Public Information and Warning"},{"$f":"IF(H6<>\"N/A\",H6,\"\")","v":""},{"$f":"IF(OR(H6 = \"\", Q6=\"\",H6=\"N/A\",Q6=\"N/A\"),\"\",MAX(Q6-H6,0))","v":""}]
[null,"Operational Coordination",null,{"$f":"IF(AND(INDIRECT(\"'SPR \"&Lists!P3&\"'!P14\")>1,INDIRECT(\"'SPR \"&Lists!P3&\"'!P14\")<7),INDIRECT(\"'SPR \"&Lists!P3&\"'!P14\")-1,IF(INDIRECT(\"'SPR \"&Lists!P3&\"'!P14\")=7,\"N/A\",\"\"))","v":""},{"$f":"IF(AND(INDIRECT(\"'SPR \"&Lists!P3&\"'!P18\")>1,INDIRECT(\"'SPR \"&Lists!P3&\"'!P18\")<7),INDIRECT(\"'SPR \"&Lists!P3&\"'!P18\")-1,IF(INDIRECT(\"'SPR \"&Lists!P3&\"'!P18\")=7,\"N/A\",\"\"))","v":""},{"$f":"IF(AND(INDIRECT(\"'SPR \"&Lists!P3&\"'!P21\")>1,INDIRECT(\"'SPR \"&Lists!P3&\"'!P21\")<7),INDIRECT(\"'SPR \"&Lists!P3&\"'!P21\")-1,IF(INDIRECT(\"'SPR \"&Lists!P3&\"'!P21\")=7,\"N/A\",\"\"))","v":""},{"$f":"IF(AND(INDIRECT(\"'SPR \"&Lists!P3&\"'!P24\")>1,INDIRECT(\"'SPR \"&Lists!P3&\"'!P24\")<7),INDIRECT(\"'SPR \"&Lists!P3&\"'!P24\")-1,IF(INDIRECT(\"'SPR \"&Lists!P3&\"'!P24\")=7,\"N/A\",\"\"))","v":""},{"$f":"IF(AND(INDIRECT(\"'SPR \"&Lists!P3&\"'!P28\")>1,INDIRECT(\"'SPR \"&Lists!P3&\"'!P28\")<7),INDIRECT(\"'SPR \"&Lists!P3&\"'!P28\")-1,IF(INDIRECT(\"'SPR \"&Lists!P3&\"'!P28\")=7,\"N/A\",\"\"))","v":""},null,0,"",null,{"$f":"IF(AND(INDIRECT(\"'SPR \"&Lists!P3&\"'!q14\")>1,INDIRECT(\"'SPR \"&Lists!P3&\"'!q14\")<7),INDIRECT(\"'SPR \"&Lists!P3&\"'!q14\")-1,IF(INDIRECT(\"'SPR \"&Lists!P3&\"'!q14\")=7,\"N/A\",\"\"))","v":""},{"$f":"IF(AND(INDIRECT(\"'SPR \"&Lists!P3&\"'!q18\")>1,INDIRECT(\"'SPR \"&Lists!P3&\"'!q18\")<7),INDIRECT(\"'SPR \"&Lists!P3&\"'!q18\")-1,IF(INDIRECT(\"'SPR \"&Lists!P3&\"'!q18\")=7,\"N/A\",\"\"))","v":""},{"$f":"IF(AND(INDIRECT(\"'SPR \"&Lists!P3&\"'!q21\")>1,INDIRECT(\"'SPR \"&Lists!P3&\"'!q21\")<7),INDIRECT(\"'SPR \"&Lists!P3&\"'!q21\")-1,IF(INDIRECT(\"'SPR \"&Lists!P3&\"'!q21\")=7,\"N/A\",\"\"))","v":""},{"$f":"IF(AND(INDIRECT(\"'SPR \"&Lists!P3&\"'!q24\")>1,INDIRECT(\"'SPR \"&Lists!P3&\"'!q24\")<7),INDIRECT(\"'SPR \"&Lists!P3&\"'!q24\")-1,IF(INDIRECT(\"'SPR \"&Lists!P3&\"'!q24\")=7,\"N/A\",\"\"))","v":""},{"$f":"IF(AND(INDIRECT(\"'SPR \"&Lists!P3&\"'!q28\")>1,INDIRECT(\"'SPR \"&Lists!P3&\"'!q28\")<7),INDIRECT(\"'SPR \"&Lists!P3&\"'!q28\")-1,IF(INDIRECT(\"'SPR \"&Lists!P3&\"'!q28\")=7,\"N/A\",\"\"))","v":""},null,0,"",null,{"$f":"IF(INDIRECT(\"'SPR \"&Lists!P3&\"'!P9\")=1,\"High\",IF(INDIRECT(\"'SPR \"&Lists!P3&\"'!P9\")=2,\"Medium\",IF(INDIRECT(\"'SPR \"&Lists!P3&\"'!P9\")=3,\"Low\",\"\")))","v":""},null,{"$f":"IF(INDIRECT(\"'SPR \"&Lists!P3&\"'!P34\")=1,\"No gap\",IF(INDIRECT(\"'SPR \"&Lists!P3&\"'!P34\")=2,\"Entirely the jurisdiction's responsibility\",IF(INDIRECT(\"'SPR \"&Lists!P3&\"'!P34\")=3,\"Mostly the jurisdiction's responsibility\",IF(INDIRECT(\"'SPR \"&Lists!P3&\"'!P34\")=4,\"Mostly higher-level government's responsibility\",IF(INDIRECT(\"'SPR \"&Lists!P3&\"'!P34\")=5,\"Entirely higher-level government's responsibility\",\"\")))))","v":""},null,null,"Operational Coordination","","",null,"Operational Coordination","","",null,"Operational Coordination","","",null,"Operational Coordination","","",null,"Operational Coordination","","",null,"Operational Coordination","",""]
[null,"Forensics and Attribution",null,{"$f":"IF(AND(INDIRECT(\"'SPR \"&Lists!P4&\"'!P14\")>1,INDIRECT(\"'SPR \"&Lists!P4&\"'!P14\")<7),INDIRECT(\"'SPR \"&Lists!P4&\"'!P14\")-1,IF(INDIRECT(\"'SPR \"&Lists!P4&\"'!P14\")=7,\"N/A\",\"\"))","v":""},{"$f":"IF(AND(INDIRECT(\"'SPR \"&Lists!P4&\"'!P18\")>1,INDIRECT(\"'SPR \"&Lists!P4&\"'!P18\")<7),INDIRECT(\"'SPR \"&Lists!P4&\"'!P18\")-1,IF(INDIRECT(\"'SPR \"&Lists!P4&\"'!P18\")=7,\"N/A\",\"\"))","v":""},{"$f":"IF(AND(INDIRECT(\"'SPR \"&Lists!P4&\"'!P21\")>1,INDIRECT(\"'SPR \"&Lists!P4&\"'!P21\")<7),INDIRECT(\"'SPR \"&Lists!P4&\"'!P21\")-1,IF(INDIRECT(\"'SPR \"&Lists!P4&\"'!P21\")=7,\"N/A\",\"\"))","v":""},{"$f":"IF(AND(INDIRECT(\"'SPR \"&Lists!P4&\"'!P24\")>1,INDIRECT(\"'SPR \"&Lists!P4&\"'!P24\")<7),INDIRECT(\"'SPR \"&Lists!P4&\"'!P24\")-1,IF(INDIRECT(\"'SPR \"&Lists!P4&\"'!P24\")=7,\"N/A\",\"\"))","v":""},{"$f":"IF(AND(INDIRECT(\"'SPR \"&Lists!P4&\"'!P28\")>1,INDIRECT(\"'SPR \"&Lists!P4&\"'!P28\")<7),INDIRECT(\"'SPR \"&Lists!P4&\"'!P28\")-1,IF(INDIRECT(\"'SPR \"&Lists!P4&\"'!P28\")=7,\"N/A\",\"\"))","v":""},null,0,"",null,{"$f":"IF(AND(INDIRECT(\"'SPR \"&Lists!P4&\"'!q14\")>1,INDIRECT(\"'SPR \"&Lists!P4&\"'!q14\")<7),INDIRECT(\"'SPR \"&Lists!P4&\"'!q14\")-1,IF(INDIRECT(\"'SPR \"&Lists!P4&\"'!q14\")=7,\"N/A\",\"\"))","v":""},{"$f":"IF(AND(INDIRECT(\"'SPR \"&Lists!P4&\"'!q18\")>1,INDIRECT(\"'SPR \"&Lists!P4&\"'!q18\")<7),INDIRECT(\"'SPR \"&Lists!P4&\"'!q18\")-1,IF(INDIRECT(\"'SPR \"&Lists!P4&\"'!q18\")=7,\"N/A\",\"\"))","v":""},{"$f":"IF(AND(INDIRECT(\"'SPR \"&Lists!P4&\"'!q21\")>1,INDIRECT(\"'SPR \"&Lists!P4&\"'!q21\")<7),INDIRECT(\"'SPR \"&Lists!P4&\"'!q21\")-1,IF(INDIRECT(\"'SPR \"&Lists!P4&\"'!q21\")=7,\"N/A\",\"\"))","v":""},{"$f":"IF(AND(INDIRECT(\"'SPR \"&Lists!P4&\"'!q24\")>1,INDIRECT(\"'SPR \"&Lists!P4&\"'!q24\")<7),INDIRECT(\"'SPR \"&Lists!P4&\"'!q24\")-1,IF(INDIRECT(\"'SPR \"&Lists!P4&\"'!q24\")=7,\"N/A\",\"\"))","v":""},{"$f":"IF(AND(INDIRECT(\"'SPR \"&Lists!P4&\"'!q28\")>1,INDIRECT(\"'SPR \"&Lists!P4&\"'!q28\")<7),INDIRECT(\"'SPR \"&Lists!P4&\"'!q28\")-1,IF(INDIRECT(\"'SPR \"&Lists!P4&\"'!q28\")=7,\"N/A\",\"\"))","v":""},null,0,"",null,{"$f":"IF(INDIRECT(\"'SPR \"&Lists!P4&\"'!P9\")=1,\"High\",IF(INDIRECT(\"'SPR \"&Lists!P4&\"'!P9\")=2,\"Medium\",IF(INDIRECT(\"'SPR \"&Lists!P4&\"'!P9\")=3,\"Low\",\"\")))","v":""},null,{"$f":"IF(INDIRECT(\"'SPR \"&Lists!P4&\"'!P34\")=1,\"No gap\",IF(INDIRECT(\"'SPR \"&Lists!P4&\"'!P34\")=2,\"Entirely the jurisdiction's responsibility\",IF(INDIRECT(\"'SPR \"&Lists!P4&\"'!P34\")=3,\"Mostly the jurisdiction's responsibility\",IF(INDIRECT(\"'SPR \"&Lists!P4&\"'!P34\")=4,\"Mostly higher-level government's responsibility\",IF(INDIRECT(\"'SPR \"&Lists!P4&\"'!P34\")=5,\"Entirely higher-level government's responsibility\",\"\")))))","v":""},null,null,"Forensics and Attribution","","",null,"Forensics and Attribution","","",null,"Forensics and Attribution","","",null,"Forensics and Attribution","","",null,"Forensics and Attribution","","",null,"Forensics and Attribution","",""]
[null,"Intelligence and Information Sharing",null,{"$f":"IF(AND(INDIRECT(\"'SPR \"&Lists!P5&\"'!P14\")>1,INDIRECT(\"'SPR \"&Lists!P5&\"'!P14\")<7),INDIRECT(\"'SPR \"&Lists!P5&\"'!P14\")-1,IF(INDIRECT(\"'SPR \"&Lists!P5&\"'!P14\")=7,\"N/A\",\"\"))","v":""},{"$f":"IF(AND(INDIRECT(\"'SPR \"&Lists!P5&\"'!P18\")>1,INDIRECT(\"'SPR \"&Lists!P5&\"'!P18\")<7),INDIRECT(\"'SPR \"&Lists!P5&\"'!P18\")-1,IF(INDIRECT(\"'SPR \"&Lists!P5&\"'!P18\")=7,\"N/A\",\"\"))","v":""},{"$f":"IF(AND(INDIRECT(\"'SPR \"&Lists!P5&\"'!P21\")>1,INDIRECT(\"'SPR \"&Lists!P5&\"'!P21\")<7),INDIRECT(\"'SPR \"&Lists!P5&\"'!P21\")-1,IF(INDIRECT(\"'SPR \"&Lists!P5&\"'!P21\")=7,\"N/A\",\"\"))","v":""},{"$f":"IF(AND(INDIRECT(\"'SPR \"&Lists!P5&\"'!P24\")>1,INDIRECT(\"'SPR \"&Lists!P5&\"'!P24\")<7),INDIRECT(\"'SPR \"&Lists!P5&\"'!P24\")-1,IF(INDIRECT(\"'SPR \"&Lists!P5&\"'!P24\")=7,\"N/A\",\"\"))","v":""},{"$f":"IF(AND(INDIRECT(\"'SPR \"&Lists!P5&\"'!P28\")>1,INDIRECT(\"'SPR \"&Lists!P5&\"'!P28\")<7),INDIRECT(\"'SPR \"&Lists!P5&\"'!P28\")-1,IF(INDIRECT(\"'SPR \"&Lists!P5&\"'!P28\")=7,\"N/A\",\"\"))","v":""},null,0,"",null,{"$f":"IF(AND(INDIRECT(\"'SPR \"&Lists!P5&\"'!q14\")>1,INDIRECT(\"'SPR \"&Lists!P5&\"'!q14\")<7),INDIRECT(\"'SPR \"&Lists!P5&\"'!q14\")-1,IF(INDIRECT(\"'SPR \"&Lists!P5&\"'!q14\")=7,\"N/A\",\"\"))","v":""},{"$f":"IF(AND(INDIRECT(\"'SPR \"&Lists!P5&\"'!q18\")>1,INDIRECT(\"'SPR \"&Lists!P5&\"'!q18\")<7),INDIRECT(\"'SPR \"&Lists!P5&\"'!q18\")-1,IF(INDIRECT(\"'SPR \"&Lists!P5&\"'!q18\")=7,\"N/A\",\"\"))","v":""},{"$f":"IF(AND(INDIRECT(\"'SPR \"&Lists!P5&\"'!q21\")>1,INDIRECT(\"'SPR \"&Lists!P5&\"'!q21\")<7),INDIRECT(\"'SPR \"&Lists!P5&\"'!q21\")-1,IF(INDIRECT(\"'SPR \"&Lists!P5&\"'!q21\")=7,\"N/A\",\"\"))","v":""},{"$f":"IF(AND(INDIRECT(\"'SPR \"&Lists!P5&\"'!q24\")>1,INDIRECT(\"'SPR \"&Lists!P5&\"'!q24\")<7),INDIRECT(\"'SPR \"&Lists!P5&\"'!q24\")-1,IF(INDIRECT(\"'SPR \"&Lists!P5&\"'!q24\")=7,\"N/A\",\"\"))","v":""},{"$f":"IF(AND(INDIRECT(\"'SPR \"&Lists!P5&\"'!q28\")>1,INDIRECT(\"'SPR \"&Lists!P5&\"'!q28\")<7),INDIRECT(\"'SPR \"&Lists!P5&\"'!q28\")-1,IF(INDIRECT(\"'SPR \"&Lists!P5&\"'!q28\")=7,\"N/A\",\"\"))","v":""},null,0,"",null,{"$f":"IF(INDIRECT(\"'SPR \"&Lists!P5&\"'!P9\")=1,\"High\",IF(INDIRECT(\"'SPR \"&Lists!P5&\"'!P9\")=2,\"Medium\",IF(INDIRECT(\"'SPR \"&Lists!P5&\"'!P9\")=3,\"Low\",\"\")))","v":""},null,{"$f":"IF(INDIRECT(\"'SPR \"&Lists!P5&\"'!P34\")=1,\"No gap\",IF(INDIRECT(\"'SPR \"&Lists!P5&\"'!P34\")=2,\"Entirely the jurisdiction's responsibility\",IF(INDIRECT(\"'SPR \"&Lists!P5&\"'!P34\")=3,\"Mostly the jurisdiction's responsibility\",IF(INDIRECT(\"'SPR \"&Lists!P5&\"'!P34\")=4,\"Mostly higher-level government's responsibility\",IF(INDIRECT(\"'SPR \"&Lists!P5&\"'!P34\")=5,\"Entirely higher-level government's responsibility\",\"\")))))","v":""},null,null,"Intelligence and Information Sharing","","",null,"Intelligence and Information Sharing","","",null,"Intelligence and Information Sharing","","",null,"Intelligence and Information Sharing","","",null,"Intelligence and Information Sharing","","",null,"Intelligence and Information Sharing","",""]
[null,"Interdiction and Disruption",null,{"$f":"IF(AND(INDIRECT(\"'SPR \"&Lists!P6&\"'!P14\")>1,INDIRECT(\"'SPR \"&Lists!P6&\"'!P14\")<7),INDIRECT(\"'SPR \"&Lists!P6&\"'!P14\")-1,IF(INDIRECT(\"'SPR \"&Lists!P6&\"'!P14\")=7,\"N/A\",\"\"))","v":""},{"$f":"IF(AND(INDIRECT(\"'SPR \"&Lists!P6&\"'!P18\")>1,INDIRECT(\"'SPR \"&Lists!P6&\"'!P18\")<7),INDIRECT(\"'SPR \"&Lists!P6&\"'!P18\")-1,IF(INDIRECT(\"'SPR \"&Lists!P6&\"'!P18\")=7,\"N/A\",\"\"))","v":""},{"$f":"IF(AND(INDIRECT(\"'SPR \"&Lists!P6&\"'!P21\")>1,INDIRECT(\"'SPR \"&Lists!P6&\"'!P21\")<7),INDIRECT(\"'SPR \"&Lists!P6&\"'!P21\")-1,IF(INDIRECT(\"'SPR \"&Lists!P6&\"'!P21\")=7,\"N/A\",\"\"))","v":""},{"$f":"IF(AND(INDIRECT(\"'SPR \"&Lists!P6&\"'!P24\")>1,INDIRECT(\"'SPR \"&Lists!P6&\"'!P24\")<7),INDIRECT(\"'SPR \"&Lists!P6&\"'!P24\")-1,IF(INDIRECT(\"'SPR \"&Lists!P6&\"'!P24\")=7,\"N/A\",\"\"))","v":""},{"$f":"IF(AND(INDIRECT(\"'SPR \"&Lists!P6&\"'!P28\")>1,INDIRECT(\"'SPR \"&Lists!P6&\"'!P28\")<7),INDIRECT(\"'SPR \"&Lists!P6&\"'!P28\")-1,IF(INDIRECT(\"'SPR \"&Lists!P6&\"'!P28\")=7,\"N/A\",\"\"))","v":""},null,0,"",null,{"$f":"IF(AND(INDIRECT(\"'SPR \"&Lists!P6&\"'!q14\")>1,INDIRECT(\"'SPR \"&Lists!P6&\"'!q14\")<7),INDIRECT(\"'SPR \"&Lists!P6&\"'!q14\")-1,IF(INDIRECT(\"'SPR \"&Lists!P6&\"'!q14\")=7,\"N/A\",\"\"))","v":""},{"$f":"IF(AND(INDIRECT(\"'SPR \"&Lists!P6&\"'!q18\")>1,INDIRECT(\"'SPR \"&Lists!P6&\"'!q18\")<7),INDIRECT(\"'SPR \"&Lists!P6&\"'!q18\")-1,IF(INDIRECT(\"'SPR \"&Lists!P6&\"'!q18\")=7,\"N/A\",\"\"))","v":""},{"$f":"IF(AND(INDIRECT(\"'SPR \"&Lists!P6&\"'!q21\")>1,INDIRECT(\"'SPR \"&Lists!P6&\"'!q21\")<7),INDIRECT(\"'SPR \"&Lists!P6&\"'!q21\")-1,IF(INDIRECT(\"'SPR \"&Lists!P6&\"'!q21\")=7,\"N/A\",\"\"))","v":""},{"$f":"IF(AND(INDIRECT(\"'SPR \"&Lists!P6&\"'!q24\")>1,INDIRECT(\"'SPR \"&Lists!P6&\"'!q24\")<7),INDIRECT(\"'SPR \"&Lists!P6&\"'!q24\")-1,IF(INDIRECT(\"'SPR \"&Lists!P6&\"'!q24\")=7,\"N/A\",\"\"))","v":""},{"$f":"IF(AND(INDIRECT(\"'SPR \"&Lists!P6&\"'!q28\")>1,INDIRECT(\"'SPR \"&Lists!P6&\"'!q28\")<7),INDIRECT(\"'SPR \"&Lists!P6&\"'!q28\")-1,IF(INDIRECT(\"'SPR \"&Lists!P6&\"'!q28\")=7,\"N/A\",\"\"))","v":""},null,0,"",null,{"$f":"IF(INDIRECT(\"'SPR \"&Lists!P6&\"'!P9\")=1,\"High\",IF(INDIRECT(\"'SPR \"&Lists!P6&\"'!P9\")=2,\"Medium\",IF(INDIRECT(\"'SPR \"&Lists!P6&\"'!P9\")=3,\"Low\",\"\")))","v":""},null,{"$f":"IF(INDIRECT(\"'SPR \"&Lists!P6&\"'!P34\")=1,\"No gap\",IF(INDIRECT(\"'SPR \"&Lists!P6&\"'!P34\")=2,\"Entirely the jurisdiction's responsibility\",IF(INDIRECT(\"'SPR \"&Lists!P6&\"'!P34\")=3,\"Mostly the jurisdiction's responsibility\",IF(INDIRECT(\"'SPR \"&Lists!P6&\"'!P34\")=4,\"Mostly higher-level government's responsibility\",IF(INDIRECT(\"'SPR \"&Lists!P6&\"'!P34\")=5,\"Entirely higher-level government's responsibility\",\"\")))))","v":""},null,null,"Interdiction and Disruption","","",null,"Interdiction and Disruption","","",null,"Interdiction and Disruption","","",null,"Interdiction and Disruption","","",null,"Interdiction and Disruption","","",null,"Interdiction and Disruption","",""]
[null,"Screening, Search, and Detection ",null,{"$f":"IF(AND(INDIRECT(\"'SPR \"&Lists!P7&\"'!P14\")>1,INDIRECT(\"'SPR \"&Lists!P7&\"'!P14\")<7),INDIRECT(\"'SPR \"&Lists!P7&\"'!P14\")-1,IF(INDIRECT(\"'SPR \"&Lists!P7&\"'!P14\")=7,\"N/A\",\"\"))","v":""},{"$f":"IF(AND(INDIRECT(\"'SPR \"&Lists!P7&\"'!P18\")>1,INDIRECT(\"'SPR \"&Lists!P7&\"'!P18\")<7),INDIRECT(\"'SPR \"&Lists!P7&\"'!P18\")-1,IF(INDIRECT(\"'SPR \"&Lists!P7&\"'!P18\")=7,\"N/A\",\"\"))","v":""},{"$f":"IF(AND(INDIRECT(\"'SPR \"&Lists!P7&\"'!P21\")>1,INDIRECT(\"'SPR \"&Lists!P7&\"'!P21\")<7),INDIRECT(\"'SPR \"&Lists!P7&\"'!P21\")-1,IF(INDIRECT(\"'SPR \"&Lists!P7&\"'!P21\")=7,\"N/A\",\"\"))","v":""},{"$f":"IF(AND(INDIRECT(\"'SPR \"&Lists!P7&\"'!P24\")>1,INDIRECT(\"'SPR \"&Lists!P7&\"'!P24\")<7),INDIRECT(\"'SPR \"&Lists!P7&\"'!P24\")-1,IF(INDIRECT(\"'SPR \"&Lists!P7&\"'!P24\")=7,\"N/A\",\"\"))","v":""},{"$f":"IF(AND(INDIRECT(\"'SPR \"&Lists!P7&\"'!P28\")>1,INDIRECT(\"'SPR \"&Lists!P7&\"'!P28\")<7),INDIRECT(\"'SPR \"&Lists!P7&\"'!P28\")-1,IF(INDIRECT(\"'SPR \"&Lists!P7&\"'!P28\")=7,\"N/A\",\"\"))","v":""},null,0,"",null,{"$f":"IF(AND(INDIRECT(\"'SPR \"&Lists!P7&\"'!q14\")>1,INDIRECT(\"'SPR \"&Lists!P7&\"'!q14\")<7),INDIRECT(\"'SPR \"&Lists!P7&\"'!q14\")-1,IF(INDIRECT(\"'SPR \"&Lists!P7&\"'!q14\")=7,\"N/A\",\"\"))","v":""},{"$f":"IF(AND(INDIRECT(\"'SPR \"&Lists!P7&\"'!q18\")>1,INDIRECT(\"'SPR \"&Lists!P7&\"'!q18\")<7),INDIRECT(\"'SPR \"&Lists!P7&\"'!q18\")-1,IF(INDIRECT(\"'SPR \"&Lists!P7&\"'!q18\")=7,\"N/A\",\"\"))","v":""},{"$f":"IF(AND(INDIRECT(\"'SPR \"&Lists!P7&\"'!q21\")>1,INDIRECT(\"'SPR \"&Lists!P7&\"'!q21\")<7),INDIRECT(\"'SPR \"&Lists!P7&\"'!q21\")-1,IF(INDIRECT(\"'SPR \"&Lists!P7&\"'!q21\")=7,\"N/A\",\"\"))","v":""},{"$f":"IF(AND(INDIRECT(\"'SPR \"&Lists!P7&\"'!q24\")>1,INDIRECT(\"'SPR \"&Lists!P7&\"'!q24\")<7),INDIRECT(\"'SPR \"&Lists!P7&\"'!q24\")-1,IF(INDIRECT(\"'SPR \"&Lists!P7&\"'!q24\")=7,\"N/A\",\"\"))","v":""},{"$f":"IF(AND(INDIRECT(\"'SPR \"&Lists!P7&\"'!q28\")>1,INDIRECT(\"'SPR \"&Lists!P7&\"'!q28\")<7),INDIRECT(\"'SPR \"&Lists!P7&\"'!q28\")-1,IF(INDIRECT(\"'SPR \"&Lists!P7&\"'!q28\")=7,\"N/A\",\"\"))","v":""},null,0,"",null,{"$f":"IF(INDIRECT(\"'SPR \"&Lists!P7&\"'!P9\")=1,\"High\",IF(INDIRECT(\"'SPR \"&Lists!P7&\"'!P9\")=2,\"Medium\",IF(INDIRECT(\"'SPR \"&Lists!P7&\"'!P9\")=3,\"Low\",\"\")))","v":""},null,{"$f":"IF(INDIRECT(\"'SPR \"&Lists!P7&\"'!P34\")=1,\"No gap\",IF(INDIRECT(\"'SPR \"&Lists!P7&\"'!P34\")=2,\"Entirely the jurisdiction's responsibility\",IF(INDIRECT(\"'SPR \"&Lists!P7&\"'!P34\")=3,\"Mostly the jurisdiction's responsibility\",IF(INDIRECT(\"'SPR \"&Lists!P7&\"'!P34\")=4,\"Mostly higher-level government's responsibility\",IF(INDIRECT(\"'SPR \"&Lists!P7&\"'!P34\")=5,\"Entirely higher-level government's responsibility\",\"\")))))","v":""},null,null,"Screening, Search, and Detection ","","",null,"Screening, Search, and Detection ","","",null,"Screening, Search, and Detection ","","",null,"Screening, Search, and Detection ","","",null,"Screening, Search, and Detection ","","",null,"Screening, Search, and Detection ","",""]
[null,"Access Control and Identity Verification",null,{"$f":"IF(AND(INDIRECT(\"'SPR \"&Lists!P8&\"'!P14\")>1,INDIRECT(\"'SPR \"&Lists!P8&\"'!P14\")<7),INDIRECT(\"'SPR \"&Lists!P8&\"'!P14\")-1,IF(INDIRECT(\"'SPR \"&Lists!P8&\"'!P14\")=7,\"N/A\",\"\"))","v":""},{"$f":"IF(AND(INDIRECT(\"'SPR \"&Lists!P8&\"'!P18\")>1,INDIRECT(\"'SPR \"&Lists!P8&\"'!P18\")<7),INDIRECT(\"'SPR \"&Lists!P8&\"'!P18\")-1,IF(INDIRECT(\"'SPR \"&Lists!P8&\"'!P18\")=7,\"N/A\",\"\"))","v":""},{"$f":"IF(AND(INDIRECT(\"'SPR \"&Lists!P8&\"'!P21\")>1,INDIRECT(\"'SPR \"&Lists!P8&\"'!P21\")<7),INDIRECT(\"'SPR \"&Lists!P8&\"'!P21\")-1,IF(INDIRECT(\"'SPR \"&Lists!P8&\"'!P21\")=7,\"N/A\",\"\"))","v":""},{"$f":"IF(AND(INDIRECT(\"'SPR \"&Lists!P8&\"'!P24\")>1,INDIRECT(\"'SPR \"&Lists!P8&\"'!P24\")<7),INDIRECT(\"'SPR \"&Lists!P8&\"'!P24\")-1,IF(INDIRECT(\"'SPR \"&Lists!P8&\"'!P24\")=7,\"N/A\",\"\"))","v":""},{"$f":"IF(AND(INDIRECT(\"'SPR \"&Lists!P8&\"'!P28\")>1,INDIRECT(\"'SPR \"&Lists!P8&\"'!P28\")<7),INDIRECT(\"'SPR \"&Lists!P8&\"'!P28\")-1,IF(INDIRECT(\"'SPR \"&Lists!P8&\"'!P28\")=7,\"N/A\",\"\"))","v":""},null,0,"",null,{"$f":"IF(AND(INDIRECT(\"'SPR \"&Lists!P8&\"'!q14\")>1,INDIRECT(\"'SPR \"&Lists!P8&\"'!q14\")<7),INDIRECT(\"'SPR \"&Lists!P8&\"'!q14\")-1,IF(INDIRECT(\"'SPR \"&Lists!P8&\"'!q14\")=7,\"N/A\",\"\"))","v":""},{"$f":"IF(AND(INDIRECT(\"'SPR \"&Lists!P8&\"'!q18\")>1,INDIRECT(\"'SPR \"&Lists!P8&\"'!q18\")<7),INDIRECT(\"'SPR \"&Lists!P8&\"'!q18\")-1,IF(INDIRECT(\"'SPR \"&Lists!P8&\"'!q18\")=7,\"N/A\",\"\"))","v":""},{"$f":"IF(AND(INDIRECT(\"'SPR \"&Lists!P8&\"'!q21\")>1,INDIRECT(\"'SPR \"&Lists!P8&\"'!q21\")<7),INDIRECT(\"'SPR \"&Lists!P8&\"'!q21\")-1,IF(INDIRECT(\"'SPR \"&Lists!P8&\"'!q21\")=7,\"N/A\",\"\"))","v":""},{"$f":"IF(AND(INDIRECT(\"'SPR \"&Lists!P8&\"'!q24\")>1,INDIRECT(\"'SPR \"&Lists!P8&\"'!q24\")<7),INDIRECT(\"'SPR \"&Lists!P8&\"'!q24\")-1,IF(INDIRECT(\"'SPR \"&Lists!P8&\"'!q24\")=7,\"N/A\",\"\"))","v":""},{"$f":"IF(AND(INDIRECT(\"'SPR \"&Lists!P8&\"'!q28\")>1,INDIRECT(\"'SPR \"&Lists!P8&\"'!q28\")<7),INDIRECT(\"'SPR \"&Lists!P8&\"'!q28\")-1,IF(INDIRECT(\"'SPR \"&Lists!P8&\"'!q28\")=7,\"N/A\",\"\"))","v":""},null,0,"",null,{"$f":"IF(INDIRECT(\"'SPR \"&Lists!P8&\"'!P9\")=1,\"High\",IF(INDIRECT(\"'SPR \"&Lists!P8&\"'!P9\")=2,\"Medium\",IF(INDIRECT(\"'SPR \"&Lists!P8&\"'!P9\")=3,\"Low\",\"\")))","v":""},null,{"$f":"IF(INDIRECT(\"'SPR \"&Lists!P8&\"'!P34\")=1,\"No gap\",IF(INDIRECT(\"'SPR \"&Lists!P8&\"'!P34\")=2,\"Entirely the jurisdiction's responsibility\",IF(INDIRECT(\"'SPR \"&Lists!P8&\"'!P34\")=3,\"Mostly the jurisdiction's responsibility\",IF(INDIRECT(\"'SPR \"&Lists!P8&\"'!P34\")=4,\"Mostly higher-level government's responsibility\",IF(INDIRECT(\"'SPR \"&Lists!P8&\"'!P34\")=5,\"Entirely higher-level government's responsibility\",\"\")))))","v":""},null,null,"Access Control and Identity Verification","","",null,"Access Control and Identity Verification","","",null,"Access Control and Identity Verification","","",null,"Access Control and Identity Verification","","",null,"Access Control and Identity Verification","","",null,"Access Control and Identity Verification","",""]
[null,"Cybersecurity",null,{"$f":"IF(AND(INDIRECT(\"'SPR \"&Lists!P9&\"'!P14\")>1,INDIRECT(\"'SPR \"&Lists!P9&\"'!P14\")<7),INDIRECT(\"'SPR \"&Lists!P9&\"'!P14\")-1,IF(INDIRECT(\"'SPR \"&Lists!P9&\"'!P14\")=7,\"N/A\",\"\"))","v":""},{"$f":"IF(AND(INDIRECT(\"'SPR \"&Lists!P9&\"'!P18\")>1,INDIRECT(\"'SPR \"&Lists!P9&\"'!P18\")<7),INDIRECT(\"'SPR \"&Lists!P9&\"'!P18\")-1,IF(INDIRECT(\"'SPR \"&Lists!P9&\"'!P18\")=7,\"N/A\",\"\"))","v":""},{"$f":"IF(AND(INDIRECT(\"'SPR \"&Lists!P9&\"'!P21\")>1,INDIRECT(\"'SPR \"&Lists!P9&\"'!P21\")<7),INDIRECT(\"'SPR \"&Lists!P9&\"'!P21\")-1,IF(INDIRECT(\"'SPR \"&Lists!P9&\"'!P21\")=7,\"N/A\",\"\"))","v":""},{"$f":"IF(AND(INDIRECT(\"'SPR \"&Lists!P9&\"'!P24\")>1,INDIRECT(\"'SPR \"&Lists!P9&\"'!P24\")<7),INDIRECT(\"'SPR \"&Lists!P9&\"'!P24\")-1,IF(INDIRECT(\"'SPR \"&Lists!P9&\"'!P24\")=7,\"N/A\",\"\"))","v":""},{"$f":"IF(AND(INDIRECT(\"'SPR \"&Lists!P9&\"'!P28\")>1,INDIRECT(\"'SPR \"&Lists!P9&\"'!P28\")<7),INDIRECT(\"'SPR \"&Lists!P9&\"'!P28\")-1,IF(INDIRECT(\"'SPR \"&Lists!P9&\"'!P28\")=7,\"N/A\",\"\"))","v":""},null,0,"",null,{"$f":"IF(AND(INDIRECT(\"'SPR \"&Lists!P9&\"'!q14\")>1,INDIRECT(\"'SPR \"&Lists!P9&\"'!q14\")<7),INDIRECT(\"'SPR \"&Lists!P9&\"'!q14\")-1,IF(INDIRECT(\"'SPR \"&Lists!P9&\"'!q14\")=7,\"N/A\",\"\"))","v":""},{"$f":"IF(AND(INDIRECT(\"'SPR \"&Lists!P9&\"'!q18\")>1,INDIRECT(\"'SPR \"&Lists!P9&\"'!q18\")<7),INDIRECT(\"'SPR \"&Lists!P9&\"'!q18\")-1,IF(INDIRECT(\"'SPR \"&Lists!P9&\"'!q18\")=7,\"N/A\",\"\"))","v":""},{"$f":"IF(AND(INDIRECT(\"'SPR \"&Lists!P9&\"'!q21\")>1,INDIRECT(\"'SPR \"&Lists!P9&\"'!q21\")<7),INDIRECT(\"'SPR \"&Lists!P9&\"'!q21\")-1,IF(INDIRECT(\"'SPR \"&Lists!P9&\"'!q21\")=7,\"N/A\",\"\"))","v":""},{"$f":"IF(AND(INDIRECT(\"'SPR \"&Lists!P9&\"'!q24\")>1,INDIRECT(\"'SPR \"&Lists!P9&\"'!q24\")<7),INDIRECT(\"'SPR \"&Lists!P9&\"'!q24\")-1,IF(INDIRECT(\"'SPR \"&Lists!P9&\"'!q24\")=7,\"N/A\",\"\"))","v":""},{"$f":"IF(AND(INDIRECT(\"'SPR \"&Lists!P9&\"'!q28\")>1,INDIRECT(\"'SPR \"&Lists!P9&\"'!q28\")<7),INDIRECT(\"'SPR \"&Lists!P9&\"'!q28\")-1,IF(INDIRECT(\"'SPR \"&Lists!P9&\"'!q28\")=7,\"N/A\",\"\"))","v":""},null,0,"",null,{"$f":"IF(INDIRECT(\"'SPR \"&Lists!P9&\"'!P9\")=1,\"High\",IF(INDIRECT(\"'SPR \"&Lists!P9&\"'!P9\")=2,\"Medium\",IF(INDIRECT(\"'SPR \"&Lists!P9&\"'!P9\")=3,\"Low\",\"\")))","v":""},null,{"$f":"IF(INDIRECT(\"'SPR \"&Lists!P9&\"'!P34\")=1,\"No gap\",IF(INDIRECT(\"'SPR \"&Lists!P9&\"'!P34\")=2,\"Entirely the jurisdiction's responsibility\",IF(INDIRECT(\"'SPR \"&Lists!P9&\"'!P34\")=3,\"Mostly the jurisdiction's responsibility\",IF(INDIRECT(\"'SPR \"&Lists!P9&\"'!P34\")=4,\"Mostly higher-level government's responsibility\",IF(INDIRECT(\"'SPR \"&Lists!P9&\"'!P34\")=5,\"Entirely higher-level government's responsibility\",\"\")))))","v":""},null,null,"Cybersecurity","","",null,"Cybersecurity","","",null,"Cybersecurity","","",null,"Cybersecurity","","",null,"Cybersecurity","","",null,"Cybersecurity","",""]
[null,"Physical Protective Measures",null,{"$f":"IF(AND(INDIRECT(\"'SPR \"&Lists!P10&\"'!P14\")>1,INDIRECT(\"'SPR \"&Lists!P10&\"'!P14\")<7),INDIRECT(\"'SPR \"&Lists!P10&\"'!P14\")-1,IF(INDIRECT(\"'SPR \"&Lists!P10&\"'!P14\")=7,\"N/A\",\"\"))","v":""},{"$f":"IF(AND(INDIRECT(\"'SPR \"&Lists!P10&\"'!P18\")>1,INDIRECT(\"'SPR \"&Lists!P10&\"'!P18\")<7),INDIRECT(\"'SPR \"&Lists!P10&\"'!P18\")-1,IF(INDIRECT(\"'SPR \"&Lists!P10&\"'!P18\")=7,\"N/A\",\"\"))","v":""},{"$f":"IF(AND(INDIRECT(\"'SPR \"&Lists!P10&\"'!P21\")>1,INDIRECT(\"'SPR \"&Lists!P10&\"'!P21\")<7),INDIRECT(\"'SPR \"&Lists!P10&\"'!P21\")-1,IF(INDIRECT(\"'SPR \"&Lists!P10&\"'!P21\")=7,\"N/A\",\"\"))","v":""},{"$f":"IF(AND(INDIRECT(\"'SPR \"&Lists!P10&\"'!P24\")>1,INDIRECT(\"'SPR \"&Lists!P10&\"'!P24\")<7),INDIRECT(\"'SPR \"&Lists!P10&\"'!P24\")-1,IF(INDIRECT(\"'SPR \"&Lists!P10&\"'!P24\")=7,\"N/A\",\"\"))","v":""},{"$f":"IF(AND(INDIRECT(\"'SPR \"&Lists!P10&\"'!P28\")>1,INDIRECT(\"'SPR \"&Lists!P10&\"'!P28\")<7),INDIRECT(\"'SPR \"&Lists!P10&\"'!P28\")-1,IF(INDIRECT(\"'SPR \"&Lists!P10&\"'!P28\")=7,\"N/A\",\"\"))","v":""},null,0,"",null,{"$f":"IF(AND(INDIRECT(\"'SPR \"&Lists!P10&\"'!q14\")>1,INDIRECT(\"'SPR \"&Lists!P10&\"'!q14\")<7),INDIRECT(\"'SPR \"&Lists!P10&\"'!q14\")-1,IF(INDIRECT(\"'SPR \"&Lists!P10&\"'!q14\")=7,\"N/A\",\"\"))","v":""},{"$f":"IF(AND(INDIRECT(\"'SPR \"&Lists!P10&\"'!q18\")>1,INDIRECT(\"'SPR \"&Lists!P10&\"'!q18\")<7),INDIRECT(\"'SPR \"&Lists!P10&\"'!q18\")-1,IF(INDIRECT(\"'SPR \"&Lists!P10&\"'!q18\")=7,\"N/A\",\"\"))","v":""},{"$f":"IF(AND(INDIRECT(\"'SPR \"&Lists!P10&\"'!q21\")>1,INDIRECT(\"'SPR \"&Lists!P10&\"'!q21\")<7),INDIRECT(\"'SPR \"&Lists!P10&\"'!q21\")-1,IF(INDIRECT(\"'SPR \"&Lists!P10&\"'!q21\")=7,\"N/A\",\"\"))","v":""},{"$f":"IF(AND(INDIRECT(\"'SPR \"&Lists!P10&\"'!q24\")>1,INDIRECT(\"'SPR \"&Lists!P10&\"'!q24\")<7),INDIRECT(\"'SPR \"&Lists!P10&\"'!q24\")-1,IF(INDIRECT(\"'SPR \"&Lists!P10&\"'!q24\")=7,\"N/A\",\"\"))","v":""},{"$f":"IF(AND(INDIRECT(\"'SPR \"&Lists!P10&\"'!q28\")>1,INDIRECT(\"'SPR \"&Lists!P10&\"'!q28\")<7),INDIRECT(\"'SPR \"&Lists!P10&\"'!q28\")-1,IF(INDIRECT(\"'SPR \"&Lists!P10&\"'!q28\")=7,\"N/A\",\"\"))","v":""},null,0,"",null,{"$f":"IF(INDIRECT(\"'SPR \"&Lists!P10&\"'!P9\")=1,\"High\",IF(INDIRECT(\"'SPR \"&Lists!P10&\"'!P9\")=2,\"Medium\",IF(INDIRECT(\"'SPR \"&Lists!P10&\"'!P9\")=3,\"Low\",\"\")))","v":""},null,{"$f":"IF(INDIRECT(\"'SPR \"&Lists!P10&\"'!P34\")=1,\"No gap\",IF(INDIRECT(\"'SPR \"&Lists!P10&\"'!P34\")=2,\"Entirely the jurisdiction's responsibility\",IF(INDIRECT(\"'SPR \"&Lists!P10&\"'!P34\")=3,\"Mostly the jurisdiction's responsibility\",IF(INDIRECT(\"'SPR \"&Lists!P10&\"'!P34\")=4,\"Mostly higher-level government's responsibility\",IF(INDIRECT(\"'SPR \"&Lists!P10&\"'!P34\")=5,\"Entirely higher-level government's responsibility\",\"\")))))","v":""},null,null,"Physical Protective Measures","","",null,"Physical Protective Measures","","",null,"Physical Protective Measures","","",null,"Physical Protective Measures","","",null,"Physical Protective Measures","","",null,"Physical Protective Measures","",""]
[null,"Risk Management for Protection Programs and Activities",null,{"$f":"IF(AND(INDIRECT(\"'SPR \"&Lists!P11&\"'!P14\")>1,INDIRECT(\"'SPR \"&Lists!P11&\"'!P14\")<7),INDIRECT(\"'SPR \"&Lists!P11&\"'!P14\")-1,IF(INDIRECT(\"'SPR \"&Lists!P11&\"'!P14\")=7,\"N/A\",\"\"))","v":""},{"$f":"IF(AND(INDIRECT(\"'SPR \"&Lists!P11&\"'!P18\")>1,INDIRECT(\"'SPR \"&Lists!P11&\"'!P18\")<7),INDIRECT(\"'SPR \"&Lists!P11&\"'!P18\")-1,IF(INDIRECT(\"'SPR \"&Lists!P11&\"'!P18\")=7,\"N/A\",\"\"))","v":""},{"$f":"IF(AND(INDIRECT(\"'SPR \"&Lists!P11&\"'!P21\")>1,INDIRECT(\"'SPR \"&Lists!P11&\"'!P21\")<7),INDIRECT(\"'SPR \"&Lists!P11&\"'!P21\")-1,IF(INDIRECT(\"'SPR \"&Lists!P11&\"'!P21\")=7,\"N/A\",\"\"))","v":""},{"$f":"IF(AND(INDIRECT(\"'SPR \"&Lists!P11&\"'!P24\")>1,INDIRECT(\"'SPR \"&Lists!P11&\"'!P24\")<7),INDIRECT(\"'SPR \"&Lists!P11&\"'!P24\")-1,IF(INDIRECT(\"'SPR \"&Lists!P11&\"'!P24\")=7,\"N/A\",\"\"))","v":""},{"$f":"IF(AND(INDIRECT(\"'SPR \"&Lists!P11&\"'!P28\")>1,INDIRECT(\"'SPR \"&Lists!P11&\"'!P28\")<7),INDIRECT(\"'SPR \"&Lists!P11&\"'!P28\")-1,IF(INDIRECT(\"'SPR \"&Lists!P11&\"'!P28\")=7,\"N/A\",\"\"))","v":""},null,0,"",null,{"$f":"IF(AND(INDIRECT(\"'SPR \"&Lists!P11&\"'!q14\")>1,INDIRECT(\"'SPR \"&Lists!P11&\"'!q14\")<7),INDIRECT(\"'SPR \"&Lists!P11&\"'!q14\")-1,IF(INDIRECT(\"'SPR \"&Lists!P11&\"'!q14\")=7,\"N/A\",\"\"))","v":""},{"$f":"IF(AND(INDIRECT(\"'SPR \"&Lists!P11&\"'!q18\")>1,INDIRECT(\"'SPR \"&Lists!P11&\"'!q18\")<7),INDIRECT(\"'SPR \"&Lists!P11&\"'!q18\")-1,IF(INDIRECT(\"'SPR \"&Lists!P11&\"'!q18\")=7,\"N/A\",\"\"))","v":""},{"$f":"IF(AND(INDIRECT(\"'SPR \"&Lists!P11&\"'!q21\")>1,INDIRECT(\"'SPR \"&Lists!P11&\"'!q21\")<7),INDIRECT(\"'SPR \"&Lists!P11&\"'!q21\")-1,IF(INDIRECT(\"'SPR \"&Lists!P11&\"'!q21\")=7,\"N/A\",\"\"))","v":""},{"$f":"IF(AND(INDIRECT(\"'SPR \"&Lists!P11&\"'!q24\")>1,INDIRECT(\"'SPR \"&Lists!P11&\"'!q24\")<7),INDIRECT(\"'SPR \"&Lists!P11&\"'!q24\")-1,IF(INDIRECT(\"'SPR \"&Lists!P11&\"'!q24\")=7,\"N/A\",\"\"))","v":""},{"$f":"IF(AND(INDIRECT(\"'SPR \"&Lists!P11&\"'!q28\")>1,INDIRECT(\"'SPR \"&Lists!P11&\"'!q28\")<7),INDIRECT(\"'SPR \"&Lists!P11&\"'!q28\")-1,IF(INDIRECT(\"'SPR \"&Lists!P11&\"'!q28\")=7,\"N/A\",\"\"))","v":""},null,0,"",null,{"$f":"IF(INDIRECT(\"'SPR \"&Lists!P11&\"'!P9\")=1,\"High\",IF(INDIRECT(\"'SPR \"&Lists!P11&\"'!P9\")=2,\"Medium\",IF(INDIRECT(\"'SPR \"&Lists!P11&\"'!P9\")=3,\"Low\",\"\")))","v":""},null,{"$f":"IF(INDIRECT(\"'SPR \"&Lists!P11&\"'!P34\")=1,\"No gap\",IF(INDIRECT(\"'SPR \"&Lists!P11&\"'!P34\")=2,\"Entirely the jurisdiction's responsibility\",IF(INDIRECT(\"'SPR \"&Lists!P11&\"'!P34\")=3,\"Mostly the jurisdiction's responsibility\",IF(INDIRECT(\"'SPR \"&Lists!P11&\"'!P34\")=4,\"Mostly higher-level government's responsibility\",IF(INDIRECT(\"'SPR \"&Lists!P11&\"'!P34\")=5,\"Entirely higher-level government's responsibility\",\"\")))))","v":""},null,null,"Risk Management for Protection Programs and Activities","","",null,"Risk Management for Protection Programs and Activities","","",null,"Risk Management for Protection Programs and Activities","","",null,"Risk Management for Protection Programs and Activities","","",null,"Risk Management for Protection Programs and Activities","","",null,"Risk Management for Protection Programs and Activities","",""]
[null,"Supply Chain Integrity and Security",null,{"$f":"IF(AND(INDIRECT(\"'SPR \"&Lists!P12&\"'!P14\")>1,INDIRECT(\"'SPR \"&Lists!P12&\"'!P14\")<7),INDIRECT(\"'SPR \"&Lists!P12&\"'!P14\")-1,IF(INDIRECT(\"'SPR \"&Lists!P12&\"'!P14\")=7,\"N/A\",\"\"))","v":""},{"$f":"IF(AND(INDIRECT(\"'SPR \"&Lists!P12&\"'!P18\")>1,INDIRECT(\"'SPR \"&Lists!P12&\"'!P18\")<7),INDIRECT(\"'SPR \"&Lists!P12&\"'!P18\")-1,IF(INDIRECT(\"'SPR \"&Lists!P12&\"'!P18\")=7,\"N/A\",\"\"))","v":""},{"$f":"IF(AND(INDIRECT(\"'SPR \"&Lists!P12&\"'!P21\")>1,INDIRECT(\"'SPR \"&Lists!P12&\"'!P21\")<7),INDIRECT(\"'SPR \"&Lists!P12&\"'!P21\")-1,IF(INDIRECT(\"'SPR \"&Lists!P12&\"'!P21\")=7,\"N/A\",\"\"))","v":""},{"$f":"IF(AND(INDIRECT(\"'SPR \"&Lists!P12&\"'!P24\")>1,INDIRECT(\"'SPR \"&Lists!P12&\"'!P24\")<7),INDIRECT(\"'SPR \"&Lists!P12&\"'!P24\")-1,IF(INDIRECT(\"'SPR \"&Lists!P12&\"'!P24\")=7,\"N/A\",\"\"))","v":""},{"$f":"IF(AND(INDIRECT(\"'SPR \"&Lists!P12&\"'!P28\")>1,INDIRECT(\"'SPR \"&Lists!P12&\"'!P28\")<7),INDIRECT(\"'SPR \"&Lists!P12&\"'!P28\")-1,IF(INDIRECT(\"'SPR \"&Lists!P12&\"'!P28\")=7,\"N/A\",\"\"))","v":""},null,0,"",null,{"$f":"IF(AND(INDIRECT(\"'SPR \"&Lists!P12&\"'!q14\")>1,INDIRECT(\"'SPR \"&Lists!P12&\"'!q14\")<7),INDIRECT(\"'SPR \"&Lists!P12&\"'!q14\")-1,IF(INDIRECT(\"'SPR \"&Lists!P12&\"'!q14\")=7,\"N/A\",\"\"))","v":""},{"$f":"IF(AND(INDIRECT(\"'SPR \"&Lists!P12&\"'!q18\")>1,INDIRECT(\"'SPR \"&Lists!P12&\"'!q18\")<7),INDIRECT(\"'SPR \"&Lists!P12&\"'!q18\")-1,IF(INDIRECT(\"'SPR \"&Lists!P12&\"'!q18\")=7,\"N/A\",\"\"))","v":""},{"$f":"IF(AND(INDIRECT(\"'SPR \"&Lists!P12&\"'!q21\")>1,INDIRECT(\"'SPR \"&Lists!P12&\"'!q21\")<7),INDIRECT(\"'SPR \"&Lists!P12&\"'!q21\")-1,IF(INDIRECT(\"'SPR \"&Lists!P12&\"'!q21\")=7,\"N/A\",\"\"))","v":""},{"$f":"IF(AND(INDIRECT(\"'SPR \"&Lists!P12&\"'!q24\")>1,INDIRECT(\"'SPR \"&Lists!P12&\"'!q24\")<7),INDIRECT(\"'SPR \"&Lists!P12&\"'!q24\")-1,IF(INDIRECT(\"'SPR \"&Lists!P12&\"'!q24\")=7,\"N/A\",\"\"))","v":""},{"$f":"IF(AND(INDIRECT(\"'SPR \"&Lists!P12&\"'!q28\")>1,INDIRECT(\"'SPR \"&Lists!P12&\"'!q28\")<7),INDIRECT(\"'SPR \"&Lists!P12&\"'!q28\")-1,IF(INDIRECT(\"'SPR \"&Lists!P12&\"'!q28\")=7,\"N/A\",\"\"))","v":""},null,0,"",null,{"$f":"IF(INDIRECT(\"'SPR \"&Lists!P12&\"'!P9\")=1,\"High\",IF(INDIRECT(\"'SPR \"&Lists!P12&\"'!P9\")=2,\"Medium\",IF(INDIRECT(\"'SPR \"&Lists!P12&\"'!P9\")=3,\"Low\",\"\")))","v":""},null,{"$f":"IF(INDIRECT(\"'SPR \"&Lists!P12&\"'!P34\")=1,\"No gap\",IF(INDIRECT(\"'SPR \"&Lists!P12&\"'!P34\")=2,\"Entirely the jurisdiction's responsibility\",IF(INDIRECT(\"'SPR \"&Lists!P12&\"'!P34\")=3,\"Mostly the jurisdiction's responsibility\",IF(INDIRECT(\"'SPR \"&Lists!P12&\"'!P34\")=4,\"Mostly higher-level government's responsibility\",IF(INDIRECT(\"'SPR \"&Lists!P12&\"'!P34\")=5,\"Entirely higher-level government's responsibility\",\"\")))))","v":""},null,null,"Supply Chain Integrity and Security","","",null,"Supply Chain Integrity and Security","","",null,"Supply Chain Integrity and Security","","",null,"Supply Chain Integrity and Security","","",null,"Supply Chain Integrity and Security","","",null,"Supply Chain Integrity and Security","",""]
[null,"Community Resilience",null,{"$f":"IF(AND(INDIRECT(\"'SPR \"&Lists!P13&\"'!P14\")>1,INDIRECT(\"'SPR \"&Lists!P13&\"'!P14\")<7),INDIRECT(\"'SPR \"&Lists!P13&\"'!P14\")-1,IF(INDIRECT(\"'SPR \"&Lists!P13&\"'!P14\")=7,\"N/A\",\"\"))","v":""},{"$f":"IF(AND(INDIRECT(\"'SPR \"&Lists!P13&\"'!P18\")>1,INDIRECT(\"'SPR \"&Lists!P13&\"'!P18\")<7),INDIRECT(\"'SPR \"&Lists!P13&\"'!P18\")-1,IF(INDIRECT(\"'SPR \"&Lists!P13&\"'!P18\")=7,\"N/A\",\"\"))","v":""},{"$f":"IF(AND(INDIRECT(\"'SPR \"&Lists!P13&\"'!P21\")>1,INDIRECT(\"'SPR \"&Lists!P13&\"'!P21\")<7),INDIRECT(\"'SPR \"&Lists!P13&\"'!P21\")-1,IF(INDIRECT(\"'SPR \"&Lists!P13&\"'!P21\")=7,\"N/A\",\"\"))","v":""},{"$f":"IF(AND(INDIRECT(\"'SPR \"&Lists!P13&\"'!P24\")>1,INDIRECT(\"'SPR \"&Lists!P13&\"'!P24\")<7),INDIRECT(\"'SPR \"&Lists!P13&\"'!P24\")-1,IF(INDIRECT(\"'SPR \"&Lists!P13&\"'!P24\")=7,\"N/A\",\"\"))","v":""},{"$f":"IF(AND(INDIRECT(\"'SPR \"&Lists!P13&\"'!P28\")>1,INDIRECT(\"'SPR \"&Lists!P13&\"'!P28\")<7),INDIRECT(\"'SPR \"&Lists!P13&\"'!P28\")-1,IF(INDIRECT(\"'SPR \"&Lists!P13&\"'!P28\")=7,\"N/A\",\"\"))","v":""},null,0,"",null,{"$f":"IF(AND(INDIRECT(\"'SPR \"&Lists!P13&\"'!q14\")>1,INDIRECT(\"'SPR \"&Lists!P13&\"'!q14\")<7),INDIRECT(\"'SPR \"&Lists!P13&\"'!q14\")-1,IF(INDIRECT(\"'SPR \"&Lists!P13&\"'!q14\")=7,\"N/A\",\"\"))","v":""},{"$f":"IF(AND(INDIRECT(\"'SPR \"&Lists!P13&\"'!q18\")>1,INDIRECT(\"'SPR \"&Lists!P13&\"'!q18\")<7),INDIRECT(\"'SPR \"&Lists!P13&\"'!q18\")-1,IF(INDIRECT(\"'SPR \"&Lists!P13&\"'!q18\")=7,\"N/A\",\"\"))","v":""},{"$f":"IF(AND(INDIRECT(\"'SPR \"&Lists!P13&\"'!q21\")>1,INDIRECT(\"'SPR \"&Lists!P13&\"'!q21\")<7),INDIRECT(\"'SPR \"&Lists!P13&\"'!q21\")-1,IF(INDIRECT(\"'SPR \"&Lists!P13&\"'!q21\")=7,\"N/A\",\"\"))","v":""},{"$f":"IF(AND(INDIRECT(\"'SPR \"&Lists!P13&\"'!q24\")>1,INDIRECT(\"'SPR \"&Lists!P13&\"'!q24\")<7),INDIRECT(\"'SPR \"&Lists!P13&\"'!q24\")-1,IF(INDIRECT(\"'SPR \"&Lists!P13&\"'!q24\")=7,\"N/A\",\"\"))","v":""},{"$f":"IF(AND(INDIRECT(\"'SPR \"&Lists!P13&\"'!q28\")>1,INDIRECT(\"'SPR \"&Lists!P13&\"'!q28\")<7),INDIRECT(\"'SPR \"&Lists!P13&\"'!q28\")-1,IF(INDIRECT(\"'SPR \"&Lists!P13&\"'!q28\")=7,\"N/A\",\"\"))","v":""},null,0,"",null,{"$f":"IF(INDIRECT(\"'SPR \"&Lists!P13&\"'!P9\")=1,\"High\",IF(INDIRECT(\"'SPR \"&Lists!P13&\"'!P9\")=2,\"Medium\",IF(INDIRECT(\"'SPR \"&Lists!P13&\"'!P9\")=3,\"Low\",\"\")))","v":""},null,{"$f":"IF(INDIRECT(\"'SPR \"&Lists!P13&\"'!P34\")=1,\"No gap\",IF(INDIRECT(\"'SPR \"&Lists!P13&\"'!P34\")=2,\"Entirely the jurisdiction's responsibility\",IF(INDIRECT(\"'SPR \"&Lists!P13&\"'!P34\")=3,\"Mostly the jurisdiction's responsibility\",IF(INDIRECT(\"'SPR \"&Lists!P13&\"'!P34\")=4,\"Mostly higher-level government's responsibility\",IF(INDIRECT(\"'SPR \"&Lists!P13&\"'!P34\")=5,\"Entirely higher-level government's responsibility\",\"\")))))","v":""},null,null,"Community Resilience","","",null,"Community Resilience","","",null,"Community Resilience","","",null,"Community Resilience","","",null,"Community Resilience","","",null,"Community Resilience","",""]
[null,"Long-term Vulnerability Reduction",null,{"$f":"IF(AND(INDIRECT(\"'SPR \"&Lists!P14&\"'!P14\")>1,INDIRECT(\"'SPR \"&Lists!P14&\"'!P14\")<7),INDIRECT(\"'SPR \"&Lists!P14&\"'!P14\")-1,IF(INDIRECT(\"'SPR \"&Lists!P14&\"'!P14\")=7,\"N/A\",\"\"))","v":""},{"$f":"IF(AND(INDIRECT(\"'SPR \"&Lists!P14&\"'!P18\")>1,INDIRECT(\"'SPR \"&Lists!P14&\"'!P18\")<7),INDIRECT(\"'SPR \"&Lists!P14&\"'!P18\")-1,IF(INDIRECT(\"'SPR \"&Lists!P14&\"'!P18\")=7,\"N/A\",\"\"))","v":""},{"$f":"IF(AND(INDIRECT(\"'SPR \"&Lists!P14&\"'!P21\")>1,INDIRECT(\"'SPR \"&Lists!P14&\"'!P21\")<7),INDIRECT(\"'SPR \"&Lists!P14&\"'!P21\")-1,IF(INDIRECT(\"'SPR \"&Lists!P14&\"'!P21\")=7,\"N/A\",\"\"))","v":""},{"$f":"IF(AND(INDIRECT(\"'SPR \"&Lists!P14&\"'!P24\")>1,INDIRECT(\"'SPR \"&Lists!P14&\"'!P24\")<7),INDIRECT(\"'SPR \"&Lists!P14&\"'!P24\")-1,IF(INDIRECT(\"'SPR \"&Lists!P14&\"'!P24\")=7,\"N/A\",\"\"))","v":""},{"$f":"IF(AND(INDIRECT(\"'SPR \"&Lists!P14&\"'!P28\")>1,INDIRECT(\"'SPR \"&Lists!P14&\"'!P28\")<7),INDIRECT(\"'SPR \"&Lists!P14&\"'!P28\")-1,IF(INDIRECT(\"'SPR \"&Lists!P14&\"'!P28\")=7,\"N/A\",\"\"))","v":""},null,0,"",null,{"$f":"IF(AND(INDIRECT(\"'SPR \"&Lists!P14&\"'!q14\")>1,INDIRECT(\"'SPR \"&Lists!P14&\"'!q14\")<7),INDIRECT(\"'SPR \"&Lists!P14&\"'!q14\")-1,IF(INDIRECT(\"'SPR \"&Lists!P14&\"'!q14\")=7,\"N/A\",\"\"))","v":""},{"$f":"IF(AND(INDIRECT(\"'SPR \"&Lists!P14&\"'!q18\")>1,INDIRECT(\"'SPR \"&Lists!P14&\"'!q18\")<7),INDIRECT(\"'SPR \"&Lists!P14&\"'!q18\")-1,IF(INDIRECT(\"'SPR \"&Lists!P14&\"'!q18\")=7,\"N/A\",\"\"))","v":""},{"$f":"IF(AND(INDIRECT(\"'SPR \"&Lists!P14&\"'!q21\")>1,INDIRECT(\"'SPR \"&Lists!P14&\"'!q21\")<7),INDIRECT(\"'SPR \"&Lists!P14&\"'!q21\")-1,IF(INDIRECT(\"'SPR \"&Lists!P14&\"'!q21\")=7,\"N/A\",\"\"))","v":""},{"$f":"IF(AND(INDIRECT(\"'SPR \"&Lists!P14&\"'!q24\")>1,INDIRECT(\"'SPR \"&Lists!P14&\"'!q24\")<7),INDIRECT(\"'SPR \"&Lists!P14&\"'!q24\")-1,IF(INDIRECT(\"'SPR \"&Lists!P14&\"'!q24\")=7,\"N/A\",\"\"))","v":""},{"$f":"IF(AND(INDIRECT(\"'SPR \"&Lists!P14&\"'!q28\")>1,INDIRECT(\"'SPR \"&Lists!P14&\"'!q28\")<7),INDIRECT(\"'SPR \"&Lists!P14&\"'!q28\")-1,IF(INDIRECT(\"'SPR \"&Lists!P14&\"'!q28\")=7,\"N/A\",\"\"))","v":""},null,0,"",null,{"$f":"IF(INDIRECT(\"'SPR \"&Lists!P14&\"'!P9\")=1,\"High\",IF(INDIRECT(\"'SPR \"&Lists!P14&\"'!P9\")=2,\"Medium\",IF(INDIRECT(\"'SPR \"&Lists!P14&\"'!P9\")=3,\"Low\",\"\")))","v":""},null,{"$f":"IF(INDIRECT(\"'SPR \"&Lists!P14&\"'!P34\")=1,\"No gap\",IF(INDIRECT(\"'SPR \"&Lists!P14&\"'!P34\")=2,\"Entirely the jurisdiction's responsibility\",IF(INDIRECT(\"'SPR \"&Lists!P14&\"'!P34\")=3,\"Mostly the jurisdiction's responsibility\",IF(INDIRECT(\"'SPR \"&Lists!P14&\"'!P34\")=4,\"Mostly higher-level government's responsibility\",IF(INDIRECT(\"'SPR \"&Lists!P14&\"'!P34\")=5,\"Entirely higher-level government's responsibility\",\"\")))))","v":""},null,null,"Long-term Vulnerability Reduction","","",null,"Long-term Vulnerability Reduction","","",null,"Long-term Vulnerability Reduction","","",null,"Long-term Vulnerability Reduction","","",null,"Long-term Vulnerability Reduction","","",null,"Long-term Vulnerability Reduction","",""]
[null,"Risk and Disaster Resilience Assessment",null,{"$f":"IF(AND(INDIRECT(\"'SPR \"&Lists!P15&\"'!P14\")>1,INDIRECT(\"'SPR \"&Lists!P15&\"'!P14\")<7),INDIRECT(\"'SPR \"&Lists!P15&\"'!P14\")-1,IF(INDIRECT(\"'SPR \"&Lists!P15&\"'!P14\")=7,\"N/A\",\"\"))","v":""},{"$f":"IF(AND(INDIRECT(\"'SPR \"&Lists!P15&\"'!P18\")>1,INDIRECT(\"'SPR \"&Lists!P15&\"'!P18\")<7),INDIRECT(\"'SPR \"&Lists!P15&\"'!P18\")-1,IF(INDIRECT(\"'SPR \"&Lists!P15&\"'!P18\")=7,\"N/A\",\"\"))","v":""},{"$f":"IF(AND(INDIRECT(\"'SPR \"&Lists!P15&\"'!P21\")>1,INDIRECT(\"'SPR \"&Lists!P15&\"'!P21\")<7),INDIRECT(\"'SPR \"&Lists!P15&\"'!P21\")-1,IF(INDIRECT(\"'SPR \"&Lists!P15&\"'!P21\")=7,\"N/A\",\"\"))","v":""},{"$f":"IF(AND(INDIRECT(\"'SPR \"&Lists!P15&\"'!P24\")>1,INDIRECT(\"'SPR \"&Lists!P15&\"'!P24\")<7),INDIRECT(\"'SPR \"&Lists!P15&\"'!P24\")-1,IF(INDIRECT(\"'SPR \"&Lists!P15&\"'!P24\")=7,\"N/A\",\"\"))","v":""},{"$f":"IF(AND(INDIRECT(\"'SPR \"&Lists!P15&\"'!P28\")>1,INDIRECT(\"'SPR \"&Lists!P15&\"'!P28\")<7),INDIRECT(\"'SPR \"&Lists!P15&\"'!P28\")-1,IF(INDIRECT(\"'SPR \"&Lists!P15&\"'!P28\")=7,\"N/A\",\"\"))","v":""},null,0,"",null,{"$f":"IF(AND(INDIRECT(\"'SPR \"&Lists!P15&\"'!q14\")>1,INDIRECT(\"'SPR \"&Lists!P15&\"'!q14\")<7),INDIRECT(\"'SPR \"&Lists!P15&\"'!q14\")-1,IF(INDIRECT(\"'SPR \"&Lists!P15&\"'!q14\")=7,\"N/A\",\"\"))","v":""},{"$f":"IF(AND(INDIRECT(\"'SPR \"&Lists!P15&\"'!q18\")>1,INDIRECT(\"'SPR \"&Lists!P15&\"'!q18\")<7),INDIRECT(\"'SPR \"&Lists!P15&\"'!q18\")-1,IF(INDIRECT(\"'SPR \"&Lists!P15&\"'!q18\")=7,\"N/A\",\"\"))","v":""},{"$f":"IF(AND(INDIRECT(\"'SPR \"&Lists!P15&\"'!q21\")>1,INDIRECT(\"'SPR \"&Lists!P15&\"'!q21\")<7),INDIRECT(\"'SPR \"&Lists!P15&\"'!q21\")-1,IF(INDIRECT(\"'SPR \"&Lists!P15&\"'!q21\")=7,\"N/A\",\"\"))","v":""},{"$f":"IF(AND(INDIRECT(\"'SPR \"&Lists!P15&\"'!q24\")>1,INDIRECT(\"'SPR \"&Lists!P15&\"'!q24\")<7),INDIRECT(\"'SPR \"&Lists!P15&\"'!q24\")-1,IF(INDIRECT(\"'SPR \"&Lists!P15&\"'!q24\")=7,\"N/A\",\"\"))","v":""},{"$f":"IF(AND(INDIRECT(\"'SPR \"&Lists!P15&\"'!q28\")>1,INDIRECT(\"'SPR \"&Lists!P15&\"'!q28\")<7),INDIRECT(\"'SPR \"&Lists!P15&\"'!q28\")-1,IF(INDIRECT(\"'SPR \"&Lists!P15&\"'!q28\")=7,\"N/A\",\"\"))","v":""},null,0,"",null,{"$f":"IF(INDIRECT(\"'SPR \"&Lists!P15&\"'!P9\")=1,\"High\",IF(INDIRECT(\"'SPR \"&Lists!P15&\"'!P9\")=2,\"Medium\",IF(INDIRECT(\"'SPR \"&Lists!P15&\"'!P9\")=3,\"Low\",\"\")))","v":""},null,{"$f":"IF(INDIRECT(\"'SPR \"&Lists!P15&\"'!P34\")=1,\"No gap\",IF(INDIRECT(\"'SPR \"&Lists!P15&\"'!P34\")=2,\"Entirely the jurisdiction's responsibility\",IF(INDIRECT(\"'SPR \"&Lists!P15&\"'!P34\")=3,\"Mostly the jurisdiction's responsibility\",IF(INDIRECT(\"'SPR \"&Lists!P15&\"'!P34\")=4,\"Mostly higher-level government's responsibility\",IF(INDIRECT(\"'SPR \"&Lists!P15&\"'!P34\")=5,\"Entirely higher-level government's responsibility\",\"\")))))","v":""},null,null,"Risk and Disaster Resilience Assessment","","",null,"Risk and Disaster Resilience Assessment","","",null,"Risk and Disaster Resilience Assessment","","",null,"Risk and Disaster Resilience Assessment","","",null,"Risk and Disaster Resilience Assessment","","",null,"Risk and Disaster Resilience Assessment","",""]
[null,"Threats and Hazard Identification",null,{"$f":"IF(AND(INDIRECT(\"'SPR \"&Lists!P16&\"'!P14\")>1,INDIRECT(\"'SPR \"&Lists!P16&\"'!P14\")<7),INDIRECT(\"'SPR \"&Lists!P16&\"'!P14\")-1,IF(INDIRECT(\"'SPR \"&Lists!P16&\"'!P14\")=7,\"N/A\",\"\"))","v":""},{"$f":"IF(AND(INDIRECT(\"'SPR \"&Lists!P16&\"'!P18\")>1,INDIRECT(\"'SPR \"&Lists!P16&\"'!P18\")<7),INDIRECT(\"'SPR \"&Lists!P16&\"'!P18\")-1,IF(INDIRECT(\"'SPR \"&Lists!P16&\"'!P18\")=7,\"N/A\",\"\"))","v":""},{"$f":"IF(AND(INDIRECT(\"'SPR \"&Lists!P16&\"'!P21\")>1,INDIRECT(\"'SPR \"&Lists!P16&\"'!P21\")<7),INDIRECT(\"'SPR \"&Lists!P16&\"'!P21\")-1,IF(INDIRECT(\"'SPR \"&Lists!P16&\"'!P21\")=7,\"N/A\",\"\"))","v":""},{"$f":"IF(AND(INDIRECT(\"'SPR \"&Lists!P16&\"'!P24\")>1,INDIRECT(\"'SPR \"&Lists!P16&\"'!P24\")<7),INDIRECT(\"'SPR \"&Lists!P16&\"'!P24\")-1,IF(INDIRECT(\"'SPR \"&Lists!P16&\"'!P24\")=7,\"N/A\",\"\"))","v":""},{"$f":"IF(AND(INDIRECT(\"'SPR \"&Lists!P16&\"'!P28\")>1,INDIRECT(\"'SPR \"&Lists!P16&\"'!P28\")<7),INDIRECT(\"'SPR \"&Lists!P16&\"'!P28\")-1,IF(INDIRECT(\"'SPR \"&Lists!P16&\"'!P28\")=7,\"N/A\",\"\"))","v":""},null,0,"",null,{"$f":"IF(AND(INDIRECT(\"'SPR \"&Lists!P16&\"'!q14\")>1,INDIRECT(\"'SPR \"&Lists!P16&\"'!q14\")<7),INDIRECT(\"'SPR \"&Lists!P16&\"'!q14\")-1,IF(INDIRECT(\"'SPR \"&Lists!P16&\"'!q14\")=7,\"N/A\",\"\"))","v":""},{"$f":"IF(AND(INDIRECT(\"'SPR \"&Lists!P16&\"'!q18\")>1,INDIRECT(\"'SPR \"&Lists!P16&\"'!q18\")<7),INDIRECT(\"'SPR \"&Lists!P16&\"'!q18\")-1,IF(INDIRECT(\"'SPR \"&Lists!P16&\"'!q18\")=7,\"N/A\",\"\"))","v":""},{"$f":"IF(AND(INDIRECT(\"'SPR \"&Lists!P16&\"'!q21\")>1,INDIRECT(\"'SPR \"&Lists!P16&\"'!q21\")<7),INDIRECT(\"'SPR \"&Lists!P16&\"'!q21\")-1,IF(INDIRECT(\"'SPR \"&Lists!P16&\"'!q21\")=7,\"N/A\",\"\"))","v":""},{"$f":"IF(AND(INDIRECT(\"'SPR \"&Lists!P16&\"'!q24\")>1,INDIRECT(\"'SPR \"&Lists!P16&\"'!q24\")<7),INDIRECT(\"'SPR \"&Lists!P16&\"'!q24\")-1,IF(INDIRECT(\"'SPR \"&Lists!P16&\"'!q24\")=7,\"N/A\",\"\"))","v":""},{"$f":"IF(AND(INDIRECT(\"'SPR \"&Lists!P16&\"'!q28\")>1,INDIRECT(\"'SPR \"&Lists!P16&\"'!q28\")<7),INDIRECT(\"'SPR \"&Lists!P16&\"'!q28\")-1,IF(INDIRECT(\"'SPR \"&Lists!P16&\"'!q28\")=7,\"N/A\",\"\"))","v":""},null,0,"",null,{"$f":"IF(INDIRECT(\"'SPR \"&Lists!P16&\"'!P9\")=1,\"High\",IF(INDIRECT(\"'SPR \"&Lists!P16&\"'!P9\")=2,\"Medium\",IF(INDIRECT(\"'SPR \"&Lists!P16&\"'!P9\")=3,\"Low\",\"\")))","v":""},null,{"$f":"IF(INDIRECT(\"'SPR \"&Lists!P16&\"'!P34\")=1,\"No gap\",IF(INDIRECT(\"'SPR \"&Lists!P16&\"'!P34\")=2,\"Entirely the jurisdiction's responsibility\",IF(INDIRECT(\"'SPR \"&Lists!P16&\"'!P34\")=3,\"Mostly the jurisdiction's responsibility\",IF(INDIRECT(\"'SPR \"&Lists!P16&\"'!P34\")=4,\"Mostly higher-level government's responsibility\",IF(INDIRECT(\"'SPR \"&Lists!P16&\"'!P34\")=5,\"Entirely higher-level government's responsibility\",\"\")))))","v":""},null,null,"Threats and Hazard Identification","","",null,"Threats and Hazard Identification","","",null,"Threats and Hazard Identification","","",null,"Threats and Hazard Identification","","",null,"Threats and Hazard Identification","","",null,"Threats and Hazard Identification","",""]
[null,"Critical Transportation",null,{"$f":"IF(AND(INDIRECT(\"'SPR \"&Lists!P17&\"'!P14\")>1,INDIRECT(\"'SPR \"&Lists!P17&\"'!P14\")<7),INDIRECT(\"'SPR \"&Lists!P17&\"'!P14\")-1,IF(INDIRECT(\"'SPR \"&Lists!P17&\"'!P14\")=7,\"N/A\",\"\"))","v":""},{"$f":"IF(AND(INDIRECT(\"'SPR \"&Lists!P17&\"'!P18\")>1,INDIRECT(\"'SPR \"&Lists!P17&\"'!P18\")<7),INDIRECT(\"'SPR \"&Lists!P17&\"'!P18\")-1,IF(INDIRECT(\"'SPR \"&Lists!P17&\"'!P18\")=7,\"N/A\",\"\"))","v":""},{"$f":"IF(AND(INDIRECT(\"'SPR \"&Lists!P17&\"'!P21\")>1,INDIRECT(\"'SPR \"&Lists!P17&\"'!P21\")<7),INDIRECT(\"'SPR \"&Lists!P17&\"'!P21\")-1,IF(INDIRECT(\"'SPR \"&Lists!P17&\"'!P21\")=7,\"N/A\",\"\"))","v":""},{"$f":"IF(AND(INDIRECT(\"'SPR \"&Lists!P17&\"'!P24\")>1,INDIRECT(\"'SPR \"&Lists!P17&\"'!P24\")<7),INDIRECT(\"'SPR \"&Lists!P17&\"'!P24\")-1,IF(INDIRECT(\"'SPR \"&Lists!P17&\"'!P24\")=7,\"N/A\",\"\"))","v":""},{"$f":"IF(AND(INDIRECT(\"'SPR \"&Lists!P17&\"'!P28\")>1,INDIRECT(\"'SPR \"&Lists!P17&\"'!P28\")<7),INDIRECT(\"'SPR \"&Lists!P17&\"'!P28\")-1,IF(INDIRECT(\"'SPR \"&Lists!P17&\"'!P28\")=7,\"N/A\",\"\"))","v":""},null,0,"",null,{"$f":"IF(AND(INDIRECT(\"'SPR \"&Lists!P17&\"'!q14\")>1,INDIRECT(\"'SPR \"&Lists!P17&\"'!q14\")<7),INDIRECT(\"'SPR \"&Lists!P17&\"'!q14\")-1,IF(INDIRECT(\"'SPR \"&Lists!P17&\"'!q14\")=7,\"N/A\",\"\"))","v":""},{"$f":"IF(AND(INDIRECT(\"'SPR \"&Lists!P17&\"'!q18\")>1,INDIRECT(\"'SPR \"&Lists!P17&\"'!q18\")<7),INDIRECT(\"'SPR \"&Lists!P17&\"'!q18\")-1,IF(INDIRECT(\"'SPR \"&Lists!P17&\"'!q18\")=7,\"N/A\",\"\"))","v":""},{"$f":"IF(AND(INDIRECT(\"'SPR \"&Lists!P17&\"'!q21\")>1,INDIRECT(\"'SPR \"&Lists!P17&\"'!q21\")<7),INDIRECT(\"'SPR \"&Lists!P17&\"'!q21\")-1,IF(INDIRECT(\"'SPR \"&Lists!P17&\"'!q21\")=7,\"N/A\",\"\"))","v":""},{"$f":"IF(AND(INDIRECT(\"'SPR \"&Lists!P17&\"'!q24\")>1,INDIRECT(\"'SPR \"&Lists!P17&\"'!q24\")<7),INDIRECT(\"'SPR \"&Lists!P17&\"'!q24\")-1,IF(INDIRECT(\"'SPR \"&Lists!P17&\"'!q24\")=7,\"N/A\",\"\"))","v":""},{"$f":"IF(AND(INDIRECT(\"'SPR \"&Lists!P17&\"'!q28\")>1,INDIRECT(\"'SPR \"&Lists!P17&\"'!q28\")<7),INDIRECT(\"'SPR \"&Lists!P17&\"'!q28\")-1,IF(INDIRECT(\"'SPR \"&Lists!P17&\"'!q28\")=7,\"N/A\",\"\"))","v":""},null,0,"",null,{"$f":"IF(INDIRECT(\"'SPR \"&Lists!P17&\"'!P9\")=1,\"High\",IF(INDIRECT(\"'SPR \"&Lists!P17&\"'!P9\")=2,\"Medium\",IF(INDIRECT(\"'SPR \"&Lists!P17&\"'!P9\")=3,\"Low\",\"\")))","v":""},null,{"$f":"IF(INDIRECT(\"'SPR \"&Lists!P17&\"'!P34\")=1,\"No gap\",IF(INDIRECT(\"'SPR \"&Lists!P17&\"'!P34\")=2,\"Entirely the jurisdiction's responsibility\",IF(INDIRECT(\"'SPR \"&Lists!P17&\"'!P34\")=3,\"Mostly the jurisdiction's responsibility\",IF(INDIRECT(\"'SPR \"&Lists!P17&\"'!P34\")=4,\"Mostly higher-level government's responsibility\",IF(INDIRECT(\"'SPR \"&Lists!P17&\"'!P34\")=5,\"Entirely higher-level government's responsibility\",\"\")))))","v":""},null,null,"Critical Transportation","","",null,"Critical Transportation","","",null,"Critical Transportation","","",null,"Critical Transportation","","",null,"Critical Transportation","","",null,"Critical Transportation","",""]
[null,"Environmental Response/Health and Safety",null,{"$f":"IF(AND(INDIRECT(\"'SPR \"&Lists!P18&\"'!P14\")>1,INDIRECT(\"'SPR \"&Lists!P18&\"'!P14\")<7),INDIRECT(\"'SPR \"&Lists!P18&\"'!P14\")-1,IF(INDIRECT(\"'SPR \"&Lists!P18&\"'!P14\")=7,\"N/A\",\"\"))","v":""},{"$f":"IF(AND(INDIRECT(\"'SPR \"&Lists!P18&\"'!P18\")>1,INDIRECT(\"'SPR \"&Lists!P18&\"'!P18\")<7),INDIRECT(\"'SPR \"&Lists!P18&\"'!P18\")-1,IF(INDIRECT(\"'SPR \"&Lists!P18&\"'!P18\")=7,\"N/A\",\"\"))","v":""},{"$f":"IF(AND(INDIRECT(\"'SPR \"&Lists!P18&\"'!P21\")>1,INDIRECT(\"'SPR \"&Lists!P18&\"'!P21\")<7),INDIRECT(\"'SPR \"&Lists!P18&\"'!P21\")-1,IF(INDIRECT(\"'SPR \"&Lists!P18&\"'!P21\")=7,\"N/A\",\"\"))","v":""},{"$f":"IF(AND(INDIRECT(\"'SPR \"&Lists!P18&\"'!P24\")>1,INDIRECT(\"'SPR \"&Lists!P18&\"'!P24\")<7),INDIRECT(\"'SPR \"&Lists!P18&\"'!P24\")-1,IF(INDIRECT(\"'SPR \"&Lists!P18&\"'!P24\")=7,\"N/A\",\"\"))","v":""},{"$f":"IF(AND(INDIRECT(\"'SPR \"&Lists!P18&\"'!P28\")>1,INDIRECT(\"'SPR \"&Lists!P18&\"'!P28\")<7),INDIRECT(\"'SPR \"&Lists!P18&\"'!P28\")-1,IF(INDIRECT(\"'SPR \"&Lists!P18&\"'!P28\")=7,\"N/A\",\"\"))","v":""},null,0,"",null,{"$f":"IF(AND(INDIRECT(\"'SPR \"&Lists!P18&\"'!q14\")>1,INDIRECT(\"'SPR \"&Lists!P18&\"'!q14\")<7),INDIRECT(\"'SPR \"&Lists!P18&\"'!q14\")-1,IF(INDIRECT(\"'SPR \"&Lists!P18&\"'!q14\")=7,\"N/A\",\"\"))","v":""},{"$f":"IF(AND(INDIRECT(\"'SPR \"&Lists!P18&\"'!q18\")>1,INDIRECT(\"'SPR \"&Lists!P18&\"'!q18\")<7),INDIRECT(\"'SPR \"&Lists!P18&\"'!q18\")-1,IF(INDIRECT(\"'SPR \"&Lists!P18&\"'!q18\")=7,\"N/A\",\"\"))","v":""},{"$f":"IF(AND(INDIRECT(\"'SPR \"&Lists!P18&\"'!q21\")>1,INDIRECT(\"'SPR \"&Lists!P18&\"'!q21\")<7),INDIRECT(\"'SPR \"&Lists!P18&\"'!q21\")-1,IF(INDIRECT(\"'SPR \"&Lists!P18&\"'!q21\")=7,\"N/A\",\"\"))","v":""},{"$f":"IF(AND(INDIRECT(\"'SPR \"&Lists!P18&\"'!q24\")>1,INDIRECT(\"'SPR \"&Lists!P18&\"'!q24\")<7),INDIRECT(\"'SPR \"&Lists!P18&\"'!q24\")-1,IF(INDIRECT(\"'SPR \"&Lists!P18&\"'!q24\")=7,\"N/A\",\"\"))","v":""},{"$f":"IF(AND(INDIRECT(\"'SPR \"&Lists!P18&\"'!q28\")>1,INDIRECT(\"'SPR \"&Lists!P18&\"'!q28\")<7),INDIRECT(\"'SPR \"&Lists!P18&\"'!q28\")-1,IF(INDIRECT(\"'SPR \"&Lists!P18&\"'!q28\")=7,\"N/A\",\"\"))","v":""},null,0,"",null,{"$f":"IF(INDIRECT(\"'SPR \"&Lists!P18&\"'!P9\")=1,\"High\",IF(INDIRECT(\"'SPR \"&Lists!P18&\"'!P9\")=2,\"Medium\",IF(INDIRECT(\"'SPR \"&Lists!P18&\"'!P9\")=3,\"Low\",\"\")))","v":""},null,{"$f":"IF(INDIRECT(\"'SPR \"&Lists!P18&\"'!P34\")=1,\"No gap\",IF(INDIRECT(\"'SPR \"&Lists!P18&\"'!P34\")=2,\"Entirely the jurisdiction's responsibility\",IF(INDIRECT(\"'SPR \"&Lists!P18&\"'!P34\")=3,\"Mostly the jurisdiction's responsibility\",IF(INDIRECT(\"'SPR \"&Lists!P18&\"'!P34\")=4,\"Mostly higher-level government's responsibility\",IF(INDIRECT(\"'SPR \"&Lists!P18&\"'!P34\")=5,\"Entirely higher-level government's responsibility\",\"\")))))","v":""},null,null,"Environmental Response/Health and Safety","","",null,"Environmental Response/Health and Safety","","",null,"Environmental Response/Health and Safety","","",null,"Environmental Response/Health and Safety","","",null,"Environmental Response/Health and Safety","","",null,"Environmental Response/Health and Safety","",""]
[null,"Fatality Management Services",null,{"$f":"IF(AND(INDIRECT(\"'SPR \"&Lists!P19&\"'!P14\")>1,INDIRECT(\"'SPR \"&Lists!P19&\"'!P14\")<7),INDIRECT(\"'SPR \"&Lists!P19&\"'!P14\")-1,IF(INDIRECT(\"'SPR \"&Lists!P19&\"'!P14\")=7,\"N/A\",\"\"))","v":""},{"$f":"IF(AND(INDIRECT(\"'SPR \"&Lists!P19&\"'!P18\")>1,INDIRECT(\"'SPR \"&Lists!P19&\"'!P18\")<7),INDIRECT(\"'SPR \"&Lists!P19&\"'!P18\")-1,IF(INDIRECT(\"'SPR \"&Lists!P19&\"'!P18\")=7,\"N/A\",\"\"))","v":""},{"$f":"IF(AND(INDIRECT(\"'SPR \"&Lists!P19&\"'!P21\")>1,INDIRECT(\"'SPR \"&Lists!P19&\"'!P21\")<7),INDIRECT(\"'SPR \"&Lists!P19&\"'!P21\")-1,IF(INDIRECT(\"'SPR \"&Lists!P19&\"'!P21\")=7,\"N/A\",\"\"))","v":""},{"$f":"IF(AND(INDIRECT(\"'SPR \"&Lists!P19&\"'!P24\")>1,INDIRECT(\"'SPR \"&Lists!P19&\"'!P24\")<7),INDIRECT(\"'SPR \"&Lists!P19&\"'!P24\")-1,IF(INDIRECT(\"'SPR \"&Lists!P19&\"'!P24\")=7,\"N/A\",\"\"))","v":""},{"$f":"IF(AND(INDIRECT(\"'SPR \"&Lists!P19&\"'!P28\")>1,INDIRECT(\"'SPR \"&Lists!P19&\"'!P28\")<7),INDIRECT(\"'SPR \"&Lists!P19&\"'!P28\")-1,IF(INDIRECT(\"'SPR \"&Lists!P19&\"'!P28\")=7,\"N/A\",\"\"))","v":""},null,0,"",null,{"$f":"IF(AND(INDIRECT(\"'SPR \"&Lists!P19&\"'!q14\")>1,INDIRECT(\"'SPR \"&Lists!P19&\"'!q14\")<7),INDIRECT(\"'SPR \"&Lists!P19&\"'!q14\")-1,IF(INDIRECT(\"'SPR \"&Lists!P19&\"'!q14\")=7,\"N/A\",\"\"))","v":""},{"$f":"IF(AND(INDIRECT(\"'SPR \"&Lists!P19&\"'!q18\")>1,INDIRECT(\"'SPR \"&Lists!P19&\"'!q18\")<7),INDIRECT(\"'SPR \"&Lists!P19&\"'!q18\")-1,IF(INDIRECT(\"'SPR \"&Lists!P19&\"'!q18\")=7,\"N/A\",\"\"))","v":""},{"$f":"IF(AND(INDIRECT(\"'SPR \"&Lists!P19&\"'!q21\")>1,INDIRECT(\"'SPR \"&Lists!P19&\"'!q21\")<7),INDIRECT(\"'SPR \"&Lists!P19&\"'!q21\")-1,IF(INDIRECT(\"'SPR \"&Lists!P19&\"'!q21\")=7,\"N/A\",\"\"))","v":""},{"$f":"IF(AND(INDIRECT(\"'SPR \"&Lists!P19&\"'!q24\")>1,INDIRECT(\"'SPR \"&Lists!P19&\"'!q24\")<7),INDIRECT(\"'SPR \"&Lists!P19&\"'!q24\")-1,IF(INDIRECT(\"'SPR \"&Lists!P19&\"'!q24\")=7,\"N/A\",\"\"))","v":""},{"$f":"IF(AND(INDIRECT(\"'SPR \"&Lists!P19&\"'!q28\")>1,INDIRECT(\"'SPR \"&Lists!P19&\"'!q28\")<7),INDIRECT(\"'SPR \"&Lists!P19&\"'!q28\")-1,IF(INDIRECT(\"'SPR \"&Lists!P19&\"'!q28\")=7,\"N/A\",\"\"))","v":""},null,0,"",null,{"$f":"IF(INDIRECT(\"'SPR \"&Lists!P19&\"'!P9\")=1,\"High\",IF(INDIRECT(\"'SPR \"&Lists!P19&\"'!P9\")=2,\"Medium\",IF(INDIRECT(\"'SPR \"&Lists!P19&\"'!P9\")=3,\"Low\",\"\")))","v":""},null,{"$f":"IF(INDIRECT(\"'SPR \"&Lists!P19&\"'!P34\")=1,\"No gap\",IF(INDIRECT(\"'SPR \"&Lists!P19&\"'!P34\")=2,\"Entirely the jurisdiction's responsibility\",IF(INDIRECT(\"'SPR \"&Lists!P19&\"'!P34\")=3,\"Mostly the jurisdiction's responsibility\",IF(INDIRECT(\"'SPR \"&Lists!P19&\"'!P34\")=4,\"Mostly higher-level government's responsibility\",IF(INDIRECT(\"'SPR \"&Lists!P19&\"'!P34\")=5,\"Entirely higher-level government's responsibility\",\"\")))))","v":""},null,null,"Fatality Management Services","","",null,"Fatality Management Services","","",null,"Fatality Management Services","","",null,"Fatality Management Services","","",null,"Fatality Management Services","","",null,"Fatality Management Services","",""]
[null,"Infrastructure Systems",null,{"$f":"IF(AND(INDIRECT(\"'SPR \"&Lists!P20&\"'!P14\")>1,INDIRECT(\"'SPR \"&Lists!P20&\"'!P14\")<7),INDIRECT(\"'SPR \"&Lists!P20&\"'!P14\")-1,IF(INDIRECT(\"'SPR \"&Lists!P20&\"'!P14\")=7,\"N/A\",\"\"))","v":""},{"$f":"IF(AND(INDIRECT(\"'SPR \"&Lists!P20&\"'!P18\")>1,INDIRECT(\"'SPR \"&Lists!P20&\"'!P18\")<7),INDIRECT(\"'SPR \"&Lists!P20&\"'!P18\")-1,IF(INDIRECT(\"'SPR \"&Lists!P20&\"'!P18\")=7,\"N/A\",\"\"))","v":""},{"$f":"IF(AND(INDIRECT(\"'SPR \"&Lists!P20&\"'!P21\")>1,INDIRECT(\"'SPR \"&Lists!P20&\"'!P21\")<7),INDIRECT(\"'SPR \"&Lists!P20&\"'!P21\")-1,IF(INDIRECT(\"'SPR \"&Lists!P20&\"'!P21\")=7,\"N/A\",\"\"))","v":""},{"$f":"IF(AND(INDIRECT(\"'SPR \"&Lists!P20&\"'!P24\")>1,INDIRECT(\"'SPR \"&Lists!P20&\"'!P24\")<7),INDIRECT(\"'SPR \"&Lists!P20&\"'!P24\")-1,IF(INDIRECT(\"'SPR \"&Lists!P20&\"'!P24\")=7,\"N/A\",\"\"))","v":""},{"$f":"IF(AND(INDIRECT(\"'SPR \"&Lists!P20&\"'!P28\")>1,INDIRECT(\"'SPR \"&Lists!P20&\"'!P28\")<7),INDIRECT(\"'SPR \"&Lists!P20&\"'!P28\")-1,IF(INDIRECT(\"'SPR \"&Lists!P20&\"'!P28\")=7,\"N/A\",\"\"))","v":""},null,0,"",null,{"$f":"IF(AND(INDIRECT(\"'SPR \"&Lists!P20&\"'!q14\")>1,INDIRECT(\"'SPR \"&Lists!P20&\"'!q14\")<7),INDIRECT(\"'SPR \"&Lists!P20&\"'!q14\")-1,IF(INDIRECT(\"'SPR \"&Lists!P20&\"'!q14\")=7,\"N/A\",\"\"))","v":""},{"$f":"IF(AND(INDIRECT(\"'SPR \"&Lists!P20&\"'!q18\")>1,INDIRECT(\"'SPR \"&Lists!P20&\"'!q18\")<7),INDIRECT(\"'SPR \"&Lists!P20&\"'!q18\")-1,IF(INDIRECT(\"'SPR \"&Lists!P20&\"'!q18\")=7,\"N/A\",\"\"))","v":""},{"$f":"IF(AND(INDIRECT(\"'SPR \"&Lists!P20&\"'!q21\")>1,INDIRECT(\"'SPR \"&Lists!P20&\"'!q21\")<7),INDIRECT(\"'SPR \"&Lists!P20&\"'!q21\")-1,IF(INDIRECT(\"'SPR \"&Lists!P20&\"'!q21\")=7,\"N/A\",\"\"))","v":""},{"$f":"IF(AND(INDIRECT(\"'SPR \"&Lists!P20&\"'!q24\")>1,INDIRECT(\"'SPR \"&Lists!P20&\"'!q24\")<7),INDIRECT(\"'SPR \"&Lists!P20&\"'!q24\")-1,IF(INDIRECT(\"'SPR \"&Lists!P20&\"'!q24\")=7,\"N/A\",\"\"))","v":""},{"$f":"IF(AND(INDIRECT(\"'SPR \"&Lists!P20&\"'!q28\")>1,INDIRECT(\"'SPR \"&Lists!P20&\"'!q28\")<7),INDIRECT(\"'SPR \"&Lists!P20&\"'!q28\")-1,IF(INDIRECT(\"'SPR \"&Lists!P20&\"'!q28\")=7,\"N/A\",\"\"))","v":""},null,0,"",null,{"$f":"IF(INDIRECT(\"'SPR \"&Lists!P20&\"'!P9\")=1,\"High\",IF(INDIRECT(\"'SPR \"&Lists!P20&\"'!P9\")=2,\"Medium\",IF(INDIRECT(\"'SPR \"&Lists!P20&\"'!P9\")=3,\"Low\",\"\")))","v":""},null,{"$f":"IF(INDIRECT(\"'SPR \"&Lists!P20&\"'!P34\")=1,\"No gap\",IF(INDIRECT(\"'SPR \"&Lists!P20&\"'!P34\")=2,\"Entirely the jurisdiction's responsibility\",IF(INDIRECT(\"'SPR \"&Lists!P20&\"'!P34\")=3,\"Mostly the jurisdiction's responsibility\",IF(INDIRECT(\"'SPR \"&Lists!P20&\"'!P34\")=4,\"Mostly higher-level government's responsibility\",IF(INDIRECT(\"'SPR \"&Lists!P20&\"'!P34\")=5,\"Entirely higher-level government's responsibility\",\"\")))))","v":""},null,null,"Infrastructure Systems","","",null,"Infrastructure Systems","","",null,"Infrastructure Systems","","",null,"Infrastructure Systems","","",null,"Infrastructure Systems","","",null,"Infrastructure Systems","",""]
[null,"Mass Care Services",null,{"$f":"IF(AND(INDIRECT(\"'SPR \"&Lists!P21&\"'!P14\")>1,INDIRECT(\"'SPR \"&Lists!P21&\"'!P14\")<7),INDIRECT(\"'SPR \"&Lists!P21&\"'!P14\")-1,IF(INDIRECT(\"'SPR \"&Lists!P21&\"'!P14\")=7,\"N/A\",\"\"))","v":""},{"$f":"IF(AND(INDIRECT(\"'SPR \"&Lists!P21&\"'!P18\")>1,INDIRECT(\"'SPR \"&Lists!P21&\"'!P18\")<7),INDIRECT(\"'SPR \"&Lists!P21&\"'!P18\")-1,IF(INDIRECT(\"'SPR \"&Lists!P21&\"'!P18\")=7,\"N/A\",\"\"))","v":""},{"$f":"IF(AND(INDIRECT(\"'SPR \"&Lists!P21&\"'!P21\")>1,INDIRECT(\"'SPR \"&Lists!P21&\"'!P21\")<7),INDIRECT(\"'SPR \"&Lists!P21&\"'!P21\")-1,IF(INDIRECT(\"'SPR \"&Lists!P21&\"'!P21\")=7,\"N/A\",\"\"))","v":""},{"$f":"IF(AND(INDIRECT(\"'SPR \"&Lists!P21&\"'!P24\")>1,INDIRECT(\"'SPR \"&Lists!P21&\"'!P24\")<7),INDIRECT(\"'SPR \"&Lists!P21&\"'!P24\")-1,IF(INDIRECT(\"'SPR \"&Lists!P21&\"'!P24\")=7,\"N/A\",\"\"))","v":""},{"$f":"IF(AND(INDIRECT(\"'SPR \"&Lists!P21&\"'!P28\")>1,INDIRECT(\"'SPR \"&Lists!P21&\"'!P28\")<7),INDIRECT(\"'SPR \"&Lists!P21&\"'!P28\")-1,IF(INDIRECT(\"'SPR \"&Lists!P21&\"'!P28\")=7,\"N/A\",\"\"))","v":""},null,0,"",null,{"$f":"IF(AND(INDIRECT(\"'SPR \"&Lists!P21&\"'!q14\")>1,INDIRECT(\"'SPR \"&Lists!P21&\"'!q14\")<7),INDIRECT(\"'SPR \"&Lists!P21&\"'!q14\")-1,IF(INDIRECT(\"'SPR \"&Lists!P21&\"'!q14\")=7,\"N/A\",\"\"))","v":""},{"$f":"IF(AND(INDIRECT(\"'SPR \"&Lists!P21&\"'!q18\")>1,INDIRECT(\"'SPR \"&Lists!P21&\"'!q18\")<7),INDIRECT(\"'SPR \"&Lists!P21&\"'!q18\")-1,IF(INDIRECT(\"'SPR \"&Lists!P21&\"'!q18\")=7,\"N/A\",\"\"))","v":""},{"$f":"IF(AND(INDIRECT(\"'SPR \"&Lists!P21&\"'!q21\")>1,INDIRECT(\"'SPR \"&Lists!P21&\"'!q21\")<7),INDIRECT(\"'SPR \"&Lists!P21&\"'!q21\")-1,IF(INDIRECT(\"'SPR \"&Lists!P21&\"'!q21\")=7,\"N/A\",\"\"))","v":""},{"$f":"IF(AND(INDIRECT(\"'SPR \"&Lists!P21&\"'!q24\")>1,INDIRECT(\"'SPR \"&Lists!P21&\"'!q24\")<7),INDIRECT(\"'SPR \"&Lists!P21&\"'!q24\")-1,IF(INDIRECT(\"'SPR \"&Lists!P21&\"'!q24\")=7,\"N/A\",\"\"))","v":""},{"$f":"IF(AND(INDIRECT(\"'SPR \"&Lists!P21&\"'!q28\")>1,INDIRECT(\"'SPR \"&Lists!P21&\"'!q28\")<7),INDIRECT(\"'SPR \"&Lists!P21&\"'!q28\")-1,IF(INDIRECT(\"'SPR \"&Lists!P21&\"'!q28\")=7,\"N/A\",\"\"))","v":""},null,0,"",null,{"$f":"IF(INDIRECT(\"'SPR \"&Lists!P21&\"'!P9\")=1,\"High\",IF(INDIRECT(\"'SPR \"&Lists!P21&\"'!P9\")=2,\"Medium\",IF(INDIRECT(\"'SPR \"&Lists!P21&\"'!P9\")=3,\"Low\",\"\")))","v":""},null,{"$f":"IF(INDIRECT(\"'SPR \"&Lists!P21&\"'!P34\")=1,\"No gap\",IF(INDIRECT(\"'SPR \"&Lists!P21&\"'!P34\")=2,\"Entirely the jurisdiction's responsibility\",IF(INDIRECT(\"'SPR \"&Lists!P21&\"'!P34\")=3,\"Mostly the jurisdiction's responsibility\",IF(INDIRECT(\"'SPR \"&Lists!P21&\"'!P34\")=4,\"Mostly higher-level government's responsibility\",IF(INDIRECT(\"'SPR \"&Lists!P21&\"'!P34\")=5,\"Entirely higher-level government's responsibility\",\"\")))))","v":""},null,null,"Mass Care Services","","",null,"Mass Care Services","","",null,"Mass Care Services","","",null,"Mass Care Services","","",null,"Mass Care Services","","",null,"Mass Care Services","",""]
[null,"Mass Search and Rescue Operations",null,{"$f":"IF(AND(INDIRECT(\"'SPR \"&Lists!P22&\"'!P14\")>1,INDIRECT(\"'SPR \"&Lists!P22&\"'!P14\")<7),INDIRECT(\"'SPR \"&Lists!P22&\"'!P14\")-1,IF(INDIRECT(\"'SPR \"&Lists!P22&\"'!P14\")=7,\"N/A\",\"\"))","v":""},{"$f":"IF(AND(INDIRECT(\"'SPR \"&Lists!P22&\"'!P18\")>1,INDIRECT(\"'SPR \"&Lists!P22&\"'!P18\")<7),INDIRECT(\"'SPR \"&Lists!P22&\"'!P18\")-1,IF(INDIRECT(\"'SPR \"&Lists!P22&\"'!P18\")=7,\"N/A\",\"\"))","v":""},{"$f":"IF(AND(INDIRECT(\"'SPR \"&Lists!P22&\"'!P21\")>1,INDIRECT(\"'SPR \"&Lists!P22&\"'!P21\")<7),INDIRECT(\"'SPR \"&Lists!P22&\"'!P21\")-1,IF(INDIRECT(\"'SPR \"&Lists!P22&\"'!P21\")=7,\"N/A\",\"\"))","v":""},{"$f":"IF(AND(INDIRECT(\"'SPR \"&Lists!P22&\"'!P24\")>1,INDIRECT(\"'SPR \"&Lists!P22&\"'!P24\")<7),INDIRECT(\"'SPR \"&Lists!P22&\"'!P24\")-1,IF(INDIRECT(\"'SPR \"&Lists!P22&\"'!P24\")=7,\"N/A\",\"\"))","v":""},{"$f":"IF(AND(INDIRECT(\"'SPR \"&Lists!P22&\"'!P28\")>1,INDIRECT(\"'SPR \"&Lists!P22&\"'!P28\")<7),INDIRECT(\"'SPR \"&Lists!P22&\"'!P28\")-1,IF(INDIRECT(\"'SPR \"&Lists!P22&\"'!P28\")=7,\"N/A\",\"\"))","v":""},null,0,"",null,{"$f":"IF(AND(INDIRECT(\"'SPR \"&Lists!P22&\"'!q14\")>1,INDIRECT(\"'SPR \"&Lists!P22&\"'!q14\")<7),INDIRECT(\"'SPR \"&Lists!P22&\"'!q14\")-1,IF(INDIRECT(\"'SPR \"&Lists!P22&\"'!q14\")=7,\"N/A\",\"\"))","v":""},{"$f":"IF(AND(INDIRECT(\"'SPR \"&Lists!P22&\"'!q18\")>1,INDIRECT(\"'SPR \"&Lists!P22&\"'!q18\")<7),INDIRECT(\"'SPR \"&Lists!P22&\"'!q18\")-1,IF(INDIRECT(\"'SPR \"&Lists!P22&\"'!q18\")=7,\"N/A\",\"\"))","v":""},{"$f":"IF(AND(INDIRECT(\"'SPR \"&Lists!P22&\"'!q21\")>1,INDIRECT(\"'SPR \"&Lists!P22&\"'!q21\")<7),INDIRECT(\"'SPR \"&Lists!P22&\"'!q21\")-1,IF(INDIRECT(\"'SPR \"&Lists!P22&\"'!q21\")=7,\"N/A\",\"\"))","v":""},{"$f":"IF(AND(INDIRECT(\"'SPR \"&Lists!P22&\"'!q24\")>1,INDIRECT(\"'SPR \"&Lists!P22&\"'!q24\")<7),INDIRECT(\"'SPR \"&Lists!P22&\"'!q24\")-1,IF(INDIRECT(\"'SPR \"&Lists!P22&\"'!q24\")=7,\"N/A\",\"\"))","v":""},{"$f":"IF(AND(INDIRECT(\"'SPR \"&Lists!P22&\"'!q28\")>1,INDIRECT(\"'SPR \"&Lists!P22&\"'!q28\")<7),INDIRECT(\"'SPR \"&Lists!P22&\"'!q28\")-1,IF(INDIRECT(\"'SPR \"&Lists!P22&\"'!q28\")=7,\"N/A\",\"\"))","v":""},null,0,"",null,{"$f":"IF(INDIRECT(\"'SPR \"&Lists!P22&\"'!P9\")=1,\"High\",IF(INDIRECT(\"'SPR \"&Lists!P22&\"'!P9\")=2,\"Medium\",IF(INDIRECT(\"'SPR \"&Lists!P22&\"'!P9\")=3,\"Low\",\"\")))","v":""},null,{"$f":"IF(INDIRECT(\"'SPR \"&Lists!P22&\"'!P34\")=1,\"No gap\",IF(INDIRECT(\"'SPR \"&Lists!P22&\"'!P34\")=2,\"Entirely the jurisdiction's responsibility\",IF(INDIRECT(\"'SPR \"&Lists!P22&\"'!P34\")=3,\"Mostly the jurisdiction's responsibility\",IF(INDIRECT(\"'SPR \"&Lists!P22&\"'!P34\")=4,\"Mostly higher-level government's responsibility\",IF(INDIRECT(\"'SPR \"&Lists!P22&\"'!P34\")=5,\"Entirely higher-level government's responsibility\",\"\")))))","v":""},null,null,"Mass Search and Rescue Operations","","",null,"Mass Search and Rescue Operations","","",null,"Mass Search and Rescue Operations","","",null,"Mass Search and Rescue Operations","","",null,"Mass Search and Rescue Operations","","",null,"Mass Search and Rescue Operations","",""]
[null,"On-scene Security and Protection",null,{"$f":"IF(AND(INDIRECT(\"'SPR \"&Lists!P23&\"'!P14\")>1,INDIRECT(\"'SPR \"&Lists!P23&\"'!P14\")<7),INDIRECT(\"'SPR \"&Lists!P23&\"'!P14\")-1,IF(INDIRECT(\"'SPR \"&Lists!P23&\"'!P14\")=7,\"N/A\",\"\"))","v":""},{"$f":"IF(AND(INDIRECT(\"'SPR \"&Lists!P23&\"'!P18\")>1,INDIRECT(\"'SPR \"&Lists!P23&\"'!P18\")<7),INDIRECT(\"'SPR \"&Lists!P23&\"'!P18\")-1,IF(INDIRECT(\"'SPR \"&Lists!P23&\"'!P18\")=7,\"N/A\",\"\"))","v":""},{"$f":"IF(AND(INDIRECT(\"'SPR \"&Lists!P23&\"'!P21\")>1,INDIRECT(\"'SPR \"&Lists!P23&\"'!P21\")<7),INDIRECT(\"'SPR \"&Lists!P23&\"'!P21\")-1,IF(INDIRECT(\"'SPR \"&Lists!P23&\"'!P21\")=7,\"N/A\",\"\"))","v":""},{"$f":"IF(AND(INDIRECT(\"'SPR \"&Lists!P23&\"'!P24\")>1,INDIRECT(\"'SPR \"&Lists!P23&\"'!P24\")<7),INDIRECT(\"'SPR \"&Lists!P23&\"'!P24\")-1,IF(INDIRECT(\"'SPR \"&Lists!P23&\"'!P24\")=7,\"N/A\",\"\"))","v":""},{"$f":"IF(AND(INDIRECT(\"'SPR \"&Lists!P23&\"'!P28\")>1,INDIRECT(\"'SPR \"&Lists!P23&\"'!P28\")<7),INDIRECT(\"'SPR \"&Lists!P23&\"'!P28\")-1,IF(INDIRECT(\"'SPR \"&Lists!P23&\"'!P28\")=7,\"N/A\",\"\"))","v":""},null,0,"",null,{"$f":"IF(AND(INDIRECT(\"'SPR \"&Lists!P23&\"'!q14\")>1,INDIRECT(\"'SPR \"&Lists!P23&\"'!q14\")<7),INDIRECT(\"'SPR \"&Lists!P23&\"'!q14\")-1,IF(INDIRECT(\"'SPR \"&Lists!P23&\"'!q14\")=7,\"N/A\",\"\"))","v":""},{"$f":"IF(AND(INDIRECT(\"'SPR \"&Lists!P23&\"'!q18\")>1,INDIRECT(\"'SPR \"&Lists!P23&\"'!q18\")<7),INDIRECT(\"'SPR \"&Lists!P23&\"'!q18\")-1,IF(INDIRECT(\"'SPR \"&Lists!P23&\"'!q18\")=7,\"N/A\",\"\"))","v":""},{"$f":"IF(AND(INDIRECT(\"'SPR \"&Lists!P23&\"'!q21\")>1,INDIRECT(\"'SPR \"&Lists!P23&\"'!q21\")<7),INDIRECT(\"'SPR \"&Lists!P23&\"'!q21\")-1,IF(INDIRECT(\"'SPR \"&Lists!P23&\"'!q21\")=7,\"N/A\",\"\"))","v":""},{"$f":"IF(AND(INDIRECT(\"'SPR \"&Lists!P23&\"'!q24\")>1,INDIRECT(\"'SPR \"&Lists!P23&\"'!q24\")<7),INDIRECT(\"'SPR \"&Lists!P23&\"'!q24\")-1,IF(INDIRECT(\"'SPR \"&Lists!P23&\"'!q24\")=7,\"N/A\",\"\"))","v":""},{"$f":"IF(AND(INDIRECT(\"'SPR \"&Lists!P23&\"'!q28\")>1,INDIRECT(\"'SPR \"&Lists!P23&\"'!q28\")<7),INDIRECT(\"'SPR \"&Lists!P23&\"'!q28\")-1,IF(INDIRECT(\"'SPR \"&Lists!P23&\"'!q28\")=7,\"N/A\",\"\"))","v":""},null,0,"",null,{"$f":"IF(INDIRECT(\"'SPR \"&Lists!P23&\"'!P9\")=1,\"High\",IF(INDIRECT(\"'SPR \"&Lists!P23&\"'!P9\")=2,\"Medium\",IF(INDIRECT(\"'SPR \"&Lists!P23&\"'!P9\")=3,\"Low\",\"\")))","v":""},null,{"$f":"IF(INDIRECT(\"'SPR \"&Lists!P23&\"'!P34\")=1,\"No gap\",IF(INDIRECT(\"'SPR \"&Lists!P23&\"'!P34\")=2,\"Entirely the jurisdiction's responsibility\",IF(INDIRECT(\"'SPR \"&Lists!P23&\"'!P34\")=3,\"Mostly the jurisdiction's responsibility\",IF(INDIRECT(\"'SPR \"&Lists!P23&\"'!P34\")=4,\"Mostly higher-level government's responsibility\",IF(INDIRECT(\"'SPR \"&Lists!P23&\"'!P34\")=5,\"Entirely higher-level government's responsibility\",\"\")))))","v":""},null,null,"On-scene Security and Protection","","",null,"On-scene Security and Protection","","",null,"On-scene Security and Protection","","",null,"On-scene Security and Protection","","",null,"On-scene Security and Protection","","",null,"On-scene Security and Protection","",""]
[null,"Operational  Communications",null,{"$f":"IF(AND(INDIRECT(\"'SPR \"&Lists!P24&\"'!P14\")>1,INDIRECT(\"'SPR \"&Lists!P24&\"'!P14\")<7),INDIRECT(\"'SPR \"&Lists!P24&\"'!P14\")-1,IF(INDIRECT(\"'SPR \"&Lists!P24&\"'!P14\")=7,\"N/A\",\"\"))","v":""},{"$f":"IF(AND(INDIRECT(\"'SPR \"&Lists!P24&\"'!P18\")>1,INDIRECT(\"'SPR \"&Lists!P24&\"'!P18\")<7),INDIRECT(\"'SPR \"&Lists!P24&\"'!P18\")-1,IF(INDIRECT(\"'SPR \"&Lists!P24&\"'!P18\")=7,\"N/A\",\"\"))","v":""},{"$f":"IF(AND(INDIRECT(\"'SPR \"&Lists!P24&\"'!P21\")>1,INDIRECT(\"'SPR \"&Lists!P24&\"'!P21\")<7),INDIRECT(\"'SPR \"&Lists!P24&\"'!P21\")-1,IF(INDIRECT(\"'SPR \"&Lists!P24&\"'!P21\")=7,\"N/A\",\"\"))","v":""},{"$f":"IF(AND(INDIRECT(\"'SPR \"&Lists!P24&\"'!P24\")>1,INDIRECT(\"'SPR \"&Lists!P24&\"'!P24\")<7),INDIRECT(\"'SPR \"&Lists!P24&\"'!P24\")-1,IF(INDIRECT(\"'SPR \"&Lists!P24&\"'!P24\")=7,\"N/A\",\"\"))","v":""},{"$f":"IF(AND(INDIRECT(\"'SPR \"&Lists!P24&\"'!P28\")>1,INDIRECT(\"'SPR \"&Lists!P24&\"'!P28\")<7),INDIRECT(\"'SPR \"&Lists!P24&\"'!P28\")-1,IF(INDIRECT(\"'SPR \"&Lists!P24&\"'!P28\")=7,\"N/A\",\"\"))","v":""},null,0,"",null,{"$f":"IF(AND(INDIRECT(\"'SPR \"&Lists!P24&\"'!q14\")>1,INDIRECT(\"'SPR \"&Lists!P24&\"'!q14\")<7),INDIRECT(\"'SPR \"&Lists!P24&\"'!q14\")-1,IF(INDIRECT(\"'SPR \"&Lists!P24&\"'!q14\")=7,\"N/A\",\"\"))","v":""},{"$f":"IF(AND(INDIRECT(\"'SPR \"&Lists!P24&\"'!q18\")>1,INDIRECT(\"'SPR \"&Lists!P24&\"'!q18\")<7),INDIRECT(\"'SPR \"&Lists!P24&\"'!q18\")-1,IF(INDIRECT(\"'SPR \"&Lists!P24&\"'!q18\")=7,\"N/A\",\"\"))","v":""},{"$f":"IF(AND(INDIRECT(\"'SPR \"&Lists!P24&\"'!q21\")>1,INDIRECT(\"'SPR \"&Lists!P24&\"'!q21\")<7),INDIRECT(\"'SPR \"&Lists!P24&\"'!q21\")-1,IF(INDIRECT(\"'SPR \"&Lists!P24&\"'!q21\")=7,\"N/A\",\"\"))","v":""},{"$f":"IF(AND(INDIRECT(\"'SPR \"&Lists!P24&\"'!q24\")>1,INDIRECT(\"'SPR \"&Lists!P24&\"'!q24\")<7),INDIRECT(\"'SPR \"&Lists!P24&\"'!q24\")-1,IF(INDIRECT(\"'SPR \"&Lists!P24&\"'!q24\")=7,\"N/A\",\"\"))","v":""},{"$f":"IF(AND(INDIRECT(\"'SPR \"&Lists!P24&\"'!q28\")>1,INDIRECT(\"'SPR \"&Lists!P24&\"'!q28\")<7),INDIRECT(\"'SPR \"&Lists!P24&\"'!q28\")-1,IF(INDIRECT(\"'SPR \"&Lists!P24&\"'!q28\")=7,\"N/A\",\"\"))","v":""},null,0,"",null,{"$f":"IF(INDIRECT(\"'SPR \"&Lists!P24&\"'!P9\")=1,\"High\",IF(INDIRECT(\"'SPR \"&Lists!P24&\"'!P9\")=2,\"Medium\",IF(INDIRECT(\"'SPR \"&Lists!P24&\"'!P9\")=3,\"Low\",\"\")))","v":""},null,{"$f":"IF(INDIRECT(\"'SPR \"&Lists!P24&\"'!P34\")=1,\"No gap\",IF(INDIRECT(\"'SPR \"&Lists!P24&\"'!P34\")=2,\"Entirely the jurisdiction's responsibility\",IF(INDIRECT(\"'SPR \"&Lists!P24&\"'!P34\")=3,\"Mostly the jurisdiction's responsibility\",IF(INDIRECT(\"'SPR \"&Lists!P24&\"'!P34\")=4,\"Mostly higher-level government's responsibility\",IF(INDIRECT(\"'SPR \"&Lists!P24&\"'!P34\")=5,\"Entirely higher-level government's responsibility\",\"\")))))","v":""},null,null,"Operational  Communications","","",null,"Operational  Communications","","",null,"Operational  Communications","","",null,"Operational  Communications","","",null,"Operational  Communications","","",null,"Operational  Communications","",""]
[null,"Public and Private Services and Resources",null,{"$f":"IF(AND(INDIRECT(\"'SPR \"&Lists!P25&\"'!P14\")>1,INDIRECT(\"'SPR \"&Lists!P25&\"'!P14\")<7),INDIRECT(\"'SPR \"&Lists!P25&\"'!P14\")-1,IF(INDIRECT(\"'SPR \"&Lists!P25&\"'!P14\")=7,\"N/A\",\"\"))","v":""},{"$f":"IF(AND(INDIRECT(\"'SPR \"&Lists!P25&\"'!P18\")>1,INDIRECT(\"'SPR \"&Lists!P25&\"'!P18\")<7),INDIRECT(\"'SPR \"&Lists!P25&\"'!P18\")-1,IF(INDIRECT(\"'SPR \"&Lists!P25&\"'!P18\")=7,\"N/A\",\"\"))","v":""},{"$f":"IF(AND(INDIRECT(\"'SPR \"&Lists!P25&\"'!P21\")>1,INDIRECT(\"'SPR \"&Lists!P25&\"'!P21\")<7),INDIRECT(\"'SPR \"&Lists!P25&\"'!P21\")-1,IF(INDIRECT(\"'SPR \"&Lists!P25&\"'!P21\")=7,\"N/A\",\"\"))","v":""},{"$f":"IF(AND(INDIRECT(\"'SPR \"&Lists!P25&\"'!P24\")>1,INDIRECT(\"'SPR \"&Lists!P25&\"'!P24\")<7),INDIRECT(\"'SPR \"&Lists!P25&\"'!P24\")-1,IF(INDIRECT(\"'SPR \"&Lists!P25&\"'!P24\")=7,\"N/A\",\"\"))","v":""},{"$f":"IF(AND(INDIRECT(\"'SPR \"&Lists!P25&\"'!P28\")>1,INDIRECT(\"'SPR \"&Lists!P25&\"'!P28\")<7),INDIRECT(\"'SPR \"&Lists!P25&\"'!P28\")-1,IF(INDIRECT(\"'SPR \"&Lists!P25&\"'!P28\")=7,\"N/A\",\"\"))","v":""},null,0,"",null,{"$f":"IF(AND(INDIRECT(\"'SPR \"&Lists!P25&\"'!q14\")>1,INDIRECT(\"'SPR \"&Lists!P25&\"'!q14\")<7),INDIRECT(\"'SPR \"&Lists!P25&\"'!q14\")-1,IF(INDIRECT(\"'SPR \"&Lists!P25&\"'!q14\")=7,\"N/A\",\"\"))","v":""},{"$f":"IF(AND(INDIRECT(\"'SPR \"&Lists!P25&\"'!q18\")>1,INDIRECT(\"'SPR \"&Lists!P25&\"'!q18\")<7),INDIRECT(\"'SPR \"&Lists!P25&\"'!q18\")-1,IF(INDIRECT(\"'SPR \"&Lists!P25&\"'!q18\")=7,\"N/A\",\"\"))","v":""},{"$f":"IF(AND(INDIRECT(\"'SPR \"&Lists!P25&\"'!q21\")>1,INDIRECT(\"'SPR \"&Lists!P25&\"'!q21\")<7),INDIRECT(\"'SPR \"&Lists!P25&\"'!q21\")-1,IF(INDIRECT(\"'SPR \"&Lists!P25&\"'!q21\")=7,\"N/A\",\"\"))","v":""},{"$f":"IF(AND(INDIRECT(\"'SPR \"&Lists!P25&\"'!q24\")>1,INDIRECT(\"'SPR \"&Lists!P25&\"'!q24\")<7),INDIRECT(\"'SPR \"&Lists!P25&\"'!q24\")-1,IF(INDIRECT(\"'SPR \"&Lists!P25&\"'!q24\")=7,\"N/A\",\"\"))","v":""},{"$f":"IF(AND(INDIRECT(\"'SPR \"&Lists!P25&\"'!q28\")>1,INDIRECT(\"'SPR \"&Lists!P25&\"'!q28\")<7),INDIRECT(\"'SPR \"&Lists!P25&\"'!q28\")-1,IF(INDIRECT(\"'SPR \"&Lists!P25&\"'!q28\")=7,\"N/A\",\"\"))","v":""},null,0,"",null,{"$f":"IF(INDIRECT(\"'SPR \"&Lists!P25&\"'!P9\")=1,\"High\",IF(INDIRECT(\"'SPR \"&Lists!P25&\"'!P9\")=2,\"Medium\",IF(INDIRECT(\"'SPR \"&Lists!P25&\"'!P9\")=3,\"Low\",\"\")))","v":""},null,{"$f":"IF(INDIRECT(\"'SPR \"&Lists!P25&\"'!P34\")=1,\"No gap\",IF(INDIRECT(\"'SPR \"&Lists!P25&\"'!P34\")=2,\"Entirely the jurisdiction's responsibility\",IF(INDIRECT(\"'SPR \"&Lists!P25&\"'!P34\")=3,\"Mostly the jurisdiction's responsibility\",IF(INDIRECT(\"'SPR \"&Lists!P25&\"'!P34\")=4,\"Mostly higher-level government's responsibility\",IF(INDIRECT(\"'SPR \"&Lists!P25&\"'!P34\")=5,\"Entirely higher-level government's responsibility\",\"\")))))","v":""},null,null,"Public and Private Services and Resources","","",null,"Public and Private Services and Resources","","",null,"Public and Private Services and Resources","","",null,"Public and Private Services and Resources","","",null,"Public and Private Services and Resources","","",null,"Public and Private Services and Resources","",""]
[null,"Public Health and Medical Services",null,{"$f":"IF(AND(INDIRECT(\"'SPR \"&Lists!P26&\"'!P14\")>1,INDIRECT(\"'SPR \"&Lists!P26&\"'!P14\")<7),INDIRECT(\"'SPR \"&Lists!P26&\"'!P14\")-1,IF(INDIRECT(\"'SPR \"&Lists!P26&\"'!P14\")=7,\"N/A\",\"\"))","v":""},{"$f":"IF(AND(INDIRECT(\"'SPR \"&Lists!P26&\"'!P18\")>1,INDIRECT(\"'SPR \"&Lists!P26&\"'!P18\")<7),INDIRECT(\"'SPR \"&Lists!P26&\"'!P18\")-1,IF(INDIRECT(\"'SPR \"&Lists!P26&\"'!P18\")=7,\"N/A\",\"\"))","v":""},{"$f":"IF(AND(INDIRECT(\"'SPR \"&Lists!P26&\"'!P21\")>1,INDIRECT(\"'SPR \"&Lists!P26&\"'!P21\")<7),INDIRECT(\"'SPR \"&Lists!P26&\"'!P21\")-1,IF(INDIRECT(\"'SPR \"&Lists!P26&\"'!P21\")=7,\"N/A\",\"\"))","v":""},{"$f":"IF(AND(INDIRECT(\"'SPR \"&Lists!P26&\"'!P24\")>1,INDIRECT(\"'SPR \"&Lists!P26&\"'!P24\")<7),INDIRECT(\"'SPR \"&Lists!P26&\"'!P24\")-1,IF(INDIRECT(\"'SPR \"&Lists!P26&\"'!P24\")=7,\"N/A\",\"\"))","v":""},{"$f":"IF(AND(INDIRECT(\"'SPR \"&Lists!P26&\"'!P28\")>1,INDIRECT(\"'SPR \"&Lists!P26&\"'!P28\")<7),INDIRECT(\"'SPR \"&Lists!P26&\"'!P28\")-1,IF(INDIRECT(\"'SPR \"&Lists!P26&\"'!P28\")=7,\"N/A\",\"\"))","v":""},null,0,"",null,{"$f":"IF(AND(INDIRECT(\"'SPR \"&Lists!P26&\"'!q14\")>1,INDIRECT(\"'SPR \"&Lists!P26&\"'!q14\")<7),INDIRECT(\"'SPR \"&Lists!P26&\"'!q14\")-1,IF(INDIRECT(\"'SPR \"&Lists!P26&\"'!q14\")=7,\"N/A\",\"\"))","v":""},{"$f":"IF(AND(INDIRECT(\"'SPR \"&Lists!P26&\"'!q18\")>1,INDIRECT(\"'SPR \"&Lists!P26&\"'!q18\")<7),INDIRECT(\"'SPR \"&Lists!P26&\"'!q18\")-1,IF(INDIRECT(\"'SPR \"&Lists!P26&\"'!q18\")=7,\"N/A\",\"\"))","v":""},{"$f":"IF(AND(INDIRECT(\"'SPR \"&Lists!P26&\"'!q21\")>1,INDIRECT(\"'SPR \"&Lists!P26&\"'!q21\")<7),INDIRECT(\"'SPR \"&Lists!P26&\"'!q21\")-1,IF(INDIRECT(\"'SPR \"&Lists!P26&\"'!q21\")=7,\"N/A\",\"\"))","v":""},{"$f":"IF(AND(INDIRECT(\"'SPR \"&Lists!P26&\"'!q24\")>1,INDIRECT(\"'SPR \"&Lists!P26&\"'!q24\")<7),INDIRECT(\"'SPR \"&Lists!P26&\"'!q24\")-1,IF(INDIRECT(\"'SPR \"&Lists!P26&\"'!q24\")=7,\"N/A\",\"\"))","v":""},{"$f":"IF(AND(INDIRECT(\"'SPR \"&Lists!P26&\"'!q28\")>1,INDIRECT(\"'SPR \"&Lists!P26&\"'!q28\")<7),INDIRECT(\"'SPR \"&Lists!P26&\"'!q28\")-1,IF(INDIRECT(\"'SPR \"&Lists!P26&\"'!q28\")=7,\"N/A\",\"\"))","v":""},null,0,"",null,{"$f":"IF(INDIRECT(\"'SPR \"&Lists!P26&\"'!P9\")=1,\"High\",IF(INDIRECT(\"'SPR \"&Lists!P26&\"'!P9\")=2,\"Medium\",IF(INDIRECT(\"'SPR \"&Lists!P26&\"'!P9\")=3,\"Low\",\"\")))","v":""},null,{"$f":"IF(INDIRECT(\"'SPR \"&Lists!P26&\"'!P34\")=1,\"No gap\",IF(INDIRECT(\"'SPR \"&Lists!P26&\"'!P34\")=2,\"Entirely the jurisdiction's responsibility\",IF(INDIRECT(\"'SPR \"&Lists!P26&\"'!P34\")=3,\"Mostly the jurisdiction's responsibility\",IF(INDIRECT(\"'SPR \"&Lists!P26&\"'!P34\")=4,\"Mostly higher-level government's responsibility\",IF(INDIRECT(\"'SPR \"&Lists!P26&\"'!P34\")=5,\"Entirely higher-level government's responsibility\",\"\")))))","v":""},null,null,"Public Health and Medical Services","","",null,"Public Health and Medical Services","","",null,"Public Health and Medical Services","","",null,"Public Health and Medical Services","","",null,"Public Health and Medical Services","","",null,"Public Health and Medical Services","",""]
[null,"Situational Assessment",null,{"$f":"IF(AND(INDIRECT(\"'SPR \"&Lists!P27&\"'!P14\")>1,INDIRECT(\"'SPR \"&Lists!P27&\"'!P14\")<7),INDIRECT(\"'SPR \"&Lists!P27&\"'!P14\")-1,IF(INDIRECT(\"'SPR \"&Lists!P27&\"'!P14\")=7,\"N/A\",\"\"))","v":""},{"$f":"IF(AND(INDIRECT(\"'SPR \"&Lists!P27&\"'!P18\")>1,INDIRECT(\"'SPR \"&Lists!P27&\"'!P18\")<7),INDIRECT(\"'SPR \"&Lists!P27&\"'!P18\")-1,IF(INDIRECT(\"'SPR \"&Lists!P27&\"'!P18\")=7,\"N/A\",\"\"))","v":""},{"$f":"IF(AND(INDIRECT(\"'SPR \"&Lists!P27&\"'!P21\")>1,INDIRECT(\"'SPR \"&Lists!P27&\"'!P21\")<7),INDIRECT(\"'SPR \"&Lists!P27&\"'!P21\")-1,IF(INDIRECT(\"'SPR \"&Lists!P27&\"'!P21\")=7,\"N/A\",\"\"))","v":""},{"$f":"IF(AND(INDIRECT(\"'SPR \"&Lists!P27&\"'!P24\")>1,INDIRECT(\"'SPR \"&Lists!P27&\"'!P24\")<7),INDIRECT(\"'SPR \"&Lists!P27&\"'!P24\")-1,IF(INDIRECT(\"'SPR \"&Lists!P27&\"'!P24\")=7,\"N/A\",\"\"))","v":""},{"$f":"IF(AND(INDIRECT(\"'SPR \"&Lists!P27&\"'!P28\")>1,INDIRECT(\"'SPR \"&Lists!P27&\"'!P28\")<7),INDIRECT(\"'SPR \"&Lists!P27&\"'!P28\")-1,IF(INDIRECT(\"'SPR \"&Lists!P27&\"'!P28\")=7,\"N/A\",\"\"))","v":""},null,0,"",null,{"$f":"IF(AND(INDIRECT(\"'SPR \"&Lists!P27&\"'!q14\")>1,INDIRECT(\"'SPR \"&Lists!P27&\"'!q14\")<7),INDIRECT(\"'SPR \"&Lists!P27&\"'!q14\")-1,IF(INDIRECT(\"'SPR \"&Lists!P27&\"'!q14\")=7,\"N/A\",\"\"))","v":""},{"$f":"IF(AND(INDIRECT(\"'SPR \"&Lists!P27&\"'!q18\")>1,INDIRECT(\"'SPR \"&Lists!P27&\"'!q18\")<7),INDIRECT(\"'SPR \"&Lists!P27&\"'!q18\")-1,IF(INDIRECT(\"'SPR \"&Lists!P27&\"'!q18\")=7,\"N/A\",\"\"))","v":""},{"$f":"IF(AND(INDIRECT(\"'SPR \"&Lists!P27&\"'!q21\")>1,INDIRECT(\"'SPR \"&Lists!P27&\"'!q21\")<7),INDIRECT(\"'SPR \"&Lists!P27&\"'!q21\")-1,IF(INDIRECT(\"'SPR \"&Lists!P27&\"'!q21\")=7,\"N/A\",\"\"))","v":""},{"$f":"IF(AND(INDIRECT(\"'SPR \"&Lists!P27&\"'!q24\")>1,INDIRECT(\"'SPR \"&Lists!P27&\"'!q24\")<7),INDIRECT(\"'SPR \"&Lists!P27&\"'!q24\")-1,IF(INDIRECT(\"'SPR \"&Lists!P27&\"'!q24\")=7,\"N/A\",\"\"))","v":""},{"$f":"IF(AND(INDIRECT(\"'SPR \"&Lists!P27&\"'!q28\")>1,INDIRECT(\"'SPR \"&Lists!P27&\"'!q28\")<7),INDIRECT(\"'SPR \"&Lists!P27&\"'!q28\")-1,IF(INDIRECT(\"'SPR \"&Lists!P27&\"'!q28\")=7,\"N/A\",\"\"))","v":""},null,0,"",null,{"$f":"IF(INDIRECT(\"'SPR \"&Lists!P27&\"'!P9\")=1,\"High\",IF(INDIRECT(\"'SPR \"&Lists!P27&\"'!P9\")=2,\"Medium\",IF(INDIRECT(\"'SPR \"&Lists!P27&\"'!P9\")=3,\"Low\",\"\")))","v":""},null,{"$f":"IF(INDIRECT(\"'SPR \"&Lists!P27&\"'!P34\")=1,\"No gap\",IF(INDIRECT(\"'SPR \"&Lists!P27&\"'!P34\")=2,\"Entirely the jurisdiction's responsibility\",IF(INDIRECT(\"'SPR \"&Lists!P27&\"'!P34\")=3,\"Mostly the jurisdiction's responsibility\",IF(INDIRECT(\"'SPR \"&Lists!P27&\"'!P34\")=4,\"Mostly higher-level government's responsibility\",IF(INDIRECT(\"'SPR \"&Lists!P27&\"'!P34\")=5,\"Entirely higher-level government's responsibility\",\"\")))))","v":""},null,null,"Situational Assessment","","",null,"Situational Assessment","","",null,"Situational Assessment","","",null,"Situational Assessment","","",null,"Situational Assessment","","",null,"Situational Assessment","",""]
[null,"Economic Recovery",null,{"$f":"IF(AND(INDIRECT(\"'SPR \"&Lists!P28&\"'!P14\")>1,INDIRECT(\"'SPR \"&Lists!P28&\"'!P14\")<7),INDIRECT(\"'SPR \"&Lists!P28&\"'!P14\")-1,IF(INDIRECT(\"'SPR \"&Lists!P28&\"'!P14\")=7,\"N/A\",\"\"))","v":""},{"$f":"IF(AND(INDIRECT(\"'SPR \"&Lists!P28&\"'!P18\")>1,INDIRECT(\"'SPR \"&Lists!P28&\"'!P18\")<7),INDIRECT(\"'SPR \"&Lists!P28&\"'!P18\")-1,IF(INDIRECT(\"'SPR \"&Lists!P28&\"'!P18\")=7,\"N/A\",\"\"))","v":""},{"$f":"IF(AND(INDIRECT(\"'SPR \"&Lists!P28&\"'!P21\")>1,INDIRECT(\"'SPR \"&Lists!P28&\"'!P21\")<7),INDIRECT(\"'SPR \"&Lists!P28&\"'!P21\")-1,IF(INDIRECT(\"'SPR \"&Lists!P28&\"'!P21\")=7,\"N/A\",\"\"))","v":""},{"$f":"IF(AND(INDIRECT(\"'SPR \"&Lists!P28&\"'!P24\")>1,INDIRECT(\"'SPR \"&Lists!P28&\"'!P24\")<7),INDIRECT(\"'SPR \"&Lists!P28&\"'!P24\")-1,IF(INDIRECT(\"'SPR \"&Lists!P28&\"'!P24\")=7,\"N/A\",\"\"))","v":""},{"$f":"IF(AND(INDIRECT(\"'SPR \"&Lists!P28&\"'!P28\")>1,INDIRECT(\"'SPR \"&Lists!P28&\"'!P28\")<7),INDIRECT(\"'SPR \"&Lists!P28&\"'!P28\")-1,IF(INDIRECT(\"'SPR \"&Lists!P28&\"'!P28\")=7,\"N/A\",\"\"))","v":""},null,0,"",null,{"$f":"IF(AND(INDIRECT(\"'SPR \"&Lists!P28&\"'!q14\")>1,INDIRECT(\"'SPR \"&Lists!P28&\"'!q14\")<7),INDIRECT(\"'SPR \"&Lists!P28&\"'!q14\")-1,IF(INDIRECT(\"'SPR \"&Lists!P28&\"'!q14\")=7,\"N/A\",\"\"))","v":""},{"$f":"IF(AND(INDIRECT(\"'SPR \"&Lists!P28&\"'!q18\")>1,INDIRECT(\"'SPR \"&Lists!P28&\"'!q18\")<7),INDIRECT(\"'SPR \"&Lists!P28&\"'!q18\")-1,IF(INDIRECT(\"'SPR \"&Lists!P28&\"'!q18\")=7,\"N/A\",\"\"))","v":""},{"$f":"IF(AND(INDIRECT(\"'SPR \"&Lists!P28&\"'!q21\")>1,INDIRECT(\"'SPR \"&Lists!P28&\"'!q21\")<7),INDIRECT(\"'SPR \"&Lists!P28&\"'!q21\")-1,IF(INDIRECT(\"'SPR \"&Lists!P28&\"'!q21\")=7,\"N/A\",\"\"))","v":""},{"$f":"IF(AND(INDIRECT(\"'SPR \"&Lists!P28&\"'!q24\")>1,INDIRECT(\"'SPR \"&Lists!P28&\"'!q24\")<7),INDIRECT(\"'SPR \"&Lists!P28&\"'!q24\")-1,IF(INDIRECT(\"'SPR \"&Lists!P28&\"'!q24\")=7,\"N/A\",\"\"))","v":""},{"$f":"IF(AND(INDIRECT(\"'SPR \"&Lists!P28&\"'!q28\")>1,INDIRECT(\"'SPR \"&Lists!P28&\"'!q28\")<7),INDIRECT(\"'SPR \"&Lists!P28&\"'!q28\")-1,IF(INDIRECT(\"'SPR \"&Lists!P28&\"'!q28\")=7,\"N/A\",\"\"))","v":""},null,0,"",null,{"$f":"IF(INDIRECT(\"'SPR \"&Lists!P28&\"'!P9\")=1,\"High\",IF(INDIRECT(\"'SPR \"&Lists!P28&\"'!P9\")=2,\"Medium\",IF(INDIRECT(\"'SPR \"&Lists!P28&\"'!P9\")=3,\"Low\",\"\")))","v":""},null,{"$f":"IF(INDIRECT(\"'SPR \"&Lists!P28&\"'!P34\")=1,\"No gap\",IF(INDIRECT(\"'SPR \"&Lists!P28&\"'!P34\")=2,\"Entirely the jurisdiction's responsibility\",IF(INDIRECT(\"'SPR \"&Lists!P28&\"'!P34\")=3,\"Mostly the jurisdiction's responsibility\",IF(INDIRECT(\"'SPR \"&Lists!P28&\"'!P34\")=4,\"Mostly higher-level government's responsibility\",IF(INDIRECT(\"'SPR \"&Lists!P28&\"'!P34\")=5,\"Entirely higher-level government's responsibility\",\"\")))))","v":""},null,null,"Economic Recovery","","",null,"Economic Recovery","","",null,"Economic Recovery","","",null,"Economic Recovery","","",null,"Economic Recovery","","",null,"Economic Recovery","",""]
[null,"Health and Social Services",null,{"$f":"IF(AND(INDIRECT(\"'SPR \"&Lists!P29&\"'!P14\")>1,INDIRECT(\"'SPR \"&Lists!P29&\"'!P14\")<7),INDIRECT(\"'SPR \"&Lists!P29&\"'!P14\")-1,IF(INDIRECT(\"'SPR \"&Lists!P29&\"'!P14\")=7,\"N/A\",\"\"))","v":""},{"$f":"IF(AND(INDIRECT(\"'SPR \"&Lists!P29&\"'!P18\")>1,INDIRECT(\"'SPR \"&Lists!P29&\"'!P18\")<7),INDIRECT(\"'SPR \"&Lists!P29&\"'!P18\")-1,IF(INDIRECT(\"'SPR \"&Lists!P29&\"'!P18\")=7,\"N/A\",\"\"))","v":""},{"$f":"IF(AND(INDIRECT(\"'SPR \"&Lists!P29&\"'!P21\")>1,INDIRECT(\"'SPR \"&Lists!P29&\"'!P21\")<7),INDIRECT(\"'SPR \"&Lists!P29&\"'!P21\")-1,IF(INDIRECT(\"'SPR \"&Lists!P29&\"'!P21\")=7,\"N/A\",\"\"))","v":""},{"$f":"IF(AND(INDIRECT(\"'SPR \"&Lists!P29&\"'!P24\")>1,INDIRECT(\"'SPR \"&Lists!P29&\"'!P24\")<7),INDIRECT(\"'SPR \"&Lists!P29&\"'!P24\")-1,IF(INDIRECT(\"'SPR \"&Lists!P29&\"'!P24\")=7,\"N/A\",\"\"))","v":""},{"$f":"IF(AND(INDIRECT(\"'SPR \"&Lists!P29&\"'!P28\")>1,INDIRECT(\"'SPR \"&Lists!P29&\"'!P28\")<7),INDIRECT(\"'SPR \"&Lists!P29&\"'!P28\")-1,IF(INDIRECT(\"'SPR \"&Lists!P29&\"'!P28\")=7,\"N/A\",\"\"))","v":""},null,0,"",null,{"$f":"IF(AND(INDIRECT(\"'SPR \"&Lists!P29&\"'!q14\")>1,INDIRECT(\"'SPR \"&Lists!P29&\"'!q14\")<7),INDIRECT(\"'SPR \"&Lists!P29&\"'!q14\")-1,IF(INDIRECT(\"'SPR \"&Lists!P29&\"'!q14\")=7,\"N/A\",\"\"))","v":""},{"$f":"IF(AND(INDIRECT(\"'SPR \"&Lists!P29&\"'!q18\")>1,INDIRECT(\"'SPR \"&Lists!P29&\"'!q18\")<7),INDIRECT(\"'SPR \"&Lists!P29&\"'!q18\")-1,IF(INDIRECT(\"'SPR \"&Lists!P29&\"'!q18\")=7,\"N/A\",\"\"))","v":""},{"$f":"IF(AND(INDIRECT(\"'SPR \"&Lists!P29&\"'!q21\")>1,INDIRECT(\"'SPR \"&Lists!P29&\"'!q21\")<7),INDIRECT(\"'SPR \"&Lists!P29&\"'!q21\")-1,IF(INDIRECT(\"'SPR \"&Lists!P29&\"'!q21\")=7,\"N/A\",\"\"))","v":""},{"$f":"IF(AND(INDIRECT(\"'SPR \"&Lists!P29&\"'!q24\")>1,INDIRECT(\"'SPR \"&Lists!P29&\"'!q24\")<7),INDIRECT(\"'SPR \"&Lists!P29&\"'!q24\")-1,IF(INDIRECT(\"'SPR \"&Lists!P29&\"'!q24\")=7,\"N/A\",\"\"))","v":""},{"$f":"IF(AND(INDIRECT(\"'SPR \"&Lists!P29&\"'!q28\")>1,INDIRECT(\"'SPR \"&Lists!P29&\"'!q28\")<7),INDIRECT(\"'SPR \"&Lists!P29&\"'!q28\")-1,IF(INDIRECT(\"'SPR \"&Lists!P29&\"'!q28\")=7,\"N/A\",\"\"))","v":""},null,0,"",null,{"$f":"IF(INDIRECT(\"'SPR \"&Lists!P29&\"'!P9\")=1,\"High\",IF(INDIRECT(\"'SPR \"&Lists!P29&\"'!P9\")=2,\"Medium\",IF(INDIRECT(\"'SPR \"&Lists!P29&\"'!P9\")=3,\"Low\",\"\")))","v":""},null,{"$f":"IF(INDIRECT(\"'SPR \"&Lists!P29&\"'!P34\")=1,\"No gap\",IF(INDIRECT(\"'SPR \"&Lists!P29&\"'!P34\")=2,\"Entirely the jurisdiction's responsibility\",IF(INDIRECT(\"'SPR \"&Lists!P29&\"'!P34\")=3,\"Mostly the jurisdiction's responsibility\",IF(INDIRECT(\"'SPR \"&Lists!P29&\"'!P34\")=4,\"Mostly higher-level government's responsibility\",IF(INDIRECT(\"'SPR \"&Lists!P29&\"'!P34\")=5,\"Entirely higher-level government's responsibility\",\"\")))))","v":""},null,null,"Health and Social Services","","",null,"Health and Social Services","","",null,"Health and Social Services","","",null,"Health and Social Services","","",null,"Health and Social Services","","",null,"Health and Social Services","",""]
[null,"Housing",null,{"$f":"IF(AND(INDIRECT(\"'SPR \"&Lists!P30&\"'!P14\")>1,INDIRECT(\"'SPR \"&Lists!P30&\"'!P14\")<7),INDIRECT(\"'SPR \"&Lists!P30&\"'!P14\")-1,IF(INDIRECT(\"'SPR \"&Lists!P30&\"'!P14\")=7,\"N/A\",\"\"))","v":""},{"$f":"IF(AND(INDIRECT(\"'SPR \"&Lists!P30&\"'!P18\")>1,INDIRECT(\"'SPR \"&Lists!P30&\"'!P18\")<7),INDIRECT(\"'SPR \"&Lists!P30&\"'!P18\")-1,IF(INDIRECT(\"'SPR \"&Lists!P30&\"'!P18\")=7,\"N/A\",\"\"))","v":""},{"$f":"IF(AND(INDIRECT(\"'SPR \"&Lists!P30&\"'!P21\")>1,INDIRECT(\"'SPR \"&Lists!P30&\"'!P21\")<7),INDIRECT(\"'SPR \"&Lists!P30&\"'!P21\")-1,IF(INDIRECT(\"'SPR \"&Lists!P30&\"'!P21\")=7,\"N/A\",\"\"))","v":""},{"$f":"IF(AND(INDIRECT(\"'SPR \"&Lists!P30&\"'!P24\")>1,INDIRECT(\"'SPR \"&Lists!P30&\"'!P24\")<7),INDIRECT(\"'SPR \"&Lists!P30&\"'!P24\")-1,IF(INDIRECT(\"'SPR \"&Lists!P30&\"'!P24\")=7,\"N/A\",\"\"))","v":""},{"$f":"IF(AND(INDIRECT(\"'SPR \"&Lists!P30&\"'!P28\")>1,INDIRECT(\"'SPR \"&Lists!P30&\"'!P28\")<7),INDIRECT(\"'SPR \"&Lists!P30&\"'!P28\")-1,IF(INDIRECT(\"'SPR \"&Lists!P30&\"'!P28\")=7,\"N/A\",\"\"))","v":""},null,0,"",null,{"$f":"IF(AND(INDIRECT(\"'SPR \"&Lists!P30&\"'!q14\")>1,INDIRECT(\"'SPR \"&Lists!P30&\"'!q14\")<7),INDIRECT(\"'SPR \"&Lists!P30&\"'!q14\")-1,IF(INDIRECT(\"'SPR \"&Lists!P30&\"'!q14\")=7,\"N/A\",\"\"))","v":""},{"$f":"IF(AND(INDIRECT(\"'SPR \"&Lists!P30&\"'!q18\")>1,INDIRECT(\"'SPR \"&Lists!P30&\"'!q18\")<7),INDIRECT(\"'SPR \"&Lists!P30&\"'!q18\")-1,IF(INDIRECT(\"'SPR \"&Lists!P30&\"'!q18\")=7,\"N/A\",\"\"))","v":""},{"$f":"IF(AND(INDIRECT(\"'SPR \"&Lists!P30&\"'!q21\")>1,INDIRECT(\"'SPR \"&Lists!P30&\"'!q21\")<7),INDIRECT(\"'SPR \"&Lists!P30&\"'!q21\")-1,IF(INDIRECT(\"'SPR \"&Lists!P30&\"'!q21\")=7,\"N/A\",\"\"))","v":""},{"$f":"IF(AND(INDIRECT(\"'SPR \"&Lists!P30&\"'!q24\")>1,INDIRECT(\"'SPR \"&Lists!P30&\"'!q24\")<7),INDIRECT(\"'SPR \"&Lists!P30&\"'!q24\")-1,IF(INDIRECT(\"'SPR \"&Lists!P30&\"'!q24\")=7,\"N/A\",\"\"))","v":""},{"$f":"IF(AND(INDIRECT(\"'SPR \"&Lists!P30&\"'!q28\")>1,INDIRECT(\"'SPR \"&Lists!P30&\"'!q28\")<7),INDIRECT(\"'SPR \"&Lists!P30&\"'!q28\")-1,IF(INDIRECT(\"'SPR \"&Lists!P30&\"'!q28\")=7,\"N/A\",\"\"))","v":""},null,0,"",null,{"$f":"IF(INDIRECT(\"'SPR \"&Lists!P30&\"'!P9\")=1,\"High\",IF(INDIRECT(\"'SPR \"&Lists!P30&\"'!P9\")=2,\"Medium\",IF(INDIRECT(\"'SPR \"&Lists!P30&\"'!P9\")=3,\"Low\",\"\")))","v":""},null,{"$f":"IF(INDIRECT(\"'SPR \"&Lists!P30&\"'!P34\")=1,\"No gap\",IF(INDIRECT(\"'SPR \"&Lists!P30&\"'!P34\")=2,\"Entirely the jurisdiction's responsibility\",IF(INDIRECT(\"'SPR \"&Lists!P30&\"'!P34\")=3,\"Mostly the jurisdiction's responsibility\",IF(INDIRECT(\"'SPR \"&Lists!P30&\"'!P34\")=4,\"Mostly higher-level government's responsibility\",IF(INDIRECT(\"'SPR \"&Lists!P30&\"'!P34\")=5,\"Entirely higher-level government's responsibility\",\"\")))))","v":""},null,null,"Housing","","",null,"Housing","","",null,"Housing","","",null,"Housing","","",null,"Housing","","",null,"Housing","",""]
[null,"Natural and Cultural Resources",null,{"$f":"IF(AND(INDIRECT(\"'SPR \"&Lists!P31&\"'!P14\")>1,INDIRECT(\"'SPR \"&Lists!P31&\"'!P14\")<7),INDIRECT(\"'SPR \"&Lists!P31&\"'!P14\")-1,IF(INDIRECT(\"'SPR \"&Lists!P31&\"'!P14\")=7,\"N/A\",\"\"))","v":""},{"$f":"IF(AND(INDIRECT(\"'SPR \"&Lists!P31&\"'!P18\")>1,INDIRECT(\"'SPR \"&Lists!P31&\"'!P18\")<7),INDIRECT(\"'SPR \"&Lists!P31&\"'!P18\")-1,IF(INDIRECT(\"'SPR \"&Lists!P31&\"'!P18\")=7,\"N/A\",\"\"))","v":""},{"$f":"IF(AND(INDIRECT(\"'SPR \"&Lists!P31&\"'!P21\")>1,INDIRECT(\"'SPR \"&Lists!P31&\"'!P21\")<7),INDIRECT(\"'SPR \"&Lists!P31&\"'!P21\")-1,IF(INDIRECT(\"'SPR \"&Lists!P31&\"'!P21\")=7,\"N/A\",\"\"))","v":""},{"$f":"IF(AND(INDIRECT(\"'SPR \"&Lists!P31&\"'!P24\")>1,INDIRECT(\"'SPR \"&Lists!P31&\"'!P24\")<7),INDIRECT(\"'SPR \"&Lists!P31&\"'!P24\")-1,IF(INDIRECT(\"'SPR \"&Lists!P31&\"'!P24\")=7,\"N/A\",\"\"))","v":""},{"$f":"IF(AND(INDIRECT(\"'SPR \"&Lists!P31&\"'!P28\")>1,INDIRECT(\"'SPR \"&Lists!P31&\"'!P28\")<7),INDIRECT(\"'SPR \"&Lists!P31&\"'!P28\")-1,IF(INDIRECT(\"'SPR \"&Lists!P31&\"'!P28\")=7,\"N/A\",\"\"))","v":""},null,0,"",null,{"$f":"IF(AND(INDIRECT(\"'SPR \"&Lists!P31&\"'!q14\")>1,INDIRECT(\"'SPR \"&Lists!P31&\"'!q14\")<7),INDIRECT(\"'SPR \"&Lists!P31&\"'!q14\")-1,IF(INDIRECT(\"'SPR \"&Lists!P31&\"'!q14\")=7,\"N/A\",\"\"))","v":""},{"$f":"IF(AND(INDIRECT(\"'SPR \"&Lists!P31&\"'!q18\")>1,INDIRECT(\"'SPR \"&Lists!P31&\"'!q18\")<7),INDIRECT(\"'SPR \"&Lists!P31&\"'!q18\")-1,IF(INDIRECT(\"'SPR \"&Lists!P31&\"'!q18\")=7,\"N/A\",\"\"))","v":""},{"$f":"IF(AND(INDIRECT(\"'SPR \"&Lists!P31&\"'!q21\")>1,INDIRECT(\"'SPR \"&Lists!P31&\"'!q21\")<7),INDIRECT(\"'SPR \"&Lists!P31&\"'!q21\")-1,IF(INDIRECT(\"'SPR \"&Lists!P31&\"'!q21\")=7,\"N/A\",\"\"))","v":""},{"$f":"IF(AND(INDIRECT(\"'SPR \"&Lists!P31&\"'!q24\")>1,INDIRECT(\"'SPR \"&Lists!P31&\"'!q24\")<7),INDIRECT(\"'SPR \"&Lists!P31&\"'!q24\")-1,IF(INDIRECT(\"'SPR \"&Lists!P31&\"'!q24\")=7,\"N/A\",\"\"))","v":""},{"$f":"IF(AND(INDIRECT(\"'SPR \"&Lists!P31&\"'!q28\")>1,INDIRECT(\"'SPR \"&Lists!P31&\"'!q28\")<7),INDIRECT(\"'SPR \"&Lists!P31&\"'!q28\")-1,IF(INDIRECT(\"'SPR \"&Lists!P31&\"'!q28\")=7,\"N/A\",\"\"))","v":""},null,0,"",null,{"$f":"IF(INDIRECT(\"'SPR \"&Lists!P31&\"'!P9\")=1,\"High\",IF(INDIRECT(\"'SPR \"&Lists!P31&\"'!P9\")=2,\"Medium\",IF(INDIRECT(\"'SPR \"&Lists!P31&\"'!P9\")=3,\"Low\",\"\")))","v":""},null,{"$f":"IF(INDIRECT(\"'SPR \"&Lists!P31&\"'!P34\")=1,\"No gap\",IF(INDIRECT(\"'SPR \"&Lists!P31&\"'!P34\")=2,\"Entirely the jurisdiction's responsibility\",IF(INDIRECT(\"'SPR \"&Lists!P31&\"'!P34\")=3,\"Mostly the jurisdiction's responsibility\",IF(INDIRECT(\"'SPR \"&Lists!P31&\"'!P34\")=4,\"Mostly higher-level government's responsibility\",IF(INDIRECT(\"'SPR \"&Lists!P31&\"'!P34\")=5,\"Entirely higher-level government's responsibility\",\"\")))))","v":""},null,null,"Natural and Cultural Resources","","",null,"Natural and Cultural Resources","","",null,"Natural and Cultural Resources","","",null,"Natural and Cultural Resources","","",null,"Natural and Cultural Resources","","",null,"Natural and Cultural Resources","",""]

{"sheet":"Heat Map","index":70,"n_rows":35,"n_cols":14,"rows_kept":35,"cut":false,"hidden":false,"merged":[[1,3,1,7],[1,9,1,13]]}
[]
[null,null,null,"Internal Capability",null,null,null,null,null,"Internal Capability with Mutual Aid"]
[]
[null,"Core Capability",null,"Planning","Organization","Equipment","Training","Exercises",null,"Planning","Organization","Equipment","Training","Exercises"]
[null,{"$f":"'Capability Ratings Data'!B5","v":"Planning"},null,{"$f":"IF(AND('Capability Ratings Data'!D5>0,'Capability Ratings Data'!D5<>\"N/A\"),'Capability Ratings Data'!D5,\"\")","v":""},{"$f":"IF(AND('Capability Ratings Data'!E5>0,'Capability Ratings Data'!E5<>\"N/A\"),'Capability Ratings Data'!E5,\"\")","v":""},{"$f":"IF(AND('Capability Ratings Data'!F5>0,'Capability Ratings Data'!F5<>\"N/A\"),'Capability Ratings Data'!F5,\"\")","v":""},{"$f":"IF(AND('Capability Ratings Data'!G5>0,'Capability Ratings Data'!G5<>\"N/A\"),'Capability Ratings Data'!G5,\"\")","v":""},{"$f":"IF(AND('Capability Ratings Data'!H5>0,'Capability Ratings Data'!H5<>\"N/A\"),'Capability Ratings Data'!H5,\"\")","v":""},null,{"$f":"IF(AND('Capability Ratings Data'!M5>0,'Capability Ratings Data'!M5<>\"N/A\"),'Capability Ratings Data'!M5,\"\")","v":""},{"$f":"IF(AND('Capability Ratings Data'!N5>0,'Capability Ratings Data'!N5<>\"N/A\"),'Capability Ratings Data'!N5,\"\")","v":""},{"$f":"IF(AND('Capability Ratings Data'!O5>0,'Capability Ratings Data'!O5<>\"N/A\"),'Capability Ratings Data'!O5,\"\")","v":""},{"$f":"IF(AND('Capability Ratings Data'!P5>0,'Capability Ratings Data'!P5<>\"N/A\"),'Capability Ratings Data'!P5,\"\")","v":""},{"$f":"IF(AND('Capability Ratings Data'!Q5>0,'Capability Ratings Data'!Q5<>\"N/A\"),'Capability Ratings Data'!Q5,\"\")","v":""}]
[null,{"$f":"'Capability Ratings Data'!B6","v":"Public Information and Warning"},null,{"$f":"IF(AND('Capability Ratings Data'!D6>0,'Capability Ratings Data'!D6<>\"N/A\"),'Capability Ratings Data'!D6,\"\")","v":""},{"$f":"IF(AND('Capability Ratings Data'!E6>0,'Capability Ratings Data'!E6<>\"N/A\"),'Capability Ratings Data'!E6,\"\")","v":""},{"$f":"IF(AND('Capability Ratings Data'!F6>0,'Capability Ratings Data'!F6<>\"N/A\"),'Capability Ratings Data'!F6,\"\")","v":""},{"$f":"IF(AND('Capability Ratings Data'!G6>0,'Capability Ratings Data'!G6<>\"N/A\"),'Capability Ratings Data'!G6,\"\")","v":""},{"$f":"IF(AND('Capability Ratings Data'!H6>0,'Capability Ratings Data'!H6<>\"N/A\"),'Capability Ratings Data'!H6,\"\")","v":""},null,{"$f":"IF(AND('Capability Ratings Data'!M6>0,'Capability Ratings Data'!M6<>\"N/A\"),'Capability Ratings Data'!M6,\"\")","v":""},{"$f":"IF(AND('Capability Ratings Data'!N6>0,'Capability Ratings Data'!N6<>\"N/A\"),'Capability Ratings Data'!N6,\"\")","v":""},{"$f":"IF(AND('Capability Ratings Data'!O6>0,'Capability Ratings Data'!O6<>\"N/A\"),'Capability Ratings Data'!O6,\"\")","v":""},{"$f":"IF(AND('Capability Ratings Data'!P6>0,'Capability Ratings Data'!P6<>\"N/A\"),'Capability Ratings Data'!P6,\"\")","v":""},{"$f":"IF(AND('Capability Ratings Data'!Q6>0,'Capability Ratings Data'!Q6<>\"N/A\"),'Capability Ratings Data'!Q6,\"\")","v":""}]
[null,{"$f":"'Capability Ratings Data'!B7","v":"Operational Coordination"},null,{"$f":"IF(AND('Capability Ratings Data'!D7>0,'Capability Ratings Data'!D7<>\"N/A\"),'Capability Ratings Data'!D7,\"\")","v":""},{"$f":"IF(AND('Capability Ratings Data'!E7>0,'Capability Ratings Data'!E7<>\"N/A\"),'Capability Ratings Data'!E7,\"\")","v":""},{"$f":"IF(AND('Capability Ratings Data'!F7>0,'Capability Ratings Data'!F7<>\"N/A\"),'Capability Ratings Data'!F7,\"\")","v":""},{"$f":"IF(AND('Capability Ratings Data'!G7>0,'Capability Ratings Data'!G7<>\"N/A\"),'Capability Ratings Data'!G7,\"\")","v":""},{"$f":"IF(AND('Capability Ratings Data'!H7>0,'Capability Ratings Data'!H7<>\"N/A\"),'Capability Ratings Data'!H7,\"\")","v":""},null,{"$f":"IF(AND('Capability Ratings Data'!M7>0,'Capability Ratings Data'!M7<>\"N/A\"),'Capability Ratings Data'!M7,\"\")","v":""},{"$f":"IF(AND('Capability Ratings Data'!N7>0,'Capability Ratings Data'!N7<>\"N/A\"),'Capability Ratings Data'!N7,\"\")","v":""},{"$f":"IF(AND('Capability Ratings Data'!O7>0,'Capability Ratings Data'!O7<>\"N/A\"),'Capability Ratings Data'!O7,\"\")","v":""},{"$f":"IF(AND('Capability Ratings Data'!P7>0,'Capability Ratings Data'!P7<>\"N/A\"),'Capability Ratings Data'!P7,\"\")","v":""},{"$f":"IF(AND('Capability Ratings Data'!Q7>0,'Capability Ratings Data'!Q7<>\"N/A\"),'Capability Ratings Data'!Q7,\"\")","v":""}]
[null,{"$f":"'Capability Ratings Data'!B8","v":"Forensics and Attribution"},null,{"$f":"IF(AND('Capability Ratings Data'!D8>0,'Capability Ratings Data'!D8<>\"N/A\"),'Capability Ratings Data'!D8,\"\")","v":""},{"$f":"IF(AND('Capability Ratings Data'!E8>0,'Capability Ratings Data'!E8<>\"N/A\"),'Capability Ratings Data'!E8,\"\")","v":""},{"$f":"IF(AND('Capability Ratings Data'!F8>0,'Capability Ratings Data'!F8<>\"N/A\"),'Capability Ratings Data'!F8,\"\")","v":""},{"$f":"IF(AND('Capability Ratings Data'!G8>0,'Capability Ratings Data'!G8<>\"N/A\"),'Capability Ratings Data'!G8,\"\")","v":""},{"$f":"IF(AND('Capability Ratings Data'!H8>0,'Capability Ratings Data'!H8<>\"N/A\"),'Capability Ratings Data'!H8,\"\")","v":""},null,{"$f":"IF(AND('Capability Ratings Data'!M8>0,'Capability Ratings Data'!M8<>\"N/A\"),'Capability Ratings Data'!M8,\"\")","v":""},{"$f":"IF(AND('Capability Ratings Data'!N8>0,'Capability Ratings Data'!N8<>\"N/A\"),'Capability Ratings Data'!N8,\"\")","v":""},{"$f":"IF(AND('Capability Ratings Data'!O8>0,'Capability Ratings Data'!O8<>\"N/A\"),'Capability Ratings Data'!O8,\"\")","v":""},{"$f":"IF(AND('Capability Ratings Data'!P8>0,'Capability Ratings Data'!P8<>\"N/A\"),'Capability Ratings Data'!P8,\"\")","v":""},{"$f":"IF(AND('Capability Ratings Data'!Q8>0,'Capability Ratings Data'!Q8<>\"N/A\"),'Capability Ratings Data'!Q8,\"\")","v":""}]
[null,{"$f":"'Capability Ratings Data'!B9","v":"Intelligence and Information Sharing"},null,{"$f":"IF(AND('Capability Ratings Data'!D9>0,'Capability Ratings Data'!D9<>\"N/A\"),'Capability Ratings Data'!D9,\"\")","v":""},{"$f":"IF(AND('Capability Ratings Data'!E9>0,'Capability Ratings Data'!E9<>\"N/A\"),'Capability Ratings Data'!E9,\"\")","v":""},{"$f":"IF(AND('Capability Ratings Data'!F9>0,'Capability Ratings Data'!F9<>\"N/A\"),'Capability Ratings Data'!F9,\"\")","v":""},{"$f":"IF(AND('Capability Ratings Data'!G9>0,'Capability Ratings Data'!G9<>\"N/A\"),'Capability Ratings Data'!G9,\"\")","v":""},{"$f":"IF(AND('Capability Ratings Data'!H9>0,'Capability Ratings Data'!H9<>\"N/A\"),'Capability Ratings Data'!H9,\"\")","v":""},null,{"$f":"IF(AND('Capability Ratings Data'!M9>0,'Capability Ratings Data'!M9<>\"N/A\"),'Capability Ratings Data'!M9,\"\")","v":""},{"$f":"IF(AND('Capability Ratings Data'!N9>0,'Capability Ratings Data'!N9<>\"N/A\"),'Capability Ratings Data'!N9,\"\")","v":""},{"$f":"IF(AND('Capability Ratings Data'!O9>0,'Capability Ratings Data'!O9<>\"N/A\"),'Capability Ratings Data'!O9,\"\")","v":""},{"$f":"IF(AND('Capability Ratings Data'!P9>0,'Capability Ratings Data'!P9<>\"N/A\"),'Capability Ratings Data'!P9,\"\")","v":""},{"$f":"IF(AND('Capability Ratings Data'!Q9>0,'Capability Ratings Data'!Q9<>\"N/A\"),'Capability Ratings Data'!Q9,\"\")","v":""}]
[null,{"$f":"'Capability Ratings Data'!B10","v":"Interdiction and Disruption"},null,{"$f":"IF(AND('Capability Ratings Data'!D10>0,'Capability Ratings Data'!D10<>\"N/A\"),'Capability Ratings Data'!D10,\"\")","v":""},{"$f":"IF(AND('Capability Ratings Data'!E10>0,'Capability Ratings Data'!E10<>\"N/A\"),'Capability Ratings Data'!E10,\"\")","v":""},{"$f":"IF(AND('Capability Ratings Data'!F10>0,'Capability Ratings Data'!F10<>\"N/A\"),'Capability Ratings Data'!F10,\"\")","v":""},{"$f":"IF(AND('Capability Ratings Data'!G10>0,'Capability Ratings Data'!G10<>\"N/A\"),'Capability Ratings Data'!G10,\"\")","v":""},{"$f":"IF(AND('Capability Ratings Data'!H10>0,'Capability Ratings Data'!H10<>\"N/A\"),'Capability Ratings Data'!H10,\"\")","v":""},null,{"$f":"IF(AND('Capability Ratings Data'!M10>0,'Capability Ratings Data'!M10<>\"N/A\"),'Capability Ratings Data'!M10,\"\")","v":""},{"$f":"IF(AND('Capability Ratings Data'!N10>0,'Capability Ratings Data'!N10<>\"N/A\"),'Capability Ratings Data'!N10,\"\")","v":""},{"$f":"IF(AND('Capability Ratings Data'!O10>0,'Capability Ratings Data'!O10<>\"N/A\"),'Capability Ratings Data'!O10,\"\")","v":""},{"$f":"IF(AND('Capability Ratings Data'!P10>0,'Capability Ratings Data'!P10<>\"N/A\"),'Capability Ratings Data'!P10,\"\")","v":""},{"$f":"IF(AND('Capability Ratings Data'!Q10>0,'Capability Ratings Data'!Q10<>\"N/A\"),'Capability Ratings Data'!Q10,\"\")","v":""}]
[null,{"$f":"'Capability Ratings Data'!B11","v":"Screening, Search, and Detection "},null,{"$f":"IF(AND('Capability Ratings Data'!D11>0,'Capability Ratings Data'!D11<>\"N/A\"),'Capability Ratings Data'!D11,\"\")","v":""},{"$f":"IF(AND('Capability Ratings Data'!E11>0,'Capability Ratings Data'!E11<>\"N/A\"),'Capability Ratings Data'!E11,\"\")","v":""},{"$f":"IF(AND('Capability Ratings Data'!F11>0,'Capability Ratings Data'!F11<>\"N/A\"),'Capability Ratings Data'!F11,\"\")","v":""},{"$f":"IF(AND('Capability Ratings Data'!G11>0,'Capability Ratings Data'!G11<>\"N/A\"),'Capability Ratings Data'!G11,\"\")","v":""},{"$f":"IF(AND('Capability Ratings Data'!H11>0,'Capability Ratings Data'!H11<>\"N/A\"),'Capability Ratings Data'!H11,\"\")","v":""},null,{"$f":"IF(AND('Capability Ratings Data'!M11>0,'Capability Ratings Data'!M11<>\"N/A\"),'Capability Ratings Data'!M11,\"\")","v":""},{"$f":"IF(AND('Capability Ratings Data'!N11>0,'Capability Ratings Data'!N11<>\"N/A\"),'Capability Ratings Data'!N11,\"\")","v":""},{"$f":"IF(AND('Capability Ratings Data'!O11>0,'Capability Ratings Data'!O11<>\"N/A\"),'Capability Ratings Data'!O11,\"\")","v":""},{"$f":"IF(AND('Capability Ratings Data'!P11>0,'Capability Ratings Data'!P11<>\"N/A\"),'Capability Ratings Data'!P11,\"\")","v":""},{"$f":"IF(AND('Capability Ratings Data'!Q11>0,'Capability Ratings Data'!Q11<>\"N/A\"),'Capability Ratings Data'!Q11,\"\")","v":""}]
[null,{"$f":"'Capability Ratings Data'!B12","v":"Access Control and Identity Verification"},null,{"$f":"IF(AND('Capability Ratings Data'!D12>0,'Capability Ratings Data'!D12<>\"N/A\"),'Capability Ratings Data'!D12,\"\")","v":""},{"$f":"IF(AND('Capability Ratings Data'!E12>0,'Capability Ratings Data'!E12<>\"N/A\"),'Capability Ratings Data'!E12,\"\")","v":""},{"$f":"IF(AND('Capability Ratings Data'!F12>0,'Capability Ratings Data'!F12<>\"N/A\"),'Capability Ratings Data'!F12,\"\")","v":""},{"$f":"IF(AND('Capability Ratings Data'!G12>0,'Capability Ratings Data'!G12<>\"N/A\"),'Capability Ratings Data'!G12,\"\")","v":""},{"$f":"IF(AND('Capability Ratings Data'!H12>0,'Capability Ratings Data'!H12<>\"N/A\"),'Capability Ratings Data'!H12,\"\")","v":""},null,{"$f":"IF(AND('Capability Ratings Data'!M12>0,'Capability Ratings Data'!M12<>\"N/A\"),'Capability Ratings Data'!M12,\"\")","v":""},{"$f":"IF(AND('Capability Ratings Data'!N12>0,'Capability Ratings Data'!N12<>\"N/A\"),'Capability Ratings Data'!N12,\"\")","v":""},{"$f":"IF(AND('Capability Ratings Data'!O12>0,'Capability Ratings Data'!O12<>\"N/A\"),'Capability Ratings Data'!O12,\"\")","v":""},{"$f":"IF(AND('Capability Ratings Data'!P12>0,'Capability Ratings Data'!P12<>\"N/A\"),'Capability Ratings Data'!P12,\"\")","v":""},{"$f":"IF(AND('Capability Ratings Data'!Q12>0,'Capability Ratings Data'!Q12<>\"N/A\"),'Capability Ratings Data'!Q12,\"\")","v":""}]
[null,{"$f":"'Capability Ratings Data'!B13","v":"Cybersecurity"},null,{"$f":"IF(AND('Capability Ratings Data'!D13>0,'Capability Ratings Data'!D13<>\"N/A\"),'Capability Ratings Data'!D13,\"\")","v":""},{"$f":"IF(AND('Capability Ratings Data'!E13>0,'Capability Ratings Data'!E13<>\"N/A\"),'Capability Ratings Data'!E13,\"\")","v":""},{"$f":"IF(AND('Capability Ratings Data'!F13>0,'Capability Ratings Data'!F13<>\"N/A\"),'Capability Ratings Data'!F13,\"\")","v":""},{"$f":"IF(AND('Capability Ratings Data'!G13>0,'Capability Ratings Data'!G13<>\"N/A\"),'Capability Ratings Data'!G13,\"\")","v":""},{"$f":"IF(AND('Capability Ratings Data'!H13>0,'Capability Ratings Data'!H13<>\"N/A\"),'Capability Ratings Data'!H13,\"\")","v":""},null,{"$f":"IF(AND('Capability Ratings Data'!M13>0,'Capability Ratings Data'!M13<>\"N/A\"),'Capability Ratings Data'!M13,\"\")","v":""},{"$f":"IF(AND('Capability Ratings Data'!N13>0,'Capability Ratings Data'!N13<>\"N/A\"),'Capability Ratings Data'!N13,\"\")","v":""},{"$f":"IF(AND('Capability Ratings Data'!O13>0,'Capability Ratings Data'!O13<>\"N/A\"),'Capability Ratings Data'!O13,\"\")","v":""},{"$f":"IF(AND('Capability Ratings Data'!P13>0,'Capability Ratings Data'!P13<>\"N/A\"),'Capability Ratings Data'!P13,\"\")","v":""},{"$f":"IF(AND('Capability Ratings Data'!Q13>0,'Capability Ratings Data'!Q13<>\"N/A\"),'Capability Ratings Data'!Q13,\"\")","v":""}]
[null,{"$f":"'Capability Ratings Data'!B14","v":"Physical Protective Measures"},null,{"$f":"IF(AND('Capability Ratings Data'!D14>0,'Capability Ratings Data'!D14<>\"N/A\"),'Capability Ratings Data'!D14,\"\")","v":""},{"$f":"IF(AND('Capability Ratings Data'!E14>0,'Capability Ratings Data'!E14<>\"N/A\"),'Capability Ratings Data'!E14,\"\")","v":""},{"$f":"IF(AND('Capability Ratings Data'!F14>0,'Capability Ratings Data'!F14<>\"N/A\"),'Capability Ratings Data'!F14,\"\")","v":""},{"$f":"IF(AND('Capability Ratings Data'!G14>0,'Capability Ratings Data'!G14<>\"N/A\"),'Capability Ratings Data'!G14,\"\")","v":""},{"$f":"IF(AND('Capability Ratings Data'!H14>0,'Capability Ratings Data'!H14<>\"N/A\"),'Capability Ratings Data'!H14,\"\")","v":""},null,{"$f":"IF(AND('Capability Ratings Data'!M14>0,'Capability Ratings Data'!M14<>\"N/A\"),'Capability Ratings Data'!M14,\"\")","v":""},{"$f":"IF(AND('Capability Ratings Data'!N14>0,'Capability Ratings Data'!N14<>\"N/A\"),'Capability Ratings Data'!N14,\"\")","v":""},{"$f":"IF(AND('Capability Ratings Data'!O14>0,'Capability Ratings Data'!O14<>\"N/A\"),'Capability Ratings Data'!O14,\"\")","v":""},{"$f":"IF(AND('Capability Ratings Data'!P14>0,'Capability Ratings Data'!P14<>\"N/A\"),'Capability Ratings Data'!P14,\"\")","v":""},{"$f":"IF(AND('Capability Ratings Data'!Q14>0,'Capability Ratings Data'!Q14<>\"N/A\"),'Capability Ratings Data'!Q14,\"\")","v":""}]
[null,{"$f":"'Capability Ratings Data'!B15","v":"Risk Management for Protection Programs and Activities"},null,{"$f":"IF(AND('Capability Ratings Data'!D15>0,'Capability Ratings Data'!D15<>\"N/A\"),'Capability Ratings Data'!D15,\"\")","v":""},{"$f":"IF(AND('Capability Ratings Data'!E15>0,'Capability Ratings Data'!E15<>\"N/A\"),'Capability Ratings Data'!E15,\"\")","v":""},{"$f":"IF(AND('Capability Ratings Data'!F15>0,'Capability Ratings Data'!F15<>\"N/A\"),'Capability Ratings Data'!F15,\"\")","v":""},{"$f":"IF(AND('Capability Ratings Data'!G15>0,'Capability Ratings Data'!G15<>\"N/A\"),'Capability Ratings Data'!G15,\"\")","v":""},{"$f":"IF(AND('Capability Ratings Data'!H15>0,'Capability Ratings Data'!H15<>\"N/A\"),'Capability Ratings Data'!H15,\"\")","v":""},null,{"$f":"IF(AND('Capability Ratings Data'!M15>0,'Capability Ratings Data'!M15<>\"N/A\"),'Capability Ratings Data'!M15,\"\")","v":""},{"$f":"IF(AND('Capability Ratings Data'!N15>0,'Capability Ratings Data'!N15<>\"N/A\"),'Capability Ratings Data'!N15,\"\")","v":""},{"$f":"IF(AND('Capability Ratings Data'!O15>0,'Capability Ratings Data'!O15<>\"N/A\"),'Capability Ratings Data'!O15,\"\")","v":""},{"$f":"IF(AND('Capability Ratings Data'!P15>0,'Capability Ratings Data'!P15<>\"N/A\"),'Capability Ratings Data'!P15,\"\")","v":""},{"$f":"IF(AND('Capability Ratings Data'!Q15>0,'Capability Ratings Data'!Q15<>\"N/A\"),'Capability Ratings Data'!Q15,\"\")","v":""}]
[null,{"$f":"'Capability Ratings Data'!B16","v":"Supply Chain Integrity and Security"},null,{"$f":"IF(AND('Capability Ratings Data'!D16>0,'Capability Ratings Data'!D16<>\"N/A\"),'Capability Ratings Data'!D16,\"\")","v":""},{"$f":"IF(AND('Capability Ratings Data'!E16>0,'Capability Ratings Data'!E16<>\"N/A\"),'Capability Ratings Data'!E16,\"\")","v":""},{"$f":"IF(AND('Capability Ratings Data'!F16>0,'Capability Ratings Data'!F16<>\"N/A\"),'Capability Ratings Data'!F16,\"\")","v":""},{"$f":"IF(AND('Capability Ratings Data'!G16>0,'Capability Ratings Data'!G16<>\"N/A\"),'Capability Ratings Data'!G16,\"\")","v":""},{"$f":"IF(AND('Capability Ratings Data'!H16>0,'Capability Ratings Data'!H16<>\"N/A\"),'Capability Ratings Data'!H16,\"\")","v":""},null,{"$f":"IF(AND('Capability Ratings Data'!M16>0,'Capability Ratings Data'!M16<>\"N/A\"),'Capability Ratings Data'!M16,\"\")","v":""},{"$f":"IF(AND('Capability Ratings Data'!N16>0,'Capability Ratings Data'!N16<>\"N/A\"),'Capability Ratings Data'!N16,\"\")","v":""},{"$f":"IF(AND('Capability Ratings Data'!O16>0,'Capability Ratings Data'!O16<>\"N/A\"),'Capability Ratings Data'!O16,\"\")","v":""},{"$f":"IF(AND('Capability Ratings Data'!P16>0,'Capability Ratings Data'!P16<>\"N/A\"),'Capability Ratings Data'!P16,\"\")","v":""},{"$f":"IF(AND('Capability Ratings Data'!Q16>0,'Capability Ratings Data'!Q16<>\"N/A\"),'Capability Ratings Data'!Q16,\"\")","v":""}]
[null,{"$f":"'Capability Ratings Data'!B17","v":"Community Resilience"},null,{"$f":"IF(AND('Capability Ratings Data'!D17>0,'Capability Ratings Data'!D17<>\"N/A\"),'Capability Ratings Data'!D17,\"\")","v":""},{"$f":"IF(AND('Capability Ratings Data'!E17>0,'Capability Ratings Data'!E17<>\"N/A\"),'Capability Ratings Data'!E17,\"\")","v":""},{"$f":"IF(AND('Capability Ratings Data'!F17>0,'Capability Ratings Data'!F17<>\"N/A\"),'Capability Ratings Data'!F17,\"\")","v":""},{"$f":"IF(AND('Capability Ratings Data'!G17>0,'Capability Ratings Data'!G17<>\"N/A\"),'Capability Ratings Data'!G17,\"\")","v":""},{"$f":"IF(AND('Capability Ratings Data'!H17>0,'Capability Ratings Data'!H17<>\"N/A\"),'Capability Ratings Data'!H17,\"\")","v":""},null,{"$f":"IF(AND('Capability Ratings Data'!M17>0,'Capability Ratings Data'!M17<>\"N/A\"),'Capability Ratings Data'!M17,\"\")","v":""},{"$f":"IF(AND('Capability Ratings Data'!N17>0,'Capability Ratings Data'!N17<>\"N/A\"),'Capability Ratings Data'!N17,\"\")","v":""},{"$f":"IF(AND('Capability Ratings Data'!O17>0,'Capability Ratings Data'!O17<>\"N/A\"),'Capability Ratings Data'!O17,\"\")","v":""},{"$f":"IF(AND('Capability Ratings Data'!P17>0,'Capability Ratings Data'!P17<>\"N/A\"),'Capability Ratings Data'!P17,\"\")","v":""},{"$f":"IF(AND('Capability Ratings Data'!Q17>0,'Capability Ratings Data'!Q17<>\"N/A\"),'Capability Ratings Data'!Q17,\"\")","v":""}]
[null,{"$f":"'Capability Ratings Data'!B18","v":"Long-term Vulnerability Reduction"},null,{"$f":"IF(AND('Capability Ratings Data'!D18>0,'Capability Ratings Data'!D18<>\"N/A\"),'Capability Ratings Data'!D18,\"\")","v":""},{"$f":"IF(AND('Capability Ratings Data'!E18>0,'Capability Ratings Data'!E18<>\"N/A\"),'Capability Ratings Data'!E18,\"\")","v":""},{"$f":"IF(AND('Capability Ratings Data'!F18>0,'Capability Ratings Data'!F18<>\"N/A\"),'Capability Ratings Data'!F18,\"\")","v":""},{"$f":"IF(AND('Capability Ratings Data'!G18>0,'Capability Ratings Data'!G18<>\"N/A\"),'Capability Ratings Data'!G18,\"\")","v":""},{"$f":"IF(AND('Capability Ratings Data'!H18>0,'Capability Ratings Data'!H18<>\"N/A\"),'Capability Ratings Data'!H18,\"\")","v":""},null,{"$f":"IF(AND('Capability Ratings Data'!M18>0,'Capability Ratings Data'!M18<>\"N/A\"),'Capability Ratings Data'!M18,\"\")","v":""},{"$f":"IF(AND('Capability Ratings Data'!N18>0,'Capability Ratings Data'!N18<>\"N/A\"),'Capability Ratings Data'!N18,\"\")","v":""},{"$f":"IF(AND('Capability Ratings Data'!O18>0,'Capability Ratings Data'!O18<>\"N/A\"),'Capability Ratings Data'!O18,\"\")","v":""},{"$f":"IF(AND('Capability Ratings Data'!P18>0,'Capability Ratings Data'!P18<>\"N/A\"),'Capability Ratings Data'!P18,\"\")","v":""},{"$f":"IF(AND('Capability Ratings Data'!Q18>0,'Capability Ratings Data'!Q18<>\"N/A\"),'Capability Ratings Data'!Q18,\"\")","v":""}]
[null,{"$f":"'Capability Ratings Data'!B19","v":"Risk and Disaster Resilience Assessment"},null,{"$f":"IF(AND('Capability Ratings Data'!D19>0,'Capability Ratings Data'!D19<>\"N/A\"),'Capability Ratings Data'!D19,\"\")","v":""},{"$f":"IF(AND('Capability Ratings Data'!E19>0,'Capability Ratings Data'!E19<>\"N/A\"),'Capability Ratings Data'!E19,\"\")","v":""},{"$f":"IF(AND('Capability Ratings Data'!F19>0,'Capability Ratings Data'!F19<>\"N/A\"),'Capability Ratings Data'!F19,\"\")","v":""},{"$f":"IF(AND('Capability Ratings Data'!G19>0,'Capability Ratings Data'!G19<>\"N/A\"),'Capability Ratings Data'!G19,\"\")","v":""},{"$f":"IF(AND('Capability Ratings Data'!H19>0,'Capability Ratings Data'!H19<>\"N/A\"),'Capability Ratings Data'!H19,\"\")","v":""},null,{"$f":"IF(AND('Capability Ratings Data'!M19>0,'Capability Ratings Data'!M19<>\"N/A\"),'Capability Ratings Data'!M19,\"\")","v":""},{"$f":"IF(AND('Capability Ratings Data'!N19>0,'Capability Ratings Data'!N19<>\"N/A\"),'Capability Ratings Data'!N19,\"\")","v":""},{"$f":"IF(AND('Capability Ratings Data'!O19>0,'Capability Ratings Data'!O19<>\"N/A\"),'Capability Ratings Data'!O19,\"\")","v":""},{"$f":"IF(AND('Capability Ratings Data'!P19>0,'Capability Ratings Data'!P19<>\"N/A\"),'Capability Ratings Data'!P19,\"\")","v":""},{"$f":"IF(AND('Capability Ratings Data'!Q19>0,'Capability Ratings Data'!Q19<>\"N/A\"),'Capability Ratings Data'!Q19,\"\")","v":""}]
[null,{"$f":"'Capability Ratings Data'!B20","v":"Threats and Hazard Identification"},null,{"$f":"IF(AND('Capability Ratings Data'!D20>0,'Capability Ratings Data'!D20<>\"N/A\"),'Capability Ratings Data'!D20,\"\")","v":""},{"$f":"IF(AND('Capability Ratings Data'!E20>0,'Capability Ratings Data'!E20<>\"N/A\"),'Capability Ratings Data'!E20,\"\")","v":""},{"$f":"IF(AND('Capability Ratings Data'!F20>0,'Capability Ratings Data'!F20<>\"N/A\"),'Capability Ratings Data'!F20,\"\")","v":""},{"$f":"IF(AND('Capability Ratings Data'!G20>0,'Capability Ratings Data'!G20<>\"N/A\"),'Capability Ratings Data'!G20,\"\")","v":""},{"$f":"IF(AND('Capability Ratings Data'!H20>0,'Capability Ratings Data'!H20<>\"N/A\"),'Capability Ratings Data'!H20,\"\")","v":""},null,{"$f":"IF(AND('Capability Ratings Data'!M20>0,'Capability Ratings Data'!M20<>\"N/A\"),'Capability Ratings Data'!M20,\"\")","v":""},{"$f":"IF(AND('Capability Ratings Data'!N20>0,'Capability Ratings Data'!N20<>\"N/A\"),'Capability Ratings Data'!N20,\"\")","v":""},{"$f":"IF(AND('Capability Ratings Data'!O20>0,'Capability Ratings Data'!O20<>\"N/A\"),'Capability Ratings Data'!O20,\"\")","v":""},{"$f":"IF(AND('Capability Ratings Data'!P20>0,'Capability Ratings Data'!P20<>\"N/A\"),'Capability Ratings Data'!P20,\"\")","v":""},{"$f":"IF(AND('Capability Ratings Data'!Q20>0,'Capability Ratings Data'!Q20<>\"N/A\"),'Capability Ratings Data'!Q20,\"\")","v":""}]
[null,{"$f":"'Capability Ratings Data'!B21","v":"Critical Transportation"},null,{"$f":"IF(AND('Capability Ratings Data'!D21>0,'Capability Ratings Data'!D21<>\"N/A\"),'Capability Ratings Data'!D21,\"\")","v":""},{"$f":"IF(AND('Capability Ratings Data'!E21>0,'Capability Ratings Data'!E21<>\"N/A\"),'Capability Ratings Data'!E21,\"\")","v":""},{"$f":"IF(AND('Capability Ratings Data'!F21>0,'Capability Ratings Data'!F21<>\"N/A\"),'Capability Ratings Data'!F21,\"\")","v":""},{"$f":"IF(AND('Capability Ratings Data'!G21>0,'Capability Ratings Data'!G21<>\"N/A\"),'Capability Ratings Data'!G21,\"\")","v":""},{"$f":"IF(AND('Capability Ratings Data'!H21>0,'Capability Ratings Data'!H21<>\"N/A\"),'Capability Ratings Data'!H21,\"\")","v":""},null,{"$f":"IF(AND('Capability Ratings Data'!M21>0,'Capability Ratings Data'!M21<>\"N/A\"),'Capability Ratings Data'!M21,\"\")","v":""},{"$f":"IF(AND('Capability Ratings Data'!N21>0,'Capability Ratings Data'!N21<>\"N/A\"),'Capability Ratings Data'!N21,\"\")","v":""},{"$f":"IF(AND('Capability Ratings Data'!O21>0,'Capability Ratings Data'!O21<>\"N/A\"),'Capability Ratings Data'!O21,\"\")","v":""},{"$f":"IF(AND('Capability Ratings Data'!P21>0,'Capability Ratings Data'!P21<>\"N/A\"),'Capability Ratings Data'!P21,\"\")","v":""},{"$f":"IF(AND('Capability Ratings Data'!Q21>0,'Capability Ratings Data'!Q21<>\"N/A\"),'Capability Ratings Data'!Q21,\"\")","v":""}]
[null,{"$f":"'Capability Ratings Data'!B22","v":"Environmental Response/Health and Safety"},null,{"$f":"IF(AND('Capability Ratings Data'!D22>0,'Capability Ratings Data'!D22<>\"N/A\"),'Capability Ratings Data'!D22,\"\")","v":""},{"$f":"IF(AND('Capability Ratings Data'!E22>0,'Capability Ratings Data'!E22<>\"N/A\"),'Capability Ratings Data'!E22,\"\")","v":""},{"$f":"IF(AND('Capability Ratings Data'!F22>0,'Capability Ratings Data'!F22<>\"N/A\"),'Capability Ratings Data'!F22,\"\")","v":""},{"$f":"IF(AND('Capability Ratings Data'!G22>0,'Capability Ratings Data'!G22<>\"N/A\"),'Capability Ratings Data'!G22,\"\")","v":""},{"$f":"IF(AND('Capability Ratings Data'!H22>0,'Capability Ratings Data'!H22<>\"N/A\"),'Capability Ratings Data'!H22,\"\")","v":""},null,{"$f":"IF(AND('Capability Ratings Data'!M22>0,'Capability Ratings Data'!M22<>\"N/A\"),'Capability Ratings Data'!M22,\"\")","v":""},{"$f":"IF(AND('Capability Ratings Data'!N22>0,'Capability Ratings Data'!N22<>\"N/A\"),'Capability Ratings Data'!N22,\"\")","v":""},{"$f":"IF(AND('Capability Ratings Data'!O22>0,'Capability Ratings Data'!O22<>\"N/A\"),'Capability Ratings Data'!O22,\"\")","v":""},{"$f":"IF(AND('Capability Ratings Data'!P22>0,'Capability Ratings Data'!P22<>\"N/A\"),'Capability Ratings Data'!P22,\"\")","v":""},{"$f":"IF(AND('Capability Ratings Data'!Q22>0,'Capability Ratings Data'!Q22<>\"N/A\"),'Capability Ratings Data'!Q22,\"\")","v":""}]
[null,{"$f":"'Capability Ratings Data'!B23","v":"Fatality Management Services"},null,{"$f":"IF(AND('Capability Ratings Data'!D23>0,'Capability Ratings Data'!D23<>\"N/A\"),'Capability Ratings Data'!D23,\"\")","v":""},{"$f":"IF(AND('Capability Ratings Data'!E23>0,'Capability Ratings Data'!E23<>\"N/A\"),'Capability Ratings Data'!E23,\"\")","v":""},{"$f":"IF(AND('Capability Ratings Data'!F23>0,'Capability Ratings Data'!F23<>\"N/A\"),'Capability Ratings Data'!F23,\"\")","v":""},{"$f":"IF(AND('Capability Ratings Data'!G23>0,'Capability Ratings Data'!G23<>\"N/A\"),'Capability Ratings Data'!G23,\"\")","v":""},{"$f":"IF(AND('Capability Ratings Data'!H23>0,'Capability Ratings Data'!H23<>\"N/A\"),'Capability Ratings Data'!H23,\"\")","v":""},null,{"$f":"IF(AND('Capability Ratings Data'!M23>0,'Capability Ratings Data'!M23<>\"N/A\"),'Capability Ratings Data'!M23,\"\")","v":""},{"$f":"IF(AND('Capability Ratings Data'!N23>0,'Capability Ratings Data'!N23<>\"N/A\"),'Capability Ratings Data'!N23,\"\")","v":""},{"$f":"IF(AND('Capability Ratings Data'!O23>0,'Capability Ratings Data'!O23<>\"N/A\"),'Capability Ratings Data'!O23,\"\")","v":""},{"$f":"IF(AND('Capability Ratings Data'!P23>0,'Capability Ratings Data'!P23<>\"N/A\"),'Capability Ratings Data'!P23,\"\")","v":""},{"$f":"IF(AND('Capability Ratings Data'!Q23>0,'Capability Ratings Data'!Q23<>\"N/A\"),'Capability Ratings Data'!Q23,\"\")","v":""}]
[null,{"$f":"'Capability Ratings Data'!B24","v":"Infrastructure Systems"},null,{"$f":"IF(AND('Capability Ratings Data'!D24>0,'Capability Ratings Data'!D24<>\"N/A\"),'Capability Ratings Data'!D24,\"\")","v":""},{"$f":"IF(AND('Capability Ratings Data'!E24>0,'Capability Ratings Data'!E24<>\"N/A\"),'Capability Ratings Data'!E24,\"\")","v":""},{"$f":"IF(AND('Capability Ratings Data'!F24>0,'Capability Ratings Data'!F24<>\"N/A\"),'Capability Ratings Data'!F24,\"\")","v":""},{"$f":"IF(AND('Capability Ratings Data'!G24>0,'Capability Ratings Data'!G24<>\"N/A\"),'Capability Ratings Data'!G24,\"\")","v":""},{"$f":"IF(AND('Capability Ratings Data'!H24>0,'Capability Ratings Data'!H24<>\"N/A\"),'Capability Ratings Data'!H24,\"\")","v":""},null,{"$f":"IF(AND('Capability Ratings Data'!M24>0,'Capability Ratings Data'!M24<>\"N/A\"),'Capability Ratings Data'!M24,\"\")","v":""},{"$f":"IF(AND('Capability Ratings Data'!N24>0,'Capability Ratings Data'!N24<>\"N/A\"),'Capability Ratings Data'!N24,\"\")","v":""},{"$f":"IF(AND('Capability Ratings Data'!O24>0,'Capability Ratings Data'!O24<>\"N/A\"),'Capability Ratings Data'!O24,\"\")","v":""},{"$f":"IF(AND('Capability Ratings Data'!P24>0,'Capability Ratings Data'!P24<>\"N/A\"),'Capability Ratings Data'!P24,\"\")","v":""},{"$f":"IF(AND('Capability Ratings Data'!Q24>0,'Capability Ratings Data'!Q24<>\"N/A\"),'Capability Ratings Data'!Q24,\"\")","v":""}]
[null,{"$f":"'Capability Ratings Data'!B25","v":"Mass Care Services"},null,{"$f":"IF(AND('Capability Ratings Data'!D25>0,'Capability Ratings Data'!D25<>\"N/A\"),'Capability Ratings Data'!D25,\"\")","v":""},{"$f":"IF(AND('Capability Ratings Data'!E25>0,'Capability Ratings Data'!E25<>\"N/A\"),'Capability Ratings Data'!E25,\"\")","v":""},{"$f":"IF(AND('Capability Ratings Data'!F25>0,'Capability Ratings Data'!F25<>\"N/A\"),'Capability Ratings Data'!F25,\"\")","v":""},{"$f":"IF(AND('Capability Ratings Data'!G25>0,'Capability Ratings Data'!G25<>\"N/A\"),'Capability Ratings Data'!G25,\"\")","v":""},{"$f":"IF(AND('Capability Ratings Data'!H25>0,'Capability Ratings Data'!H25<>\"N/A\"),'Capability Ratings Data'!H25,\"\")","v":""},null,{"$f":"IF(AND('Capability Ratings Data'!M25>0,'Capability Ratings Data'!M25<>\"N/A\"),'Capability Ratings Data'!M25,\"\")","v":""},{"$f":"IF(AND('Capability Ratings Data'!N25>0,'Capability Ratings Data'!N25<>\"N/A\"),'Capability Ratings Data'!N25,\"\")","v":""},{"$f":"IF(AND('Capability Ratings Data'!O25>0,'Capability Ratings Data'!O25<>\"N/A\"),'Capability Ratings Data'!O25,\"\")","v":""},{"$f":"IF(AND('Capability Ratings Data'!P25>0,'Capability Ratings Data'!P25<>\"N/A\"),'Capability Ratings Data'!P25,\"\")","v":""},{"$f":"IF(AND('Capability Ratings Data'!Q25>0,'Capability Ratings Data'!Q25<>\"N/A\"),'Capability Ratings Data'!Q25,\"\")","v":""}]
[null,{"$f":"'Capability Ratings Data'!B26","v":"Mass Search and Rescue Operations"},null,{"$f":"IF(AND('Capability Ratings Data'!D26>0,'Capability Ratings Data'!D26<>\"N/A\"),'Capability Ratings Data'!D26,\"\")","v":""},{"$f":"IF(AND('Capability Ratings Data'!E26>0,'Capability Ratings Data'!E26<>\"N/A\"),'Capability Ratings Data'!E26,\"\")","v":""},{"$f":"IF(AND('Capability Ratings Data'!F26>0,'Capability Ratings Data'!F26<>\"N/A\"),'Capability Ratings Data'!F26,\"\")","v":""},{"$f":"IF(AND('Capability Ratings Data'!G26>0,'Capability Ratings Data'!G26<>\"N/A\"),'Capability Ratings Data'!G26,\"\")","v":""},{"$f":"IF(AND('Capability Ratings Data'!H26>0,'Capability Ratings Data'!H26<>\"N/A\"),'Capability Ratings Data'!H26,\"\")","v":""},null,{"$f":"IF(AND('Capability Ratings Data'!M26>0,'Capability Ratings Data'!M26<>\"N/A\"),'Capability Ratings Data'!M26,\"\")","v":""},{"$f":"IF(AND('Capability Ratings Data'!N26>0,'Capability Ratings Data'!N26<>\"N/A\"),'Capability Ratings Data'!N26,\"\")","v":""},{"$f":"IF(AND('Capability Ratings Data'!O26>0,'Capability Ratings Data'!O26<>\"N/A\"),'Capability Ratings Data'!O26,\"\")","v":""},{"$f":"IF(AND('Capability Ratings Data'!P26>0,'Capability Ratings Data'!P26<>\"N/A\"),'Capability Ratings Data'!P26,\"\")","v":""},{"$f":"IF(AND('Capability Ratings Data'!Q26>0,'Capability Ratings Data'!Q26<>\"N/A\"),'Capability Ratings Data'!Q26,\"\")","v":""}]
[null,{"$f":"'Capability Ratings Data'!B27","v":"On-scene Security and Protection"},null,{"$f":"IF(AND('Capability Ratings Data'!D27>0,'Capability Ratings Data'!D27<>\"N/A\"),'Capability Ratings Data'!D27,\"\")","v":""},{"$f":"IF(AND('Capability Ratings Data'!E27>0,'Capability Ratings Data'!E27<>\"N/A\"),'Capability Ratings Data'!E27,\"\")","v":""},{"$f":"IF(AND('Capability Ratings Data'!F27>0,'Capability Ratings Data'!F27<>\"N/A\"),'Capability Ratings Data'!F27,\"\")","v":""},{"$f":"IF(AND('Capability Ratings Data'!G27>0,'Capability Ratings Data'!G27<>\"N/A\"),'Capability Ratings Data'!G27,\"\")","v":""},{"$f":"IF(AND('Capability Ratings Data'!H27>0,'Capability Ratings Data'!H27<>\"N/A\"),'Capability Ratings Data'!H27,\"\")","v":""},null,{"$f":"IF(AND('Capability Ratings Data'!M27>0,'Capability Ratings Data'!M27<>\"N/A\"),'Capability Ratings Data'!M27,\"\")","v":""},{"$f":"IF(AND('Capability Ratings Data'!N27>0,'Capability Ratings Data'!N27<>\"N/A\"),'Capability Ratings Data'!N27,\"\")","v":""},{"$f":"IF(AND('Capability Ratings Data'!O27>0,'Capability Ratings Data'!O27<>\"N/A\"),'Capability Ratings Data'!O27,\"\")","v":""},{"$f":"IF(AND('Capability Ratings Data'!P27>0,'Capability Ratings Data'!P27<>\"N/A\"),'Capability Ratings Data'!P27,\"\")","v":""},{"$f":"IF(AND('Capability Ratings Data'!Q27>0,'Capability Ratings Data'!Q27<>\"N/A\"),'Capability Ratings Data'!Q27,\"\")","v":""}]
[null,{"$f":"'Capability Ratings Data'!B28","v":"Operational  Communications"},null,{"$f":"IF(AND('Capability Ratings Data'!D28>0,'Capability Ratings Data'!D28<>\"N/A\"),'Capability Ratings Data'!D28,\"\")","v":""},{"$f":"IF(AND('Capability Ratings Data'!E28>0,'Capability Ratings Data'!E28<>\"N/A\"),'Capability Ratings Data'!E28,\"\")","v":""},{"$f":"IF(AND('Capability Ratings Data'!F28>0,'Capability Ratings Data'!F28<>\"N/A\"),'Capability Ratings Data'!F28,\"\")","v":""},{"$f":"IF(AND('Capability Ratings Data'!G28>0,'Capability Ratings Data'!G28<>\"N/A\"),'Capability Ratings Data'!G28,\"\")","v":""},{"$f":"IF(AND('Capability Ratings Data'!H28>0,'Capability Ratings Data'!H28<>\"N/A\"),'Capability Ratings Data'!H28,\"\")","v":""},null,{"$f":"IF(AND('Capability Ratings Data'!M28>0,'Capability Ratings Data'!M28<>\"N/A\"),'Capability Ratings Data'!M28,\"\")","v":""},{"$f":"IF(AND('Capability Ratings Data'!N28>0,'Capability Ratings Data'!N28<>\"N/A\"),'Capability Ratings Data'!N28,\"\")","v":""},{"$f":"IF(AND('Capability Ratings Data'!O28>0,'Capability Ratings Data'!O28<>\"N/A\"),'Capability Ratings Data'!O28,\"\")","v":""},{"$f":"IF(AND('Capability Ratings Data'!P28>0,'Capability Ratings Data'!P28<>\"N/A\"),'Capability Ratings Data'!P28,\"\")","v":""},{"$f":"IF(AND('Capability Ratings Data'!Q28>0,'Capability Ratings Data'!Q28<>\"N/A\"),'Capability Ratings Data'!Q28,\"\")","v":""}]
[null,{"$f":"'Capability Ratings Data'!B29","v":"Public and Private Services and Resources"},null,{"$f":"IF(AND('Capability Ratings Data'!D29>0,'Capability Ratings Data'!D29<>\"N/A\"),'Capability Ratings Data'!D29,\"\")","v":""},{"$f":"IF(AND('Capability Ratings Data'!E29>0,'Capability Ratings Data'!E29<>\"N/A\"),'Capability Ratings Data'!E29,\"\")","v":""},{"$f":"IF(AND('Capability Ratings Data'!F29>0,'Capability Ratings Data'!F29<>\"N/A\"),'Capability Ratings Data'!F29,\"\")","v":""},{"$f":"IF(AND('Capability Ratings Data'!G29>0,'Capability Ratings Data'!G29<>\"N/A\"),'Capability Ratings Data'!G29,\"\")","v":""},{"$f":"IF(AND('Capability Ratings Data'!H29>0,'Capability Ratings Data'!H29<>\"N/A\"),'Capability Ratings Data'!H29,\"\")","v":""},null,{"$f":"IF(AND('Capability Ratings Data'!M29>0,'Capability Ratings Data'!M29<>\"N/A\"),'Capability Ratings Data'!M29,\"\")","v":""},{"$f":"IF(AND('Capability Ratings Data'!N29>0,'Capability Ratings Data'!N29<>\"N/A\"),'Capability Ratings Data'!N29,\"\")","v":""},{"$f":"IF(AND('Capability Ratings Data'!O29>0,'Capability Ratings Data'!O29<>\"N/A\"),'Capability Ratings Data'!O29,\"\")","v":""},{"$f":"IF(AND('Capability Ratings Data'!P29>0,'Capability Ratings Data'!P29<>\"N/A\"),'Capability Ratings Data'!P29,\"\")","v":""},{"$f":"IF(AND('Capability Ratings Data'!Q29>0,'Capability Ratings Data'!Q29<>\"N/A\"),'Capability Ratings Data'!Q29,\"\")","v":""}]
[null,{"$f":"'Capability Ratings Data'!B30","v":"Public Health and Medical Services"},null,{"$f":"IF(AND('Capability Ratings Data'!D30>0,'Capability Ratings Data'!D30<>\"N/A\"),'Capability Ratings Data'!D30,\"\")","v":""},{"$f":"IF(AND('Capability Ratings Data'!E30>0,'Capability Ratings Data'!E30<>\"N/A\"),'Capability Ratings Data'!E30,\"\")","v":""},{"$f":"IF(AND('Capability Ratings Data'!F30>0,'Capability Ratings Data'!F30<>\"N/A\"),'Capability Ratings Data'!F30,\"\")","v":""},{"$f":"IF(AND('Capability Ratings Data'!G30>0,'Capability Ratings Data'!G30<>\"N/A\"),'Capability Ratings Data'!G30,\"\")","v":""},{"$f":"IF(AND('Capability Ratings Data'!H30>0,'Capability Ratings Data'!H30<>\"N/A\"),'Capability Ratings Data'!H30,\"\")","v":""},null,{"$f":"IF(AND('Capability Ratings Data'!M30>0,'Capability Ratings Data'!M30<>\"N/A\"),'Capability Ratings Data'!M30,\"\")","v":""},{"$f":"IF(AND('Capability Ratings Data'!N30>0,'Capability Ratings Data'!N30<>\"N/A\"),'Capability Ratings Data'!N30,\"\")","v":""},{"$f":"IF(AND('Capability Ratings Data'!O30>0,'Capability Ratings Data'!O30<>\"N/A\"),'Capability Ratings Data'!O30,\"\")","v":""},{"$f":"IF(AND('Capability Ratings Data'!P30>0,'Capability Ratings Data'!P30<>\"N/A\"),'Capability Ratings Data'!P30,\"\")","v":""},{"$f":"IF(AND('Capability Ratings Data'!Q30>0,'Capability Ratings Data'!Q30<>\"N/A\"),'Capability Ratings Data'!Q30,\"\")","v":""}]
[null,{"$f":"'Capability Ratings Data'!B31","v":"Situational Assessment"},null,{"$f":"IF(AND('Capability Ratings Data'!D31>0,'Capability Ratings Data'!D31<>\"N/A\"),'Capability Ratings Data'!D31,\"\")","v":""},{"$f":"IF(AND('Capability Ratings Data'!E31>0,'Capability Ratings Data'!E31<>\"N/A\"),'Capability Ratings Data'!E31,\"\")","v":""},{"$f":"IF(AND('Capability Ratings Data'!F31>0,'Capability Ratings Data'!F31<>\"N/A\"),'Capability Ratings Data'!F31,\"\")","v":""},{"$f":"IF(AND('Capability Ratings Data'!G31>0,'Capability Ratings Data'!G31<>\"N/A\"),'Capability Ratings Data'!G31,\"\")","v":""},{"$f":"IF(AND('Capability Ratings Data'!H31>0,'Capability Ratings Data'!H31<>\"N/A\"),'Capability Ratings Data'!H31,\"\")","v":""},null,{"$f":"IF(AND('Capability Ratings Data'!M31>0,'Capability Ratings Data'!M31<>\"N/A\"),'Capability Ratings Data'!M31,\"\")","v":""},{"$f":"IF(AND('Capability Ratings Data'!N31>0,'Capability Ratings Data'!N31<>\"N/A\"),'Capability Ratings Data'!N31,\"\")","v":""},{"$f":"IF(AND('Capability Ratings Data'!O31>0,'Capability Ratings Data'!O31<>\"N/A\"),'Capability Ratings Data'!O31,\"\")","v":""},{"$f":"IF(AND('Capability Ratings Data'!P31>0,'Capability Ratings Data'!P31<>\"N/A\"),'Capability Ratings Data'!P31,\"\")","v":""},{"$f":"IF(AND('Capability Ratings Data'!Q31>0,'Capability Ratings Data'!Q31<>\"N/A\"),'Capability Ratings Data'!Q31,\"\")","v":""}]
[null,{"$f":"'Capability Ratings Data'!B32","v":"Economic Recovery"},null,{"$f":"IF(AND('Capability Ratings Data'!D32>0,'Capability Ratings Data'!D32<>\"N/A\"),'Capability Ratings Data'!D32,\"\")","v":""},{"$f":"IF(AND('Capability Ratings Data'!E32>0,'Capability Ratings Data'!E32<>\"N/A\"),'Capability Ratings Data'!E32,\"\")","v":""},{"$f":"IF(AND('Capability Ratings Data'!F32>0,'Capability Ratings Data'!F32<>\"N/A\"),'Capability Ratings Data'!F32,\"\")","v":""},{"$f":"IF(AND('Capability Ratings Data'!G32>0,'Capability Ratings Data'!G32<>\"N/A\"),'Capability Ratings Data'!G32,\"\")","v":""},{"$f":"IF(AND('Capability Ratings Data'!H32>0,'Capability Ratings Data'!H32<>\"N/A\"),'Capability Ratings Data'!H32,\"\")","v":""},null,{"$f":"IF(AND('Capability Ratings Data'!M32>0,'Capability Ratings Data'!M32<>\"N/A\"),'Capability Ratings Data'!M32,\"\")","v":""},{"$f":"IF(AND('Capability Ratings Data'!N32>0,'Capability Ratings Data'!N32<>\"N/A\"),'Capability Ratings Data'!N32,\"\")","v":""},{"$f":"IF(AND('Capability Ratings Data'!O32>0,'Capability Ratings Data'!O32<>\"N/A\"),'Capability Ratings Data'!O32,\"\")","v":""},{"$f":"IF(AND('Capability Ratings Data'!P32>0,'Capability Ratings Data'!P32<>\"N/A\"),'Capability Ratings Data'!P32,\"\")","v":""},{"$f":"IF(AND('Capability Ratings Data'!Q32>0,'Capability Ratings Data'!Q32<>\"N/A\"),'Capability Ratings Data'!Q32,\"\")","v":""}]
[null,{"$f":"'Capability Ratings Data'!B33","v":"Health and Social Services"},null,{"$f":"IF(AND('Capability Ratings Data'!D33>0,'Capability Ratings Data'!D33<>\"N/A\"),'Capability Ratings Data'!D33,\"\")","v":""},{"$f":"IF(AND('Capability Ratings Data'!E33>0,'Capability Ratings Data'!E33<>\"N/A\"),'Capability Ratings Data'!E33,\"\")","v":""},{"$f":"IF(AND('Capability Ratings Data'!F33>0,'Capability Ratings Data'!F33<>\"N/A\"),'Capability Ratings Data'!F33,\"\")","v":""},{"$f":"IF(AND('Capability Ratings Data'!G33>0,'Capability Ratings Data'!G33<>\"N/A\"),'Capability Ratings Data'!G33,\"\")","v":""},{"$f":"IF(AND('Capability Ratings Data'!H33>0,'Capability Ratings Data'!H33<>\"N/A\"),'Capability Ratings Data'!H33,\"\")","v":""},null,{"$f":"IF(AND('Capability Ratings Data'!M33>0,'Capability Ratings Data'!M33<>\"N/A\"),'Capability Ratings Data'!M33,\"\")","v":""},{"$f":"IF(AND('Capability Ratings Data'!N33>0,'Capability Ratings Data'!N33<>\"N/A\"),'Capability Ratings Data'!N33,\"\")","v":""},{"$f":"IF(AND('Capability Ratings Data'!O33>0,'Capability Ratings Data'!O33<>\"N/A\"),'Capability Ratings Data'!O33,\"\")","v":""},{"$f":"IF(AND('Capability Ratings Data'!P33>0,'Capability Ratings Data'!P33<>\"N/A\"),'Capability Ratings Data'!P33,\"\")","v":""},{"$f":"IF(AND('Capability Ratings Data'!Q33>0,'Capability Ratings Data'!Q33<>\"N/A\"),'Capability Ratings Data'!Q33,\"\")","v":""}]
[null,{"$f":"'Capability Ratings Data'!B34","v":"Housing"},null,{"$f":"IF(AND('Capability Ratings Data'!D34>0,'Capability Ratings Data'!D34<>\"N/A\"),'Capability Ratings Data'!D34,\"\")","v":""},{"$f":"IF(AND('Capability Ratings Data'!E34>0,'Capability Ratings Data'!E34<>\"N/A\"),'Capability Ratings Data'!E34,\"\")","v":""},{"$f":"IF(AND('Capability Ratings Data'!F34>0,'Capability Ratings Data'!F34<>\"N/A\"),'Capability Ratings Data'!F34,\"\")","v":""},{"$f":"IF(AND('Capability Ratings Data'!G34>0,'Capability Ratings Data'!G34<>\"N/A\"),'Capability Ratings Data'!G34,\"\")","v":""},{"$f":"IF(AND('Capability Ratings Data'!H34>0,'Capability Ratings Data'!H34<>\"N/A\"),'Capability Ratings Data'!H34,\"\")","v":""},null,{"$f":"IF(AND('Capability Ratings Data'!M34>0,'Capability Ratings Data'!M34<>\"N/A\"),'Capability Ratings Data'!M34,\"\")","v":""},{"$f":"IF(AND('Capability Ratings Data'!N34>0,'Capability Ratings Data'!N34<>\"N/A\"),'Capability Ratings Data'!N34,\"\")","v":""},{"$f":"IF(AND('Capability Ratings Data'!O34>0,'Capability Ratings Data'!O34<>\"N/A\"),'Capability Ratings Data'!O34,\"\")","v":""},{"$f":"IF(AND('Capability Ratings Data'!P34>0,'Capability Ratings Data'!P34<>\"N/A\"),'Capability Ratings Data'!P34,\"\")","v":""},{"$f":"IF(AND('Capability Ratings Data'!Q34>0,'Capability Ratings Data'!Q34<>\"N/A\"),'Capability Ratings Data'!Q34,\"\")","v":""}]
[null,{"$f":"'Capability Ratings Data'!B35","v":"Natural and Cultural Resources"},null,{"$f":"IF(AND('Capability Ratings Data'!D35>0,'Capability Ratings Data'!D35<>\"N/A\"),'Capability Ratings Data'!D35,\"\")","v":""},{"$f":"IF(AND('Capability Ratings Data'!E35>0,'Capability Ratings Data'!E35<>\"N/A\"),'Capability Ratings Data'!E35,\"\")","v":""},{"$f":"IF(AND('Capability Ratings Data'!F35>0,'Capability Ratings Data'!F35<>\"N/A\"),'Capability Ratings Data'!F35,\"\")","v":""},{"$f":"IF(AND('Capability Ratings Data'!G35>0,'Capability Ratings Data'!G35<>\"N/A\"),'Capability Ratings Data'!G35,\"\")","v":""},{"$f":"IF(AND('Capability Ratings Data'!H35>0,'Capability Ratings Data'!H35<>\"N/A\"),'Capability Ratings Data'!H35,\"\")","v":""},null,{"$f":"IF(AND('Capability Ratings Data'!M35>0,'Capability Ratings Data'!M35<>\"N/A\"),'Capability Ratings Data'!M35,\"\")","v":""},{"$f":"IF(AND('Capability Ratings Data'!N35>0,'Capability Ratings Data'!N35<>\"N/A\"),'Capability Ratings Data'!N35,\"\")","v":""},{"$f":"IF(AND('Capability Ratings Data'!O35>0,'Capability Ratings Data'!O35<>\"N/A\"),'Capability Ratings Data'!O35,\"\")","v":""},{"$f":"IF(AND('Capability Ratings Data'!P35>0,'Capability Ratings Data'!P35<>\"N/A\"),'Capability Ratings Data'!P35,\"\")","v":""},{"$f":"IF(AND('Capability Ratings Data'!Q35>0,'Capability Ratings Data'!Q35<>\"N/A\"),'Capability Ratings Data'!Q35,\"\")","v":""}]

{"sheet":"Export Capabilities","index":71,"n_rows":33,"n_cols":2,"rows_kept":33,"cut":false,"hidden":false,"merged":[[1,1,1,2]]}
[]
[null,"Core Capabilities"]
[null,"Planning"]
[null,"Public Information and Warning"]
[null,"Operational Coordination"]
[null,"Forensics and Attribution"]
[null,"Intelligence and Information Sharing"]
[null,"Interdiction and Disruption"]
[null,"Screening, Search, and Detection"]
[null,"Access Control and Identity Verification"]
[null,"Cybersecurity"]
[null,"Physical Protective Measures"]
[null,"Risk Management for Protection Programs and Activities"]
[null,"Supply Chain Integrity and Security"]
[null,"Community Resilience"]
[null,"Long-term Vulnerability Reduction"]
[null,"Risk and Disaster Resilience Assessment"]
[null,"Threats and Hazard Identification"]
[null,"Critical Transportation"]
[null,"Environmental Response/Health and Safety"]
[null,"Fatality Management Services"]
[null,"Infrastructure Systems"]
[null,"Mass Care Services"]
[null,"Mass Search and Rescue Operations"]
[null,"On-scene Security and Protection"]
[null,"Operational  Communications"]
[null,"Public and Private Services and Resources"]
[null,"Public Health and Medical Services"]
[null,"Situational Assessment"]
[null,"Economic Recovery"]
[null,"Health and Social Services"]
[null,"Housing"]
[null,"Natural and Cultural Resources"]

{"sheet":"Import SPR Contributions","index":72,"n_rows":204,"n_cols":45,"rows_kept":204,"cut":false,"hidden":false,"merged":[]}
[]
[]
[]
[]
[]
[]
[]
[]
[]
[]
[]
[]
[]
[]
[]
[]
[]
[null,"Internal Capability Ratings",null,null,null,null,null,null,null,null,null,null,null,null,null,null,null,null,null,null,null,null,null,null,null,null,null,null,null,null,null,null,null,null,null,null,null,null,null,null,null,null,null,null,"Internal Capability with Mutual Aid Ratings"]
[null,{"$f":"Lists!$O$1","v":"Planning"},null,null,null,null,null,null,null,null,null,null,null,null,null,null,null,null,null,null,null,null,null,null,null,null,null,null,null,null,null,null,null,null,null,null,null,null,null,null,null,null,null,null,{"$f":"Lists!$O$1","v":"Planning"}]
[null,"Planning",null,null,null,null,null,null,null,null,null,null,null,null,null,null,null,null,null,null,null,null,null,null,null,null,null,null,null,null,null,null,null,null,null,null,null,null,null,null,null,null,null,null,"Planning"]
[null,"Organization",null,null,null,null,null,null,null,null,null,null,null,null,null,null,null,null,null,null,null,null,null,null,null,null,null,null,null,null,null,null,null,null,null,null,null,null,null,null,null,null,null,null,"Organization"]
[null,"Equipment",null,null,null,null,null,null,null,null,null,null,null,null,null,null,null,null,null,null,null,null,null,null,null,null,null,null,null,null,null,null,null,null,null,null,null,null,null,null,null,null,null,null,"Equipment"]
[null,"Training",null,null,null,null,null,null,null,null,null,null,null,null,null,null,null,null,null,null,null,null,null,null,null,null,null,null,null,null,null,null,null,null,null,null,null,null,null,null,null,null,null,null,"Training"]
[null,"Exercises",null,null,null,null,null,null,null,null,null,null,null,null,null,null,null,null,null,null,null,null,null,null,null,null,null,null,null,null,null,null,null,null,null,null,null,null,null,null,null,null,null,null,"Exercises"]
[null,{"$f":"Lists!$O$2","v":"Public Information and Warning"},null,null,null,null,null,null,null,null,null,null,null,null,null,null,null,null,null,null,null,null,null,null,null,null,null,null,null,null,null,null,null,null,null,null,null,null,null,null,null,null,null,null,{"$f":"Lists!$O$2","v":"Public Information and Warning"}]
[null,"Planning",null,null,null,null,null,null,null,null,null,null,null,null,null,null,null,null,null,null,null,null,null,null,null,null,null,null,null,null,null,null,null,null,null,null,null,null,null,null,null,null,null,null,"Planning"]
[null,"Organization",null,null,null,null,null,null,null,null,null,null,null,null,null,null,null,null,null,null,null,null,null,null,null,null,null,null,null,null,null,null,null,null,null,null,null,null,null,null,null,null,null,null,"Organization"]
[null,"Equipment",null,null,null,null,null,null,null,null,null,null,null,null,null,null,null,null,null,null,null,null,null,null,null,null,null,null,null,null,null,null,null,null,null,null,null,null,null,null,null,null,null,null,"Equipment"]
[null,"Training",null,null,null,null,null,null,null,null,null,null,null,null,null,null,null,null,null,null,null,null,null,null,null,null,null,null,null,null,null,null,null,null,null,null,null,null,null,null,null,null,null,null,"Training"]
[null,"Exercises",null,null,null,null,null,null,null,null,null,null,null,null,null,null,null,null,null,null,null,null,null,null,null,null,null,null,null,null,null,null,null,null,null,null,null,null,null,null,null,null,null,null,"Exercises"]
[null,{"$f":"Lists!$O$3","v":"Operational Coordination"},null,null,null,null,null,null,null,null,null,null,null,null,null,null,null,null,null,null,null,null,null,null,null,null,null,null,null,null,null,null,null,null,null,null,null,null,null,null,null,null,null,null,{"$f":"Lists!$O$3","v":"Operational Coordination"}]
[null,"Planning",null,null,null,null,null,null,null,null,null,null,null,null,null,null,null,null,null,null,null,null,null,null,null,null,null,null,null,null,null,null,null,null,null,null,null,null,null,null,null,null,null,null,"Planning"]
[null,"Organization",null,null,null,null,null,null,null,null,null,null,null,null,null,null,null,null,null,null,null,null,null,null,null,null,null,null,null,null,null,null,null,null,null,null,null,null,null,null,null,null,null,null,"Organization"]
[null,"Equipment",null,null,null,null,null,null,null,null,null,null,null,null,null,null,null,null,null,null,null,null,null,null,null,null,null,null,null,null,null,null,null,null,null,null,null,null,null,null,null,null,null,null,"Equipment"]
[null,"Training",null,null,null,null,null,null,null,null,null,null,null,null,null,null,null,null,null,null,null,null,null,null,null,null,null,null,null,null,null,null,null,null,null,null,null,null,null,null,null,null,null,null,"Training"]
[null,"Exercises",null,null,null,null,null,null,null,null,null,null,null,null,null,null,null,null,null,null,null,null,null,null,null,null,null,null,null,null,null,null,null,null,null,null,null,null,null,null,null,null,null,null,"Exercises"]
[null,{"$f":"Lists!$O$4","v":"Forensics and Attribution"},null,null,null,null,null,null,null,null,null,null,null,null,null,null,null,null,null,null,null,null,null,null,null,null,null,null,null,null,null,null,null,null,null,null,null,null,null,null,null,null,null,null,{"$f":"Lists!$O$4","v":"Forensics and Attribution"}]
[null,"Planning",null,null,null,null,null,null,null,null,null,null,null,null,null,null,null,null,null,null,null,null,null,null,null,null,null,null,null,null,null,null,null,null,null,null,null,null,null,null,null,null,null,null,"Planning"]
[null,"Organization",null,null,null,null,null,null,null,null,null,null,null,null,null,null,null,null,null,null,null,null,null,null,null,null,null,null,null,null,null,null,null,null,null,null,null,null,null,null,null,null,null,null,"Organization"]
[null,"Equipment",null,null,null,null,null,null,null,null,null,null,null,null,null,null,null,null,null,null,null,null,null,null,null,null,null,null,null,null,null,null,null,null,null,null,null,null,null,null,null,null,null,null,"Equipment"]
[null,"Training",null,null,null,null,null,null,null,null,null,null,null,null,null,null,null,null,null,null,null,null,null,null,null,null,null,null,null,null,null,null,null,null,null,null,null,null,null,null,null,null,null,null,"Training"]
[null,"Exercises",null,null,null,null,null,null,null,null,null,null,null,null,null,null,null,null,null,null,null,null,null,null,null,null,null,null,null,null,null,null,null,null,null,null,null,null,null,null,null,null,null,null,"Exercises"]
[null,{"$f":"Lists!$O$5","v":"Intelligence and Information Sharing"},null,null,null,null,null,null,null,null,null,null,null,null,null,null,null,null,null,null,null,null,null,null,null,null,null,null,null,null,null,null,null,null,null,null,null,null,null,null,null,null,null,null,{"$f":"Lists!$O$5","v":"Intelligence and Information Sharing"}]
[null,"Planning",null,null,null,null,null,null,null,null,null,null,null,null,null,null,null,null,null,null,null,null,null,null,null,null,null,null,null,null,null,null,null,null,null,null,null,null,null,null,null,null,null,null,"Planning"]
[null,"Organization",null,null,null,null,null,null,null,null,null,null,null,null,null,null,null,null,null,null,null,null,null,null,null,null,null,null,null,null,null,null,null,null,null,null,null,null,null,null,null,null,null,null,"Organization"]
[null,"Equipment",null,null,null,null,null,null,null,null,null,null,null,null,null,null,null,null,null,null,null,null,null,null,null,null,null,null,null,null,null,null,null,null,null,null,null,null,null,null,null,null,null,null,"Equipment"]
[null,"Training",null,null,null,null,null,null,null,null,null,null,null,null,null,null,null,null,null,null,null,null,null,null,null,null,null,null,null,null,null,null,null,null,null,null,null,null,null,null,null,null,null,null,"Training"]
[null,"Exercises",null,null,null,null,null,null,null,null,null,null,null,null,null,null,null,null,null,null,null,null,null,null,null,null,null,null,null,null,null,null,null,null,null,null,null,null,null,null,null,null,null,null,"Exercises"]
[null,{"$f":"Lists!$O$6","v":"Interdiction and Disruption"},null,null,null,null,null,null,null,null,null,null,null,null,null,null,null,null,null,null,null,null,null,null,null,null,null,null,null,null,null,null,null,null,null,null,null,null,null,null,null,null,null,null,{"$f":"Lists!$O$6","v":"Interdiction and Disruption"}]
[null,"Planning",null,null,null,null,null,null,null,null,null,null,null,null,null,null,null,null,null,null,null,null,null,null,null,null,null,null,null,null,null,null,null,null,null,null,null,null,null,null,null,null,null,null,"Planning"]
[null,"Organization",null,null,null,null,null,null,null,null,null,null,null,null,null,null,null,null,null,null,null,null,null,null,null,null,null,null,null,null,null,null,null,null,null,null,null,null,null,null,null,null,null,null,"Organization"]
[null,"Equipment",null,null,null,null,null,null,null,null,null,null,null,null,null,null,null,null,null,null,null,null,null,null,null,null,null,null,null,null,null,null,null,null,null,null,null,null,null,null,null,null,null,null,"Equipment"]
[null,"Training",null,null,null,null,null,null,null,null,null,null,null,null,null,null,null,null,null,null,null,null,null,null,null,null,null,null,null,null,null,null,null,null,null,null,null,null,null,null,null,null,null,null,"Training"]
[null,"Exercises",null,null,null,null,null,null,null,null,null,null,null,null,null,null,null,null,null,null,null,null,null,null,null,null,null,null,null,null,null,null,null,null,null,null,null,null,null,null,null,null,null,null,"Exercises"]
[null,{"$f":"Lists!$O$7","v":"Screening, Search, and Detection"},null,null,null,null,null,null,null,null,null,null,null,null,null,null,null,null,null,null,null,null,null,null,null,null,null,null,null,null,null,null,null,null,null,null,null,null,null,null,null,null,null,null,{"$f":"Lists!$O$7","v":"Screening, Search, and Detection"}]
[null,"Planning",null,null,null,null,null,null,null,null,null,null,null,null,null,null,null,null,null,null,null,null,null,null,null,null,null,null,null,null,null,null,null,null,null,null,null,null,null,null,null,null,null,null,"Planning"]
[null,"Organization",null,null,null,null,null,null,null,null,null,null,null,null,null,null,null,null,null,null,null,null,null,null,null,null,null,null,null,null,null,null,null,null,null,null,null,null,null,null,null,null,null,null,"Organization"]
[null,"Equipment",null,null,null,null,null,null,null,null,null,null,null,null,null,null,null,null,null,null,null,null,null,null,null,null,null,null,null,null,null,null,null,null,null,null,null,null,null,null,null,null,null,null,"Equipment"]
[null,"Training",null,null,null,null,null,null,null,null,null,null,null,null,null,null,null,null,null,null,null,null,null,null,null,null,null,null,null,null,null,null,null,null,null,null,null,null,null,null,null,null,null,null,"Training"]
[null,"Exercises",null,null,null,null,null,null,null,null,null,null,null,null,null,null,null,null,null,null,null,null,null,null,null,null,null,null,null,null,null,null,null,null,null,null,null,null,null,null,null,null,null,null,"Exercises"]
[null,{"$f":"Lists!$O$8","v":"Access Control and Identity Verification"},null,null,null,null,null,null,null,null,null,null,null,null,null,null,null,null,null,null,null,null,null,null,null,null,null,null,null,null,null,null,null,null,null,null,null,null,null,null,null,null,null,null,{"$f":"Lists!$O$8","v":"Access Control and Identity Verification"}]
[null,"Planning",null,null,null,null,null,null,null,null,null,null,null,null,null,null,null,null,null,null,null,null,null,null,null,null,null,null,null,null,null,null,null,null,null,null,null,null,null,null,null,null,null,null,"Planning"]
[null,"Organization",null,null,null,null,null,null,null,null,null,null,null,null,null,null,null,null,null,null,null,null,null,null,null,null,null,null,null,null,null,null,null,null,null,null,null,null,null,null,null,null,null,null,"Organization"]
[null,"Equipment",null,null,null,null,null,null,null,null,null,null,null,null,null,null,null,null,null,null,null,null,null,null,null,null,null,null,null,null,null,null,null,null,null,null,null,null,null,null,null,null,null,null,"Equipment"]
[null,"Training",null,null,null,null,null,null,null,null,null,null,null,null,null,null,null,null,null,null,null,null,null,null,null,null,null,null,null,null,null,null,null,null,null,null,null,null,null,null,null,null,null,null,"Training"]
[null,"Exercises",null,null,null,null,null,null,null,null,null,null,null,null,null,null,null,null,null,null,null,null,null,null,null,null,null,null,null,null,null,null,null,null,null,null,null,null,null,null,null,null,null,null,"Exercises"]
[null,{"$f":"Lists!$O$9","v":"Cybersecurity"},null,null,null,null,null,null,null,null,null,null,null,null,null,null,null,null,null,null,null,null,null,null,null,null,null,null,null,null,null,null,null,null,null,null,null,null,null,null,null,null,null,null,{"$f":"Lists!$O$9","v":"Cybersecurity"}]
[null,"Planning",null,null,null,null,null,null,null,null,null,null,null,null,null,null,null,null,null,null,null,null,null,null,null,null,null,null,null,null,null,null,null,null,null,null,null,null,null,null,null,null,null,null,"Planning"]
[null,"Organization",null,null,null,null,null,null,null,null,null,null,null,null,null,null,null,null,null,null,null,null,null,null,null,null,null,null,null,null,null,null,null,null,null,null,null,null,null,null,null,null,null,null,"Organization"]
[null,"Equipment",null,null,null,null,null,null,null,null,null,null,null,null,null,null,null,null,null,null,null,null,null,null,null,null,null,null,null,null,null,null,null,null,null,null,null,null,null,null,null,null,null,null,"Equipment"]
[null,"Training",null,null,null,null,null,null,null,null,null,null,null,null,null,null,null,null,null,null,null,null,null,null,null,null,null,null,null,null,null,null,null,null,null,null,null,null,null,null,null,null,null,null,"Training"]
[null,"Exercises",null,null,null,null,null,null,null,null,null,null,null,null,null,null,null,null,null,null,null,null,null,null,null,null,null,null,null,null,null,null,null,null,null,null,null,null,null,null,null,null,null,null,"Exercises"]
[null,{"$f":"Lists!$O$10","v":"Physical Protective Measures"},null,null,null,null,null,null,null,null,null,null,null,null,null,null,null,null,null,null,null,null,null,null,null,null,null,null,null,null,null,null,null,null,null,null,null,null,null,null,null,null,null,null,{"$f":"Lists!$O$10","v":"Physical Protective Measures"}]
[null,"Planning",null,null,null,null,null,null,null,null,null,null,null,null,null,null,null,null,null,null,null,null,null,null,null,null,null,null,null,null,null,null,null,null,null,null,null,null,null,null,null,null,null,null,"Planning"]
[null,"Organization",null,null,null,null,null,null,null,null,null,null,null,null,null,null,null,null,null,null,null,null,null,null,null,null,null,null,null,null,null,null,null,null,null,null,null,null,null,null,null,null,null,null,"Organization"]
[null,"Equipment",null,null,null,null,null,null,null,null,null,null,null,null,null,null,null,null,null,null,null,null,null,null,null,null,null,null,null,null,null,null,null,null,null,null,null,null,null,null,null,null,null,null,"Equipment"]
[null,"Training",null,null,null,null,null,null,null,null,null,null,null,null,null,null,null,null,null,null,null,null,null,null,null,null,null,null,null,null,null,null,null,null,null,null,null,null,null,null,null,null,null,null,"Training"]
[null,"Exercises",null,null,null,null,null,null,null,null,null,null,null,null,null,null,null,null,null,null,null,null,null,null,null,null,null,null,null,null,null,null,null,null,null,null,null,null,null,null,null,null,null,null,"Exercises"]
[null,{"$f":"Lists!$O$11","v":"Risk Management for Protection Programs and Activities"},null,null,null,null,null,null,null,null,null,null,null,null,null,null,null,null,null,null,null,null,null,null,null,null,null,null,null,null,null,null,null,null,null,null,null,null,null,null,null,null,null,null,{"$f":"Lists!$O$11","v":"Risk Management for Protection Programs and Activities"}]
[null,"Planning",null,null,null,null,null,null,null,null,null,null,null,null,null,null,null,null,null,null,null,null,null,null,null,null,null,null,null,null,null,null,null,null,null,null,null,null,null,null,null,null,null,null,"Planning"]
[null,"Organization",null,null,null,null,null,null,null,null,null,null,null,null,null,null,null,null,null,null,null,null,null,null,null,null,null,null,null,null,null,null,null,null,null,null,null,null,null,null,null,null,null,null,"Organization"]
[null,"Equipment",null,null,null,null,null,null,null,null,null,null,null,null,null,null,null,null,null,null,null,null,null,null,null,null,null,null,null,null,null,null,null,null,null,null,null,null,null,null,null,null,null,null,"Equipment"]
[null,"Training",null,null,null,null,null,null,null,null,null,null,null,null,null,null,null,null,null,null,null,null,null,null,null,null,null,null,null,null,null,null,null,null,null,null,null,null,null,null,null,null,null,null,"Training"]
[null,"Exercises",null,null,null,null,null,null,null,null,null,null,null,null,null,null,null,null,null,null,null,null,null,null,null,null,null,null,null,null,null,null,null,null,null,null,null,null,null,null,null,null,null,null,"Exercises"]
[null,{"$f":"Lists!$O$12","v":"Supply Chain Integrity and Security"},null,null,null,null,null,null,null,null,null,null,null,null,null,null,null,null,null,null,null,null,null,null,null,null,null,null,null,null,null,null,null,null,null,null,null,null,null,null,null,null,null,null,{"$f":"Lists!$O$12","v":"Supply Chain Integrity and Security"}]
[null,"Planning",null,null,null,null,null,null,null,null,null,null,null,null,null,null,null,null,null,null,null,null,null,null,null,null,null,null,null,null,null,null,null,null,null,null,null,null,null,null,null,null,null,null,"Planning"]
[null,"Organization",null,null,null,null,null,null,null,null,null,null,null,null,null,null,null,null,null,null,null,null,null,null,null,null,null,null,null,null,null,null,null,null,null,null,null,null,null,null,null,null,null,null,"Organization"]
[null,"Equipment",null,null,null,null,null,null,null,null,null,null,null,null,null,null,null,null,null,null,null,null,null,null,null,null,null,null,null,null,null,null,null,null,null,null,null,null,null,null,null,null,null,null,"Equipment"]
[null,"Training",null,null,null,null,null,null,null,null,null,null,null,null,null,null,null,null,null,null,null,null,null,null,null,null,null,null,null,null,null,null,null,null,null,null,null,null,null,null,null,null,null,null,"Training"]
[null,"Exercises",null,null,null,null,null,null,null,null,null,null,null,null,null,null,null,null,null,null,null,null,null,null,null,null,null,null,null,null,null,null,null,null,null,null,null,null,null,null,null,null,null,null,"Exercises"]
[null,{"$f":"Lists!$O$13","v":"Community Resilience"},null,null,null,null,null,null,null,null,null,null,null,null,null,null,null,null,null,null,null,null,null,null,null,null,null,null,null,null,null,null,null,null,null,null,null,null,null,null,null,null,null,null,{"$f":"Lists!$O$13","v":"Community Resilience"}]
[null,"Planning",null,null,null,null,null,null,null,null,null,null,null,null,null,null,null,null,null,null,null,null,null,null,null,null,null,null,null,null,null,null,null,null,null,null,null,null,null,null,null,null,null,null,"Planning"]
[null,"Organization",null,null,null,null,null,null,null,null,null,null,null,null,null,null,null,null,null,null,null,null,null,null,null,null,null,null,null,null,null,null,null,null,null,null,null,null,null,null,null,null,null,null,"Organization"]
[null,"Equipment",null,null,null,null,null,null,null,null,null,null,null,null,null,null,null,null,null,null,null,null,null,null,null,null,null,null,null,null,null,null,null,null,null,null,null,null,null,null,null,null,null,null,"Equipment"]
[null,"Training",null,null,null,null,null,null,null,null,null,null,null,null,null,null,null,null,null,null,null,null,null,null,null,null,null,null,null,null,null,null,null,null,null,null,null,null,null,null,null,null,null,null,"Training"]
[null,"Exercises",null,null,null,null,null,null,null,null,null,null,null,null,null,null,null,null,null,null,null,null,null,null,null,null,null,null,null,null,null,null,null,null,null,null,null,null,null,null,null,null,null,null,"Exercises"]
[null,{"$f":"Lists!$O$14","v":"Long-term Vulnerability Reduction"},null,null,null,null,null,null,null,null,null,null,null,null,null,null,null,null,null,null,null,null,null,null,null,null,null,null,null,null,null,null,null,null,null,null,null,null,null,null,null,null,null,null,{"$f":"Lists!$O$14","v":"Long-term Vulnerability Reduction"}]
[null,"Planning",null,null,null,null,null,null,null,null,null,null,null,null,null,null,null,null,null,null,null,null,null,null,null,null,null,null,null,null,null,null,null,null,null,null,null,null,null,null,null,null,null,null,"Planning"]
[null,"Organization",null,null,null,null,null,null,null,null,null,null,null,null,null,null,null,null,null,null,null,null,null,null,null,null,null,null,null,null,null,null,null,null,null,null,null,null,null,null,null,null,null,null,"Organization"]
[null,"Equipment",null,null,null,null,null,null,null,null,null,null,null,null,null,null,null,null,null,null,null,null,null,null,null,null,null,null,null,null,null,null,null,null,null,null,null,null,null,null,null,null,null,null,"Equipment"]
[null,"Training",null,null,null,null,null,null,null,null,null,null,null,null,null,null,null,null,null,null,null,null,null,null,null,null,null,null,null,null,null,null,null,null,null,null,null,null,null,null,null,null,null,null,"Training"]
[null,"Exercises",null,null,null,null,null,null,null,null,null,null,null,null,null,null,null,null,null,null,null,null,null,null,null,null,null,null,null,null,null,null,null,null,null,null,null,null,null,null,null,null,null,null,"Exercises"]
[null,{"$f":"Lists!$O$15","v":"Risk and Disaster Resilience Assessment"},null,null,null,null,null,null,null,null,null,null,null,null,null,null,null,null,null,null,null,null,null,null,null,null,null,null,null,null,null,null,null,null,null,null,null,null,null,null,null,null,null,null,{"$f":"Lists!$O$15","v":"Risk and Disaster Resilience Assessment"}]
[null,"Planning",null,null,null,null,null,null,null,null,null,null,null,null,null,null,null,null,null,null,null,null,null,null,null,null,null,null,null,null,null,null,null,null,null,null,null,null,null,null,null,null,null,null,"Planning"]
[null,"Organization",null,null,null,null,null,null,null,null,null,null,null,null,null,null,null,null,null,null,null,null,null,null,null,null,null,null,null,null,null,null,null,null,null,null,null,null,null,null,null,null,null,null,"Organization"]
[null,"Equipment",null,null,null,null,null,null,null,null,null,null,null,null,null,null,null,null,null,null,null,null,null,null,null,null,null,null,null,null,null,null,null,null,null,null,null,null,null,null,null,null,null,null,"Equipment"]
[null,"Training",null,null,null,null,null,null,null,null,null,null,null,null,null,null,null,null,null,null,null,null,null,null,null,null,null,null,null,null,null,null,null,null,null,null,null,null,null,null,null,null,null,null,"Training"]
[null,"Exercises",null,null,null,null,null,null,null,null,null,null,null,null,null,null,null,null,null,null,null,null,null,null,null,null,null,null,null,null,null,null,null,null,null,null,null,null,null,null,null,null,null,null,"Exercises"]
[null,{"$f":"Lists!$O$16","v":"Threats and Hazard Identification"},null,null,null,null,null,null,null,null,null,null,null,null,null,null,null,null,null,null,null,null,null,null,null,null,null,null,null,null,null,null,null,null,null,null,null,null,null,null,null,null,null,null,{"$f":"Lists!$O$16","v":"Threats and Hazard Identification"}]
[null,"Planning",null,null,null,null,null,null,null,null,null,null,null,null,null,null,null,null,null,null,null,null,null,null,null,null,null,null,null,null,null,null,null,null,null,null,null,null,null,null,null,null,null,null,"Planning"]
[null,"Organization",null,null,null,null,null,null,null,null,null,null,null,null,null,null,null,null,null,null,null,null,null,null,null,null,null,null,null,null,null,null,null,null,null,null,null,null,null,null,null,null,null,null,"Organization"]
[null,"Equipment",null,null,null,null,null,null,null,null,null,null,null,null,null,null,null,null,null,null,null,null,null,null,null,null,null,null,null,null,null,null,null,null,null,null,null,null,null,null,null,null,null,null,"Equipment"]
[null,"Training",null,null,null,null,null,null,null,null,null,null,null,null,null,null,null,null,null,null,null,null,null,null,null,null,null,null,null,null,null,null,null,null,null,null,null,null,null,null,null,null,null,null,"Training"]
[null,"Exercises",null,null,null,null,null,null,null,null,null,null,null,null,null,null,null,null,null,null,null,null,null,null,null,null,null,null,null,null,null,null,null,null,null,null,null,null,null,null,null,null,null,null,"Exercises"]
[null,{"$f":"Lists!$O$17","v":"Critical Transportation"},null,null,null,null,null,null,null,null,null,null,null,null,null,null,null,null,null,null,null,null,null,null,null,null,null,null,null,null,null,null,null,null,null,null,null,null,null,null,null,null,null,null,{"$f":"Lists!$O$17","v":"Critical Transportation"}]
[null,"Planning",null,null,null,null,null,null,null,null,null,null,null,null,null,null,null,null,null,null,null,null,null,null,null,null,null,null,null,null,null,null,null,null,null,null,null,null,null,null,null,null,null,null,"Planning"]
[null,"Organization",null,null,null,null,null,null,null,null,null,null,null,null,null,null,null,null,null,null,null,null,null,null,null,null,null,null,null,null,null,null,null,null,null,null,null,null,null,null,null,null,null,null,"Organization"]
[null,"Equipment",null,null,null,null,null,null,null,null,null,null,null,null,null,null,null,null,null,null,null,null,null,null,null,null,null,null,null,null,null,null,null,null,null,null,null,null,null,null,null,null,null,null,"Equipment"]
[null,"Training",null,null,null,null,null,null,null,null,null,null,null,null,null,null,null,null,null,null,null,null,null,null,null,null,null,null,null,null,null,null,null,null,null,null,null,null,null,null,null,null,null,null,"Training"]
[null,"Exercises",null,null,null,null,null,null,null,null,null,null,null,null,null,null,null,null,null,null,null,null,null,null,null,null,null,null,null,null,null,null,null,null,null,null,null,null,null,null,null,null,null,null,"Exercises"]
[null,{"$f":"Lists!$O$18","v":"Environmental Response/Health and Safety"},null,null,null,null,null,null,null,null,null,null,null,null,null,null,null,null,null,null,null,null,null,null,null,null,null,null,null,null,null,null,null,null,null,null,null,null,null,null,null,null,null,null,{"$f":"Lists!$O$18","v":"Environmental Response/Health and Safety"}]
[null,"Planning",null,null,null,null,null,null,null,null,null,null,null,null,null,null,null,null,null,null,null,null,null,null,null,null,null,null,null,null,null,null,null,null,null,null,null,null,null,null,null,null,null,null,"Planning"]
[null,"Organization",null,null,null,null,null,null,null,null,null,null,null,null,null,null,null,null,null,null,null,null,null,null,null,null,null,null,null,null,null,null,null,null,null,null,null,null,null,null,null,null,null,null,"Organization"]
[null,"Equipment",null,null,null,null,null,null,null,null,null,null,null,null,null,null,null,null,null,null,null,null,null,null,null,null,null,null,null,null,null,null,null,null,null,null,null,null,null,null,null,null,null,null,"Equipment"]
[null,"Training",null,null,null,null,null,null,null,null,null,null,null,null,null,null,null,null,null,null,null,null,null,null,null,null,null,null,null,null,null,null,null,null,null,null,null,null,null,null,null,null,null,null,"Training"]
[null,"Exercises",null,null,null,null,null,null,null,null,null,null,null,null,null,null,null,null,null,null,null,null,null,null,null,null,null,null,null,null,null,null,null,null,null,null,null,null,null,null,null,null,null,null,"Exercises"]
[null,{"$f":"Lists!$O$19","v":"Fatality Management Services"},null,null,null,null,null,null,null,null,null,null,null,null,null,null,null,null,null,null,null,null,null,null,null,null,null,null,null,null,null,null,null,null,null,null,null,null,null,null,null,null,null,null,{"$f":"Lists!$O$19","v":"Fatality Management Services"}]
[null,"Planning",null,null,null,null,null,null,null,null,null,null,null,null,null,null,null,null,null,null,null,null,null,null,null,null,null,null,null,null,null,null,null,null,null,null,null,null,null,null,null,null,null,null,"Planning"]
[null,"Organization",null,null,null,null,null,null,null,null,null,null,null,null,null,null,null,null,null,null,null,null,null,null,null,null,null,null,null,null,null,null,null,null,null,null,null,null,null,null,null,null,null,null,"Organization"]
[null,"Equipment",null,null,null,null,null,null,null,null,null,null,null,null,null,null,null,null,null,null,null,null,null,null,null,null,null,null,null,null,null,null,null,null,null,null,null,null,null,null,null,null,null,null,"Equipment"]
[null,"Training",null,null,null,null,null,null,null,null,null,null,null,null,null,null,null,null,null,null,null,null,null,null,null,null,null,null,null,null,null,null,null,null,null,null,null,null,null,null,null,null,null,null,"Training"]
[null,"Exercises",null,null,null,null,null,null,null,null,null,null,null,null,null,null,null,null,null,null,null,null,null,null,null,null,null,null,null,null,null,null,null,null,null,null,null,null,null,null,null,null,null,null,"Exercises"]
[null,{"$f":"Lists!$O$20","v":"Infrastructure Systems"},null,null,null,null,null,null,null,null,null,null,null,null,null,null,null,null,null,null,null,null,null,null,null,null,null,null,null,null,null,null,null,null,null,null,null,null,null,null,null,null,null,null,{"$f":"Lists!$O$20","v":"Infrastructure Systems"}]
[null,"Planning",null,null,null,null,null,null,null,null,null,null,null,null,null,null,null,null,null,null,null,null,null,null,null,null,null,null,null,null,null,null,null,null,null,null,null,null,null,null,null,null,null,null,"Planning"]
[null,"Organization",null,null,null,null,null,null,null,null,null,null,null,null,null,null,null,null,null,null,null,null,null,null,null,null,null,null,null,null,null,null,null,null,null,null,null,null,null,null,null,null,null,null,"Organization"]
[null,"Equipment",null,null,null,null,null,null,null,null,null,null,null,null,null,null,null,null,null,null,null,null,null,null,null,null,null,null,null,null,null,null,null,null,null,null,null,null,null,null,null,null,null,null,"Equipment"]
[null,"Training",null,null,null,null,null,null,null,null,null,null,null,null,null,null,null,null,null,null,null,null,null,null,null,null,null,null,null,null,null,null,null,null,null,null,null,null,null,null,null,null,null,null,"Training"]
[null,"Exercises",null,null,null,null,null,null,null,null,null,null,null,null,null,null,null,null,null,null,null,null,null,null,null,null,null,null,null,null,null,null,null,null,null,null,null,null,null,null,null,null,null,null,"Exercises"]
[null,{"$f":"Lists!$O$21","v":"Mass Care Services"},null,null,null,null,null,null,null,null,null,null,null,null,null,null,null,null,null,null,null,null,null,null,null,null,null,null,null,null,null,null,null,null,null,null,null,null,null,null,null,null,null,null,{"$f":"Lists!$O$21","v":"Mass Care Services"}]
[null,"Planning",null,null,null,null,null,null,null,null,null,null,null,null,null,null,null,null,null,null,null,null,null,null,null,null,null,null,null,null,null,null,null,null,null,null,null,null,null,null,null,null,null,null,"Planning"]
[null,"Organization",null,null,null,null,null,null,null,null,null,null,null,null,null,null,null,null,null,null,null,null,null,null,null,null,null,null,null,null,null,null,null,null,null,null,null,null,null,null,null,null,null,null,"Organization"]
[null,"Equipment",null,null,null,null,null,null,null,null,null,null,null,null,null,null,null,null,null,null,null,null,null,null,null,null,null,null,null,null,null,null,null,null,null,null,null,null,null,null,null,null,null,null,"Equipment"]
[null,"Training",null,null,null,null,null,null,null,null,null,null,null,null,null,null,null,null,null,null,null,null,null,null,null,null,null,null,null,null,null,null,null,null,null,null,null,null,null,null,null,null,null,null,"Training"]
[null,"Exercises",null,null,null,null,null,null,null,null,null,null,null,null,null,null,null,null,null,null,null,null,null,null,null,null,null,null,null,null,null,null,null,null,null,null,null,null,null,null,null,null,null,null,"Exercises"]
[null,{"$f":"Lists!$O$22","v":"Mass Search and Rescue Operations"},null,null,null,null,null,null,null,null,null,null,null,null,null,null,null,null,null,null,null,null,null,null,null,null,null,null,null,null,null,null,null,null,null,null,null,null,null,null,null,null,null,null,{"$f":"Lists!$O$22","v":"Mass Search and Rescue Operations"}]
[null,"Planning",null,null,null,null,null,null,null,null,null,null,null,null,null,null,null,null,null,null,null,null,null,null,null,null,null,null,null,null,null,null,null,null,null,null,null,null,null,null,null,null,null,null,"Planning"]
[null,"Organization",null,null,null,null,null,null,null,null,null,null,null,null,null,null,null,null,null,null,null,null,null,null,null,null,null,null,null,null,null,null,null,null,null,null,null,null,null,null,null,null,null,null,"Organization"]
[null,"Equipment",null,null,null,null,null,null,null,null,null,null,null,null,null,null,null,null,null,null,null,null,null,null,null,null,null,null,null,null,null,null,null,null,null,null,null,null,null,null,null,null,null,null,"Equipment"]
[null,"Training",null,null,null,null,null,null,null,null,null,null,null,null,null,null,null,null,null,null,null,null,null,null,null,null,null,null,null,null,null,null,null,null,null,null,null,null,null,null,null,null,null,null,"Training"]
[null,"Exercises",null,null,null,null,null,null,null,null,null,null,null,null,null,null,null,null,null,null,null,null,null,null,null,null,null,null,null,null,null,null,null,null,null,null,null,null,null,null,null,null,null,null,"Exercises"]
[null,{"$f":"Lists!$O$23","v":"On-scene Security and Protection"},null,null,null,null,null,null,null,null,null,null,null,null,null,null,null,null,null,null,null,null,null,null,null,null,null,null,null,null,null,null,null,null,null,null,null,null,null,null,null,null,null,null,{"$f":"Lists!$O$23","v":"On-scene Security and Protection"}]
[null,"Planning",null,null,null,null,null,null,null,null,null,null,null,null,null,null,null,null,null,null,null,null,null,null,null,null,null,null,null,null,null,null,null,null,null,null,null,null,null,null,null,null,null,null,"Planning"]
[null,"Organization",null,null,null,null,null,null,null,null,null,null,null,null,null,null,null,null,null,null,null,null,null,null,null,null,null,null,null,null,null,null,null,null,null,null,null,null,null,null,null,null,null,null,"Organization"]
[null,"Equipment",null,null,null,null,null,null,null,null,null,null,null,null,null,null,null,null,null,null,null,null,null,null,null,null,null,null,null,null,null,null,null,null,null,null,null,null,null,null,null,null,null,null,"Equipment"]
[null,"Training",null,null,null,null,null,null,null,null,null,null,null,null,null,null,null,null,null,null,null,null,null,null,null,null,null,null,null,null,null,null,null,null,null,null,null,null,null,null,null,null,null,null,"Training"]
[null,"Exercises",null,null,null,null,null,null,null,null,null,null,null,null,null,null,null,null,null,null,null,null,null,null,null,null,null,null,null,null,null,null,null,null,null,null,null,null,null,null,null,null,null,null,"Exercises"]
[null,{"$f":"Lists!$O$24","v":"Operational Communications"},null,null,null,null,null,null,null,null,null,null,null,null,null,null,null,null,null,null,null,null,null,null,null,null,null,null,null,null,null,null,null,null,null,null,null,null,null,null,null,null,null,null,{"$f":"Lists!$O$24","v":"Operational Communications"}]
[null,"Planning",null,null,null,null,null,null,null,null,null,null,null,null,null,null,null,null,null,null,null,null,null,null,null,null,null,null,null,null,null,null,null,null,null,null,null,null,null,null,null,null,null,null,"Planning"]
[null,"Organization",null,null,null,null,null,null,null,null,null,null,null,null,null,null,null,null,null,null,null,null,null,null,null,null,null,null,null,null,null,null,null,null,null,null,null,null,null,null,null,null,null,null,"Organization"]
[null,"Equipment",null,null,null,null,null,null,null,null,null,null,null,null,null,null,null,null,null,null,null,null,null,null,null,null,null,null,null,null,null,null,null,null,null,null,null,null,null,null,null,null,null,null,"Equipment"]
[null,"Training",null,null,null,null,null,null,null,null,null,null,null,null,null,null,null,null,null,null,null,null,null,null,null,null,null,null,null,null,null,null,null,null,null,null,null,null,null,null,null,null,null,null,"Training"]
[null,"Exercises",null,null,null,null,null,null,null,null,null,null,null,null,null,null,null,null,null,null,null,null,null,null,null,null,null,null,null,null,null,null,null,null,null,null,null,null,null,null,null,null,null,null,"Exercises"]
[null,{"$f":"Lists!$O$25","v":"Public and Private Services and Resources"},null,null,null,null,null,null,null,null,null,null,null,null,null,null,null,null,null,null,null,null,null,null,null,null,null,null,null,null,null,null,null,null,null,null,null,null,null,null,null,null,null,null,{"$f":"Lists!$O$25","v":"Public and Private Services and Resources"}]
[null,"Planning",null,null,null,null,null,null,null,null,null,null,null,null,null,null,null,null,null,null,null,null,null,null,null,null,null,null,null,null,null,null,null,null,null,null,null,null,null,null,null,null,null,null,"Planning"]
[null,"Organization",null,null,null,null,null,null,null,null,null,null,null,null,null,null,null,null,null,null,null,null,null,null,null,null,null,null,null,null,null,null,null,null,null,null,null,null,null,null,null,null,null,null,"Organization"]
[null,"Equipment",null,null,null,null,null,null,null,null,null,null,null,null,null,null,null,null,null,null,null,null,null,null,null,null,null,null,null,null,null,null,null,null,null,null,null,null,null,null,null,null,null,null,"Equipment"]
[null,"Training",null,null,null,null,null,null,null,null,null,null,null,null,null,null,null,null,null,null,null,null,null,null,null,null,null,null,null,null,null,null,null,null,null,null,null,null,null,null,null,null,null,null,"Training"]
[null,"Exercises",null,null,null,null,null,null,null,null,null,null,null,null,null,null,null,null,null,null,null,null,null,null,null,null,null,null,null,null,null,null,null,null,null,null,null,null,null,null,null,null,null,null,"Exercises"]
[null,{"$f":"Lists!$O$26","v":"Public Health and Medical Services"},null,null,null,null,null,null,null,null,null,null,null,null,null,null,null,null,null,null,null,null,null,null,null,null,null,null,null,null,null,null,null,null,null,null,null,null,null,null,null,null,null,null,{"$f":"Lists!$O$26","v":"Public Health and Medical Services"}]
[null,"Planning",null,null,null,null,null,null,null,null,null,null,null,null,null,null,null,null,null,null,null,null,null,null,null,null,null,null,null,null,null,null,null,null,null,null,null,null,null,null,null,null,null,null,"Planning"]
[null,"Organization",null,null,null,null,null,null,null,null,null,null,null,null,null,null,null,null,null,null,null,null,null,null,null,null,null,null,null,null,null,null,null,null,null,null,null,null,null,null,null,null,null,null,"Organization"]
[null,"Equipment",null,null,null,null,null,null,null,null,null,null,null,null,null,null,null,null,null,null,null,null,null,null,null,null,null,null,null,null,null,null,null,null,null,null,null,null,null,null,null,null,null,null,"Equipment"]
[null,"Training",null,null,null,null,null,null,null,null,null,null,null,null,null,null,null,null,null,null,null,null,null,null,null,null,null,null,null,null,null,null,null,null,null,null,null,null,null,null,null,null,null,null,"Training"]
[null,"Exercises",null,null,null,null,null,null,null,null,null,null,null,null,null,null,null,null,null,null,null,null,null,null,null,null,null,null,null,null,null,null,null,null,null,null,null,null,null,null,null,null,null,null,"Exercises"]
[null,{"$f":"Lists!$O$27","v":"Situational Assessment"},null,null,null,null,null,null,null,null,null,null,null,null,null,null,null,null,null,null,null,null,null,null,null,null,null,null,null,null,null,null,null,null,null,null,null,null,null,null,null,null,null,null,{"$f":"Lists!$O$27","v":"Situational Assessment"}]
[null,"Planning",null,null,null,null,null,null,null,null,null,null,null,null,null,null,null,null,null,null,null,null,null,null,null,null,null,null,null,null,null,null,null,null,null,null,null,null,null,null,null,null,null,null,"Planning"]
[null,"Organization",null,null,null,null,null,null,null,null,null,null,null,null,null,null,null,null,null,null,null,null,null,null,null,null,null,null,null,null,null,null,null,null,null,null,null,null,null,null,null,null,null,null,"Organization"]
[null,"Equipment",null,null,null,null,null,null,null,null,null,null,null,null,null,null,null,null,null,null,null,null,null,null,null,null,null,null,null,null,null,null,null,null,null,null,null,null,null,null,null,null,null,null,"Equipment"]
[null,"Training",null,null,null,null,null,null,null,null,null,null,null,null,null,null,null,null,null,null,null,null,null,null,null,null,null,null,null,null,null,null,null,null,null,null,null,null,null,null,null,null,null,null,"Training"]
[null,"Exercises",null,null,null,null,null,null,null,null,null,null,null,null,null,null,null,null,null,null,null,null,null,null,null,null,null,null,null,null,null,null,null,null,null,null,null,null,null,null,null,null,null,null,"Exercises"]
[null,{"$f":"Lists!$O$28","v":"Economic Recovery"},null,null,null,null,null,null,null,null,null,null,null,null,null,null,null,null,null,null,null,null,null,null,null,null,null,null,null,null,null,null,null,null,null,null,null,null,null,null,null,null,null,null,{"$f":"Lists!$O$28","v":"Economic Recovery"}]
[null,"Planning",null,null,null,null,null,null,null,null,null,null,null,null,null,null,null,null,null,null,null,null,null,null,null,null,null,null,null,null,null,null,null,null,null,null,null,null,null,null,null,null,null,null,"Planning"]
[null,"Organization",null,null,null,null,null,null,null,null,null,null,null,null,null,null,null,null,null,null,null,null,null,null,null,null,null,null,null,null,null,null,null,null,null,null,null,null,null,null,null,null,null,null,"Organization"]
[null,"Equipment",null,null,null,null,null,null,null,null,null,null,null,null,null,null,null,null,null,null,null,null,null,null,null,null,null,null,null,null,null,null,null,null,null,null,null,null,null,null,null,null,null,null,"Equipment"]
[null,"Training",null,null,null,null,null,null,null,null,null,null,null,null,null,null,null,null,null,null,null,null,null,null,null,null,null,null,null,null,null,null,null,null,null,null,null,null,null,null,null,null,null,null,"Training"]
[null,"Exercises",null,null,null,null,null,null,null,null,null,null,null,null,null,null,null,null,null,null,null,null,null,null,null,null,null,null,null,null,null,null,null,null,null,null,null,null,null,null,null,null,null,null,"Exercises"]
[null,{"$f":"Lists!$O$29","v":"Health and Social Services"},null,null,null,null,null,null,null,null,null,null,null,null,null,null,null,null,null,null,null,null,null,null,null,null,null,null,null,null,null,null,null,null,null,null,null,null,null,null,null,null,null,null,{"$f":"Lists!$O$29","v":"Health and Social Services"}]
[null,"Planning",null,null,null,null,null,null,null,null,null,null,null,null,null,null,null,null,null,null,null,null,null,null,null,null,null,null,null,null,null,null,null,null,null,null,null,null,null,null,null,null,null,null,"Planning"]
[null,"Organization",null,null,null,null,null,null,null,null,null,null,null,null,null,null,null,null,null,null,null,null,null,null,null,null,null,null,null,null,null,null,null,null,null,null,null,null,null,null,null,null,null,null,"Organization"]
[null,"Equipment",null,null,null,null,null,null,null,null,null,null,null,null,null,null,null,null,null,null,null,null,null,null,null,null,null,null,null,null,null,null,null,null,null,null,null,null,null,null,null,null,null,null,"Equipment"]
[null,"Training",null,null,null,null,null,null,null,null,null,null,null,null,null,null,null,null,null,null,null,null,null,null,null,null,null,null,null,null,null,null,null,null,null,null,null,null,null,null,null,null,null,null,"Training"]
[null,"Exercises",null,null,null,null,null,null,null,null,null,null,null,null,null,null,null,null,null,null,null,null,null,null,null,null,null,null,null,null,null,null,null,null,null,null,null,null,null,null,null,null,null,null,"Exercises"]
[null,{"$f":"Lists!$O$30","v":"Housing"},null,null,null,null,null,null,null,null,null,null,null,null,null,null,null,null,null,null,null,null,null,null,null,null,null,null,null,null,null,null,null,null,null,null,null,null,null,null,null,null,null,null,{"$f":"Lists!$O$30","v":"Housing"}]
[null,"Planning",null,null,null,null,null,null,null,null,null,null,null,null,null,null,null,null,null,null,null,null,null,null,null,null,null,null,null,null,null,null,null,null,null,null,null,null,null,null,null,null,null,null,"Planning"]
[null,"Organization",null,null,null,null,null,null,null,null,null,null,null,null,null,null,null,null,null,null,null,null,null,null,null,null,null,null,null,null,null,null,null,null,null,null,null,null,null,null,null,null,null,null,"Organization"]
[null,"Equipment",null,null,null,null,null,null,null,null,null,null,null,null,null,null,null,null,null,null,null,null,null,null,null,null,null,null,null,null,null,null,null,null,null,null,null,null,null,null,null,null,null,null,"Equipment"]
[null,"Training",null,null,null,null,null,null,null,null,null,null,null,null,null,null,null,null,null,null,null,null,null,null,null,null,null,null,null,null,null,null,null,null,null,null,null,null,null,null,null,null,null,null,"Training"]
[null,"Exercises",null,null,null,null,null,null,null,null,null,null,null,null,null,null,null,null,null,null,null,null,null,null,null,null,null,null,null,null,null,null,null,null,null,null,null,null,null,null,null,null,null,null,"Exercises"]
[null,{"$f":"Lists!$O$31","v":"Natural and Cultural Resources"},null,null,null,null,null,null,null,null,null,null,null,null,null,null,null,null,null,null,null,null,null,null,null,null,null,null,null,null,null,null,null,null,null,null,null,null,null,null,null,null,null,null,{"$f":"Lists!$O$31","v":"Natural and Cultural Resources"}]
[null,"Planning",null,null,null,null,null,null,null,null,null,null,null,null,null,null,null,null,null,null,null,null,null,null,null,null,null,null,null,null,null,null,null,null,null,null,null,null,null,null,null,null,null,null,"Planning"]
[null,"Organization",null,null,null,null,null,null,null,null,null,null,null,null,null,null,null,null,null,null,null,null,null,null,null,null,null,null,null,null,null,null,null,null,null,null,null,null,null,null,null,null,null,null,"Organization"]
[null,"Equipment",null,null,null,null,null,null,null,null,null,null,null,null,null,null,null,null,null,null,null,null,null,null,null,null,null,null,null,null,null,null,null,null,null,null,null,null,null,null,null,null,null,null,"Equipment"]
[null,"Training",null,null,null,null,null,null,null,null,null,null,null,null,null,null,null,null,null,null,null,null,null,null,null,null,null,null,null,null,null,null,null,null,null,null,null,null,null,null,null,null,null,null,"Training"]
[null,"Exercises",null,null,null,null,null,null,null,null,null,null,null,null,null,null,null,null,null,null,null,null,null,null,null,null,null,null,null,null,null,null,null,null,null,null,null,null,null,null,null,null,null,null,"Exercises"]

{"sheet":"Write Word Document","index":73,"n_rows":0,"n_cols":0,"rows_kept":0,"cut":false,"hidden":false,"merged":[]}

{"sheet":"NIMS Implementation","index":74,"n_rows":120,"n_cols":19,"rows_kept":120,"cut":false,"hidden":true,"merged":[[119,1,119,7],[15,1,15,7],[20,1,20,7],[34,1,34,7],[43,2,43,7],[47,1,47,7],[60,1,60,7],[76,1,76,7],[81,1,81,7],[97,1,97,7],[102,2,102,7],[114,1,114,7]]}
[]
[]
[]
[]
[]
[]
[]
[]
[]
[]
[]
[]
[]
[null,"Percentage compliance:",null,null,null,{"$f":"(IF(S16=1,1,0)+IF(S21=1,1,0)+IF(S35=1,1,0)+IF(S48=1,1,0)+IF(S61=1,1,0)+IF(S77=1,1,0)+IF(S82=1,1,0)+IF(S98=1,1,0)+IF(S115=1,1,0)+IF(S120=1,1,0))/10","v":0.2}]
[]
[null,"1.  Has the jurisdiction formally adopted, and/or maintained the adoption for Fiscal Year (FY) 2013, the National Incident Management System as its all-hazards incident management system? ",null,null,null,null,null,null,null,null,null,null,null,null,null,null,null,null,1]
[]
[]
[]
[]
[null,"2.  Does the jurisdiction review and revise plans to incorporate NIMS components, principles, and policies?",null,null,null,null,null,null,null,null,null,null,null,null,null,null,null,null,1]
[]
[]
[]
[]
[null,null,"If yes, select all that are reviewed/revised"]
[]
[null,null,null,null,null,null,null,null,null,null,null,null,null,null,null,null,null,null,true]
[null,null,null,null,null,null,null,null,null,null,null,null,null,null,null,null,null,null,true]
[null,null,null,null,null,null,null,null,null,null,null,null,null,null,null,null,null,null,true]
[null,null,null,null,null,null,null,null,null,null,null,null,null,null,null,null,null,null,true]
[null,null,null,null,null,null,null,null,null,null,null,null,null,null,null,null,null,null,true]
[null,null,null,null,null,null,null,null,null,null,null,null,null,null,null,null,null,null,true]
[]
[null,"3.  Does the jurisdiction promote and/or develop intrastate mutual aid agreements and assistance agreements throughout the State/Territory? ",null,null,null,null,null,null,null,null,null,null,null,null,null,null,null,null,0]
[]
[]
[]
[]
[null,null,"Do these include agreements with the private sector? ",null,null,null,null,null,null,null,null,null,null,null,null,null,null,null,2]
[]
[]
[]
[null,null,"Do these include agreements with Non-governmental Oranizations?",null,null,null,null,null,null,null,null,null,null,null,null,null,null,null,1]
[]
[]
[]
[null,"4.  Does the jurisdiction promote and/or develop interagency mutual aid agreements and assistance agreements throughout the jurisdiction?",null,null,null,null,null,null,null,null,null,null,null,null,null,null,null,null,0]
[]
[]
[]
[]
[null,null,"Do these include agreements with the private sector? ",null,null,null,null,null,null,null,null,null,null,null,null,null,null,null,0]
[]
[]
[]
[null,null,"Do these include agreements with NGOs?",null,null,null,null,null,null,null,null,null,null,null,null,null,null,null,0]
[]
[]
[]
[null,"5.  Have NIMS concepts and principles been incorporated into all appropriate jurisdiction training? ",null,null,null,null,null,null,null,null,null,null,null,null,null,null,null,null,0]
[]
[]
[]
[]
[null,null,"If yes, which of the following has been incorporated?"]
[]
[null,null,null,null,null,null,null,null,null,null,null,null,null,null,null,null,null,null,false]
[null,null,null,null,null,null,null,null,null,null,null,null,null,null,null,null,null,null,false]
[null,null,null,null,null,null,null,null,null,null,null,null,null,null,null,null,null,null,false]
[null,null,null,null,null,null,null,null,null,null,null,null,null,null,null,null,null,null,false]
[null,null,null,null,null,null,null,null,null,null,null,null,null,null,null,null,null,null,false]
[null,null,null,null,null,null,null,null,null,null,null,null,null,null,null,null,null,null,false]
[null,null,null,null,null,null,null,null,null,null,null,null,null,null,null,null,null,null,false]
[null,null,null,null,null,null,null,null,null,null,null,null,null,null,null,null,null,null,false]
[]
[null,"6.  Has the jurisdiction implemented a training program to ensure that the appropriate emergency/incident response personnel, as identified in the NIMS Training Program, receive NIMS training in accordance with their incident management responsibilities?",null,null,null,null,null,null,null,null,null,null,null,null,null,null,null,null,0]
[]
[]
[]
[]
[null,"7.  Have NIMS concepts and principles been incorporated into all appropriate jurisdiction exercises?",null,null,null,null,null,null,null,null,null,null,null,null,null,null,null,null,0]
[]
[]
[]
[]
[null,null,"If yes, which of the following has been incorporated?"]
[]
[null,null,null,null,null,null,null,null,null,null,null,null,null,null,null,null,null,null,false]
[null,null,null,null,null,null,null,null,null,null,null,null,null,null,null,null,null,null,false]
[null,null,null,null,null,null,null,null,null,null,null,null,null,null,null,null,null,null,false]
[null,null,null,null,null,null,null,null,null,null,null,null,null,null,null,null,null,null,false]
[null,null,null,null,null,null,null,null,null,null,null,null,null,null,null,null,null,null,false]
[null,null,null,null,null,null,null,null,null,null,null,null,null,null,null,null,null,null,false]
[null,null,null,null,null,null,null,null,null,null,null,null,null,null,null,null,null,null,false]
[null,null,null,null,null,null,null,null,null,null,null,null,null,null,null,null,null,null,false]
[]
[null,"8.  Has the jurisdiction inventoried its response assets?",null,null,null,null,null,null,null,null,null,null,null,null,null,null,null,null,0]
[]
[]
[]
[]
[null,null,"If yes, what disciplines are represented in your response inventory?"]
[]
[null,null,null,null,null,null,null,null,null,null,null,null,null,null,null,null,null,null,false]
[null,null,null,null,null,null,null,null,null,null,null,null,null,null,null,null,null,null,false]
[null,null,null,null,null,null,null,null,null,null,null,null,null,null,null,null,null,null,false]
[null,null,null,null,null,null,null,null,null,null,null,null,null,null,null,null,null,null,false]
[null,null,null,null,null,null,null,null,null,null,null,null,null,null,null,null,null,null,false]
[null,null,null,null,null,null,null,null,null,null,null,null,null,null,null,null,null,null,false]
[null,null,null,null,null,null,null,null,null,null,null,null,null,null,null,null,null,null,false]
[null,null,null,null,null,null,null,null,null,null,null,null,null,null,null,null,null,null,false]
[null,null,null,null,null,null,null,null,null,null,null,null,null,null,null,null,null,null,false]
[]
[null,"9.  Has the jurisdiction typed its response assets to conform to Tier 1 NIMS National Resource Typing Definitions, as available on the FEMA website: http://www.fema.gov/national-incident-management-system?",null,null,null,null,null,null,null,null,null,null,null,null,null,null,null,null,0]
[]
[]
[]
[]
[null,"10.  Does the jurisdiction have a process to determine availability of response assets in accordance with Tier 1 NIMS National Resource Typing Definitions, as available on the FEMA website: http://www.fema.gov/national-incident-management-system?",null,null,null,null,null,null,null,null,null,null,null,null,null,null,null,null,0]

{"sheet":"Lists","index":75,"n_rows":580,"n_cols":34,"rows_kept":580,"cut":false,"hidden":true,"merged":[]}
[null,null,null,"Planning","Organization","Equipment","Training","Exercises","POETE","THCategories","Natural","Technological","Adversarial",1,"Planning","#1 Planning",null,0,"Blank",0,"Blank",null,null,null,"Post-assessment question order",null,null,null,null,null,"Adversarial/Human-caused","Human_caused",null,"Select one …"]
["Animal Health Emergency",null,1,"No selection made","No selection made","No selection made","No selection made","No selection made",null,"Click here to select category","Click here to select hazard","Click here to select hazard","Click here to select hazard",2,"Public Information and Warning","#2 Public Info Warn",null,1,"Low",1,"No Gap",null,null,null,"Planning",null,null,null,null,null,"Click here to select category","Click here to select category",null,"Assessment is based wholly or partially on performance during a real-world incident or event"]
["Emergency Medical Services",1,2,"No plan/annexes exist","0-20% of required organization/personnel exists","0-20% of required equipment exists","0-20% of required training exists","No exercises/real-world demonstration have occurred in the last five years","Team","Natural","Animal Disease","Dam Failure","Active Shooter",3,"Operational Coordination","#3 Op Coord",null,2,"Med",2,"All Internal",null,null,null,"Public Information and Warning",null,null,null,null,null,"Natural","Natural",null,"Assessment is not based on performance during a real-world incident or event"]
["Fire and Hazardous Materials",2,3,"Some plans/annexes exist","21-40% of required organization/personnel exists","21-40% of required equipment exists","21-40% of required training exists","Exercises/real-world demonstration have occurred many mission critical findings exist","Planning","Technological","Avalanche","Fuel Shortage","Aircraft as a Weapon",4,"Forensics and Attribution","#4 Forensics Attribution",null,3,"High",3,"Mostly Internal",null,null,null,"Operational Coordination",null,null,null,null,null,"Technological","Technological"]
["Geospatial Information Systems",3,4,"Plans/annexes are complete but require update","41-60% of required organization/personnel exists","41-60% of required equipment exists","41-60% of required training exists","Exercises/real-world demonstration have occurred; few mission critical findings exist","Organization","Human_caused","Drought","Hazmat Release - Chemical","Arson",5,"Intelligence and Information Sharing","#5 Intel Info Sharing",null,null,null,4,"Mostly External",null,null,null,"Forensics and Attribution"]
["Incident Management",4,5,"Plans/annexes are complete and have been updated within 5 years","61-80% of required organization/personnel exists","61-80% of required equipment exists","61-80% of required training exists","Exercises/real-world demonstration have occurred; some areas for improvement exist","Equipment",null,"Earthquake","Hazmat Release - Radiological","Biological Attack",6,"Interdiction and Disruption","#6 Interdict Disrupt",null,null,null,5,"All External",null,null,null,"Intelligence and Information Sharing"]
["Law Enforcement",5,6,"Plans/annexes are complete, up to date, and verified through either exercises or real world events","81%-100% of required organization/personnel exists","81%-100% of required equipment exists","81%-100% of training exists","Exercises/real-world demonstration have occurred; no areas for improvement exist","Training",null,"Extreme Temperatures","Mine Accident","Chemical Attack",7,"Screening, Search, and Detection","#7 Screen Search Detect",null,null,null,null,null,null,null,null,"Interdiction and Disruption"]
["Mass Care","N/A",7,"Planning is not relevant for this capability","Organization is not relevant for this capability","Equipment is not relevant for this capability","Training is not relevant for this capability","Exercises/real-world demonstration is not relevant for this capability","Exercises",null,"Flood","Mine/Underground Fire","Civil Disturbance",8,"Access Control and Identity Verification","#8 Access Control",null,null,null,null,null,null,null,null,"Screening, Search, and Detection"]
["Medical and Public Health",null,null,null,null,null,null,null,null,null,"Hurricane / Typhoon","Pipeline Explosion","Cyber Attack",9,"Cybersecurity","#9 Cybersecurity",null,null,null,null,null,null,null,null,"Access Control and Identity Verification"]
["Search and Rescue",null,null,null,null,null,null,null,null,null,"Invasive Species","Transportation Accident","Explosive Devices",10,"Physical Protective Measures","#10 Phys Protect Meas",null,null,null,null,null,null,null,null,"Cybersecurity"]
["Public Works",null,null,null,null,null,null,null,null,null,"Pandemic - Human","Urban Conflagration","Food/Water Contamination",11,"Risk Management for Protection Programs and Activities","#11 Risk Mgmt Protect",null,null,null,null,null,null,null,null,"Physical Protective Measures"]
[null,null,null,null,null,null,null,null,null,null,"Severe Storm / High Winds","Utility Interruption","Improvised Nuclear Attack",12,"Supply Chain Integrity and Security","#12 Supply Chain",null,null,null,null,null,null,null,null,"Risk Management for Protection Programs and Activities"]
[null,null,null,null,null,null,null,null,null,null,"Sinkhole / Landslide / Expansive Soils","Water Contamination","Mass Migration",13,"Community Resilience","#13 Comm Resilience",null,null,null,null,null,null,null,null,"Supply Chain Integrity and Security"]
[null,null,null,null,null,null,null,null,null,null,"Space Weather","Other (Describe in Step 2)","Metal Theft",14,"Long-term Vulnerability Reduction","#14 Long Term Vul Red",null,null,null,null,null,null,null,null,"Community Resilience"]
[null,null,null,null,null,null,null,null,null,null,"Tornado",null,"Radiological Attack",15,"Risk and Disaster Resilience Assessment","#15 Risk Resil Assess",null,null,null,null,null,null,null,null,"Long-term Vulnerability Reduction"]
[null,null,null,null,null,null,null,null,null,null,"Tsunami",null,"Terrorism",16,"Threats and Hazard Identification","#16 Threat Haz ID",null,null,null,null,null,null,null,null,"Risk and Disaster Resilience Assessment"]
[null,null,null,null,null,null,null,null,null,null,"Volcanic Eruption",null,"Other (Describe in Step 2)",17,"Critical Transportation","#17 Crit Transport",null,null,null,null,null,null,null,null,"Threats and Hazard Identification"]
[null,null,null,null,null,null,null,null,null,null,"Wildfire",null,null,18,"Environmental Response/Health and Safety","#18 Envir Resp Health",null,null,null,null,null,null,null,null,"Critical Transportation"]
[null,null,null,null,null,null,null,null,null,null,"Winter Storm / Ice Storm",null,null,19,"Fatality Management Services","#19 Fatality Mgmt",null,null,null,null,null,null,null,null,"Environmental Response/Health and Safety"]
[null,null,null,null,null,null,null,null,null,null,"Other (Describe in Step 2)",null,null,20,"Infrastructure Systems","#20 Infrastructure Sys",null,null,null,null,null,null,null,null,"Fatality Management Services"]
[null,null,null,null,null,null,null,null,null,null,null,null,null,21,"Mass Care Services","#21 Mass Care",null,null,null,null,null,null,null,null,"Mass Care Services"]
[null,null,null,null,null,null,null,null,null,null,null,null,null,22,"Mass Search and Rescue Operations","#22 Mass SAR Ops",null,null,null,null,null,null,null,null,"Mass Search and Rescue Operations"]
[null,null,null,null,null,null,null,null,null,null,null,null,null,23,"On-scene Security and Protection","#23 Security Protection",null,null,null,null,null,null,null,null,"On-scene Security and Protection"]
[null,null,null,null,null,null,null,null,null,null,null,null,null,24,"Operational Communications","#24 Op Comms",null,null,null,null,null,null,null,null,"Operational  Communications"]
[null,null,null,null,null,null,null,null,null,null,null,null,null,25,"Public and Private Services and Resources","#25 Pub Private Services",null,null,null,null,null,null,null,null,"Public and Private Services and Resources"]
[null,null,null,null,null,null,null,null,null,null,null,null,null,26,"Public Health and Medical Services","#26 Public Health Medical",null,null,null,null,null,null,null,null,"Public Health and Medical Services"]
[null,null,null,null,null,null,null,null,null,null,null,null,null,28,"Situational Assessment","#27 Sit Assessment",null,null,null,null,null,null,null,null,"Situational Assessment"]
[null,null,null,null,null,null,null,null,null,null,null,null,null,27,"Economic Recovery","#28 Econ Recovery",null,null,null,null,null,null,null,null,"Infrastructure Systems"]
[null,null,null,null,null,null,null,null,null,null,null,null,null,29,"Health and Social Services","#29 Health Soc Services",null,null,null,null,null,null,null,null,"Economic Recovery"]
[null,null,null,null,null,null,null,null,null,null,null,null,null,30,"Housing","#30 Housing",null,null,null,null,null,null,null,null,"Health and Social Services"]
[null,null,null,null,null,null,null,null,null,null,null,null,null,31,"Natural and Cultural Resources","#31 Nat Cult Resources",null,null,null,null,null,null,null,null,"Housing"]
[null,null,null,null,null,null,null,null,null,null,null,null,null,null,null,null,null,null,null,null,null,null,null,null,"Natural and Cultural Resources"]
[]
["Animal Health Emergency","Emergency Medical Services","Fire and Hazardous Materials","Incident Management","Law Enforcement","Mass Care","Medical and Public Health","Search and Rescue","Public Works","Geospatial Information Systems"]
["-----Resource Types-----","-----Resource Types-----","-----Resource Types-----","-----Resource Types-----","-----Resource Types-----","-----Resource Types-----","-----Resource Types-----","-----Resource Types-----","-----Resource Types-----","-----Position Qualifications-----"]
["Large Animal Rescue Strike Team","Air Ambulance (Fixed-Wing)","Area Command Team, Firefighting","Airborne Communications Relay Team (Fixed-Wing)","Bomb Squad/Explosives Team","Field Kitchen Unit","Public Health: Epidemiology (Surveillance and Investigation)","Air Search Team (Fixed-Wing)","Aerial Lift - Articulating Boom","GIS Analyst"]
["Large Animal Sheltering Team","Air Ambulance (Rotary-Wing)","Brush Patrol, Firefighting (Type VI Engine)","Airborne Communications Relay (Fixed-Wing) (CAP)","Law Enforcement Aviation-Helicopters-Patrol & Surveillance","Laundry Unit","Public Health: Isolation and Quarantine","Airborne Reconnaissance (Fixed-Wing)","Aerial Lift, Self Propelled, Scissor, Rough Terrain","GIS Supervisor"]
["Large Animal Transport Team","Ambulances (Ground)","Crew Transport (Firefighting Crew)","Airborne Transport Team (Fixed-Wing)","Law Enforcement Observation Aircraft (Fixed-Wing)","Mobile Kitchen Unit","Public Health: Environmental Health","Canine SAR Team - Avalanche Snow Air Scent","Aerial Lift - Telescopic Boom","GIS Team Leader"]
["Small Animal Rescue Strike Team","Ambulance Strike Team","Engine, Fire (Pumper)","Communications Support Team (CAP)","Law Enforcement Patrol Team (Strike Team)","Shelter Management Team","Public Health: Mass Dispensing Consultant Team","Canine SAR Team - Disaster Response","Aerial Lift - Truck Mounted","GIS Field Data Entry Technician"]
["Small Animal Sheltering Team","Ambulance Strike Force","Fire Boat","Crisis Incident Stress Management Team","Mobile Field Force Law Enforcement (Crowd Control Teams)","Shower Unit","Public Health: Receiving, Staging, and Storing (RSS) Task Force","Canine SAR Team - Land Cadaver Air Scent","Air Compressor"]
["Small Animal Transport Team","Emergency Medical Task Force","Fire Truck - Aerial (Ladder or Platform)","Donations Management Personnel/Team","Public Safety Dive Team","Temporary Child Care Support Services Team","Ancillary Support Team (Laboratory, Pharmacy, or Radiology  Services)","Canine SAR Team - Water Air Scent","Air Conditioner/Heater","GIS Analyst"]
["Incident Management Team Animal Protection","Mass Casualty Support Vehicle","Foam Tender, Firefighting","EOC Management Support Team","SWAT/Tactical Teams","-----Position Qualifications-----","Emergency/Critical Care Team","Canine SAR Team - Wilderness Air Scent","Air Curtain Burners (Fire Box-Above Ground, Refractory Walled)","Type I"]
["-----Position Qualifications-----","Multi-Patient Medical Transport Vehicle","Fuel Tender (Gasoline, Diesel, AvGas, aka Gas Tanker)","Event Coordination Team",null,"State Mass Care Coordinator","Mobile Field Medical Team","Canine SAR Team -  Wilderness Tracking/Trailing","Air Curtain Burners (Trench Burner, In-Ground)","Type II"]
["Animal Case Manager","-----Position Qualifications-----","Hand Crew","Evacuation Liaison Team (ELT)","Bomb Squad/Explosives Team","Shelter Manager","Specialty Services Team","Cave SAR Team","Buses","GIS Supervisor"]
["Animal Control Specialist ","Advanced Emergency Medical Technician ","HazMat Entry Team","Incident Management Team","Type I","Field Kitchen Manager","Palliative Care/Hospice Team","Collapse SAR Team","Chillers & Air Handlers (500 Ton to 50 Ton)","Type I"]
["Animal Disease Epidemiologist ","Air Medical Transport Manager or Administrator ","Helicopters, Firefighting","Individual Assistance Disaster Assessment Team","Type II","Temporary Child Care Support Services Team Leader","Public Health and Medical Team in a Shelter","Mine and Tunnel SAR Team","Concrete Cutter/Multi-Procesor for Hydraulic Excavator","GIS Team Leader"]
["Animal Handling Specialist ","Air Medical Transport Mechanic ","Helitanker (Firefighting Helicopter)","Mobile Communications Center (Mobile EOC)","Type III","Shelter Function Leader","Medical/Public Health System Assessment Team","Mountain SAR Team","Cranes, All Terain & Rough Terrain","Type I"]
["Animal Industry Specialist ","Air Medical Transport Paramedic ","Incident Management Team, Firefighting","Mobile Feeding Kitchen (Mobile Field Kitchen)","Law Enforcement Aviation-Helicopters-Patrol & Surveillance","Shelter Registration Leader","-----Position Qualifications-----","Radio Direction Finding Team","Cranes, Crawler (Lattice)","GIS Field Data Entry Technician"]
["Animal Premises Site Manager ","Air Medical Transport Physician ","Interagency Buying Team, Firefighting","Rapid Needs Assessment Team","Type I","Shelter Dormitory Leader","Advanced Practice Registered Nurse ","Swiftwater/Flood SAR Team","Damage Assessment and Repair Team – Sewer Mains","Type I"]
["Animal Shelter Manager ","Air Medical Transport Pilot (Rotorcraft) ","Mobile Communications Unit (Law/Fire)","-----Position Qualifications-----","Type II",null,"Assessment Team Leader ","US&R Incident Support Team","Damage Assessment and Repair Team – Water Pump Facilities"]
["Animal Technician ","Air Medical Transport Registered Nurse ","Portable Pump","Donations Coordinator","Type III","Field Kitchen Unit","Behavioral Health Specialist, Licensed ","US&R Task Forces","Damage Assessment, Repair and Start-Up Team – Wastewater Lift and Pump Station"]
["Livestock Agriculture Economist ","Ambulance Strike Team / Ambulance Task Force Leader ","Strike Team, Engine (Fire)","EOC Finance/Administration Section Chief/Coordinator","Type IV","Type I","Behavioral Health Specialist, Unlicensed ","Wilderness SAR Team","Damage Assessment, Repair and Start-Up Team - Wastewater Treatment Facilities\n"]
["Permit Specialist ","Emergency Medical Responder ","U.S. Coast Guard National Strike Force","EOC Operations Section Chief","Law Enforcement Observation Aircraft (Fixed-Wing)","Type II","Dental Assistant/Hygienist ","-----Position Qualifications-----","Damage Assessment, Repair and Start-Up Team - Water Production Facilities"]
["Risk Assessment Specialist ","Emergency Medical Task Force Leader ","Water Tender, Firefighting (Tanker)","EOC Planning Section Chief","Type I","Type III","Dentist ","Technical Rescue Squad Officer","Damage Assessment Team - Debris"]
["Species Specialist ","Emergency Medical Technician ","-----Position Qualifications-----","Individual Assistance Disaster Assessment Team Leader","Type II","Type IV","Dialysis Technician ","Technical Rescue Squad Technician","Disaster Management Recovery Team – Public Works"]
["Vector Control Specialist ","Emergency Vehicle Operator ","Airport Firefighter","Public Assistance Coordinator","Law Enforcement Strike Team (Patrol Team)","Laundry Unit","Dietician/Nutritionist ","Search and Rescue Branch Director","Electronic Boards, Arrow Boards"]
["Veterinarian ","Emergency Vehicle Operator- Heavy ","Emergency Vehicle Technician","Volunteer Agency Liaison","Type I","Type I","Environmental Health Generalist ","Helicopter Search and Rescue Crew Chief","Electronic Boards, Variable Message Signs (VMS)"]
["Wildlife Control Specialist ","EMS Physician ","Fire Apparatus Driver/Operator","Liaison Officer","Type II","Mobile Kitchen Unit","Environmental Health Specialist ","Helicopter Search and Rescue Pilot","Emergency Management Support Team – Water/Wastewater"]
[null,"Medical Supply Coordinator ","Firefighter","Finance/Administration Section Chief ","Type III","Type I","Environmental Health Team Leader ","Helicopter Search and Rescue Technician","Floodlights"]
["Large Animal Rescue Strike Team","Paramedic","Fire Inspector","Incident Commander ","Type IV","Type II","Epidemiologist ","Structural Collapse Search Technician","Generators"]
["Type I",null,"Fire Officer","Logistics Section Chief ","Mobile Field Force Law Enforcement (Crowd Control Teams)","Type III","Epidemiology Interviewer ","Structural Collapse Rescue Squad Officer","Grader"]
["Large Animal Sheltering Team","Air Ambulance (Fixed-Wing)","HazMat Officer","Operations Section Chief ","Type I","Shelter Management Team","Epidemiology Team Leader ","Structural Collapse Search Squad Officer","Hydraulic Excavator (Large Mass Excavation 13cy to 3cy buckets)"]
["Type I","Type I","HazMat Safety Officer","Planning Section Chief ","Type II","Type I","Laboratory Technologist/Technician ","Disaster Collapsed Structure Canine Search Manager","Hydraulic Excavator (Medium Mass Excavation 4cy to 1.75cy buckets)"]
["Type II","Type II","HazMat Technician","Safety Officer","Type III","Type II","Mass Dispensing Team Leader ","Disaster Collapsed Structure Canine Search Technical Specialist (Advisor)","Hydraulic Excavator (Compact - Short Radius 1.75cy to 0.62cy buckets)"]
["Type III","Type III","Plans Examiner",null,"Public Safety Dive Team","Type III","Mass Dispensing, Consultant ","Disaster Collapsed Structure Canine Search Technician","Hydraulic Excavator Truck Mounted"]
["Large Animal Transport Team","Type IV","Public Safety Telecommunicator","Airborne Communications Relay Team (Fixed-Wing)","Type I","Type IV","Mass Dispensing, Dispenser ","Helicopter Search and/or Rescue Crew Chief (Disaster, Mountain, Stillwater, Swiftwater, Wilderness, Urban, et al)","Maintenance and Repair Team – Light Equipment Public Works"]
["Type I","Air Ambulance (Rotary-Wing)","Wildland Firefighter","Type I","Type II","Shower Unit","Mass Dispensing, Operations Team Consultant ","Helicopter Search and/or Rescue Pilot (Disaster, Mountain, Stillwater, Swiftwater, Wilderness, Urban, et al)","Maintenance and Repair Team - Heavy Equipment"]
["Small Animal Rescue Strike Team","Type I","Wildland Fire Officer","Type II","Type III","Type I","Mass Dispensing, Patient Intake/Line Flow Consultant ","Helicopter Search and/or Rescue Technician (Disaster, Mountain, Stillwater, Swiftwater, Wilderness, Urban, et al)","Public Works Emergency Management Support Team"]
["Type I","Type II","Wildland/Urban Interface Protection Specialist","Type III","Type IV","Type II","Mass Dispensing, Public Information Consultant ","Human Remains Canine Search Manager","Repair and Restoration Team – SCADA"]
["Small Animal Sheltering Team","Type III",null,"Type IV","SWAT/Tactical Teams","Type III","Mass Dispensing, Vaccinator ","Human Remains Canine Search Technical Specialist (Advisor)","Repair Restoration Team – Communications"]
["Type I","Type IV","Area Command Team, Firefighting","Airborne Communications Relay (Fixed-Wing) (CAP)","Type I","Type IV","Medical Unit Team Leader ","Human Remains Canine Search Technician","Road Sweeper"]
["Type II","Ambulances (Ground)","Type I","Type I","Type II","Temporary Child Care Support Services Team","Patient Care Technician ","Mountain Search and/or Rescue Manager","Scraper, Earth Moving"]
["Type III","Type I","Brush Patrol, Firefighting (Type VI Engine)","Type II","Type III","Type I","Pharmacist ","Mountain Search and/or Rescue Technical Specialist (Advisor)","Snow Blower (Chassis Mounted)"]
["Small Animal Transport Team","Type II","N/A","Type III","Type IV","Type II","Pharmacy Technician ","Mountain Search and/or Rescue Technician","Snow Blower (Loader Mounted)"]
["Type I","Type III","Crew Transport (Firefighting Crew)","Type IV",null,"Type III","Phlebotomist ","Mountain Search and/or Rescue Unit Leader","Snow Cat"]
["Incident Management Team Animal Protection","Type IV","Type I","Airborne Transport Team (Fixed-Wing)",null,"State Mass Care Coordinator","Physician ","Emergency Services Technical SAR Manager","Tire Repair Team"]
["Type I","Ambulance Strike Team","Type II","Type I",null,"Type I","Physician Assistant ","Emergency Services Technical SAR Technician","Track Dozer"]
["Type II","Type I","Type III","Type II",null,"Type II","Public Health Data Entry Staff ","Logistics Search and/or Rescue Technician (Disaster, Mountain, Stillwater, Swiftwater, Wilderness, Urban, et al)","Track Loader"]
["Type III","Type II","Engine, Fire (Pumper)","Type III",null,"Shelter Manager","Public Health Disaster Assessor ","Medical Search and/or Rescue Technician (Disaster, Mountain, Stillwater, Swiftwater, Wilderness, Urban, et al)","Trailer, Equipment Tag-Trailer"]
["Animal Case Manager","Type III","Type I","Type IV",null,"Type I","Public Health Information Technology Specialist ","Structural Collapse Rescue Manager","Trailer, Dump (one type/example only)"]
["Type I","Type IV","Type II","Communications Support Team (CAP)",null,"Type II","Public Health and Medical Support Team Leader in a Shelter","Structural Collapse Rescue Technician","Trailer, Flat Bed Truck (two types/example only)"]
["Animal Control Specialist ","Ambulance Strike Force","Type III","Type I",null,"Type III","Radiologic Technician ","Structural Collapse Search Manager","Trailer, Gooseneck Trailer"]
["Type I","Type I","Type IV","Type II",null,"Field Kitchen Manager","RSS Distribution Leader ","Structural Collapse Search Technician","Trailer, Small Equipment"]
["Animal Disease Epidemiologist ","Emergency Medical Task Force","Fire Boat","Type III",null,"Type I","RSS Finance and Administrative Team Lead ","Swiftwater/Flood Rescue Manager","Truck, Off-Road Dump"]
["Type I","Type I","Type I","Type IV",null,"Temporary Child Care Support Services Team Leader","RSS Logistics Team Lead ","Swiftwater/Flood Rescue Technician","Truck, On-Road Dump"]
["Animal Handling Specialist ","Mass Casualty Support Vehicle","Type II","Crisis Incident Stress Management Team",null,"Type I","RSS Operations Team Lead ","Swiftwater/Flood Rescue Technician- Boat Bowman","Truck, Plow"]
["Type I","Type I","Type III","Type I",null,"Type II","RSS Tactical Communications Leader ","Swiftwater/Flood Rescue Technician- Boat Operator","Truck, Sewer Flusher"]
["Animal Industry Specialist ","Type II","Fire Truck - Aerial (Ladder or Platform)","Type II",null,"Shelter Function Leader","RSS Task Force Leader ","Swiftwater/Flood Rescue Technical Specialist (Advisor)","Truck, Tractor Trailer"]
["Type I","Type III","Type I","Type III",null,"Type I","Registered Nurse ","Swiftwater/Flood Rescue Technician- Animal Rescue","Tug Boat (general)"]
["Animal Premises Site Manager ","Multi-Patient Medical Transport Vehicle","Type II","Donations Management Personnel/Team",null,"Shelter Registration Leader","Respiratory Therapist ","Swiftwater/Flood Rescue Unit Leader","Water Pumps, De-Watering"]
["Type I","Type I","Foam Tender, Firefighting","Type I",null,"Type I","Social Worker ","Water Canine Search Manager","Water Pumps, Drinking Water Supply - Auxillary Pump"]
["Animal Shelter Manager ","Type II","Type I","Type II",null,"Shelter Dormitory Leader","Surgical Technician ","Water Canine Search Technician","Water Pumps, Water Distribution"]
["Type I","Type III","Type II","EOC Management Support Team",null,"Type I",null,"Wilderness Air Scent Canine Search Manager","Water Pumps, Wastewater"]
["Animal Technician ","Advanced Emergency Medical Technician ","Fuel Tender (Gasoline, Diesel, AvGas, aka Gas Tanker)","Type I",null,null,"Public Health: Epidemiology (Surveillance and Investigation)","Wilderness Air Scent Canine Search Technician","Water Truck (example only)"]
["Type I","Type I","Type I","Type II",null,null,"Type I","Wilderness Search and/or Rescue Manager","Wheel Dozer"]
["Livestock Agriculture Economist ","Air Medical Transport Manager or Administrator ","Type II","Type III",null,null,"Type II","Wilderness Search and/or Rescue Technical Specialist (Advisor)","Wheel Loader Backhoe"]
["Type I","Type I","Hand Crew","Type IV",null,null,"Type III","Wilderness Search and/or Rescue Technician","Wheel Loaders (Large 41cy to 8cy)"]
["Permit Specialist ","Air Medical Transport Mechanic ","Type I","Event Coordination Team",null,null,"Public Health: Isolation and Quarantine","Wilderness Search and/or Rescue Unit Leader","Wheel Loaders (Medium 7cy to 3cy)"]
["Type I","Type I","Type II","Type I",null,null,"Type I",null,"Wheel Loaders (Small 7cy to 2cy)"]
["Risk Assessment Specialist ","Air Medical Transport Paramedic ","Type III","Type II",null,null,"Type II","Air Search Team (Fixed-Wing)","Wheel Loaders, Skid Steer (Small)"]
["Type I","Type I","Type IV","Type III",null,null,"Public Health: Environmental Health","Type I","Wheel Loaders, Telescopic Handler"]
["Species Specialist ","Air Medical Transport Physician ","HazMat Entry Team","Evacuation Liaison Team (ELT)",null,null,"Type I","Type II","Wood Chipper"]
["Type I","Type I","Type I","Type I",null,null,"Type II","Type III","Wood Tub Grinder"]
["Vector Control Specialist ","Air Medical Transport Pilot (Rotorcraft) ","Type II","Incident Management Team",null,null,"Public Health: Mass Dispensing Consultant Team","Type IV","Damage Assessment, Repair and Start-Up Team - Water Production Facilities"]
["Type I","Type I","Type III","Type I",null,null,"Type I","Airborne Reconnaissance (Fixed-Wing)","Damage Assessment, Repair and Start-Up Team - Wastewater Treatment Facilities"]
["Veterinarian ","Air Medical Transport Registered Nurse ","Helicopters, Firefighting","Type II",null,null,"Type II","Type I","Maintenance and Repair Team – Light Equipment Public Works"]
["Type I","Type I","Type I","Type III",null,null,"Public Health: Receiving, Staging, and Storing (RSS) Task Force","Type II","Damage Assessment, Repair and Start-Up Team – Wastewater Lift and Pump Station"]
["Wildlife Control Specialist ","Ambulance Strike Team / Ambulance Task Force Leader ","Type II","Type IV",null,null,"Type I","Type III","Damage Assessment and Repair Team – Sewer Mains"]
["Type I","Type I","Type III","Individual Assistance Disaster Assessment Team",null,null,"Ancillary Support Team (Laboratory, Pharmacy, or Radiology  Services)","Type IV","Damage Assessment and Repair Team – Water Pump Facilities"]
[null,"Emergency Medical Responder ","Type IV","Type I",null,null,"Type I","Canine SAR Team - Avalanche Snow Air Scent","Emergency Management Support Team – Water/Wastewater"]
[null,"Type I","Helitanker (Firefighting Helicopter)","Mobile Communications Center (Mobile EOC)",null,null,"Type II","Type I","Damage Assessment Team - Debris"]
[null,"Emergency Medical Task Force Leader ","N/A","Type I",null,null,"Emergency/Critical Care Team","Type II","Repair Restoration Team – Communications"]
[null,"Type I","Incident Management Team, Firefighting","Type II",null,null,"Type I","Canine SAR Team - Disaster Response","Public Works Emergency Management Support Team"]
[null,"Emergency Medical Technician ","Type I","Type III",null,null,"Type II","Type I","Disaster Management Recovery Team – Public Works"]
[null,"Type I","Type II","Type IV",null,null,"Mobile Field Medical Team","Type II","Repair and Restoration Team – SCADA"]
[null,"Emergency Vehicle Operator ","Type III","Mobile Feeding Kitchen (Mobile Field Kitchen)",null,null,"Type I","Type III","Tire Repair Team"]
[null,"Type I","Type IV","Type I",null,null,"Type II","Type IV","Maintenance and Repair Team - Heavy Equipment"]
[null,"Emergency Vehicle Operator- Heavy ","Interagency Buying Team, Firefighting","Type II",null,null,"Specialty Services Team","Canine SAR Team - Land Cadaver Air Scent","-----Position Qualifications-----"]
[null,"Type I","Type I","Type III",null,null,"Type I","Type I","Structure Condition Evaluator"]
[null,"EMS Physician ","Mobile Communications Unit (Law/Fire)","Type IV",null,null,"Type II","Type II","Assistant Public Works Director - Logistics"]
[null,"Type I","Type I","Rapid Needs Assessment Team",null,null,"Palliative Care/Hospice Team","Type III","Assistant Public Works Director - Operations"]
[null,"Medical Supply Coordinator ","Type II","Type I",null,null,"Type I","Type IV","Civil/Field Engineer"]
[null,"Type I","Portable Pump","Donations Coordinator",null,null,"Type II","Canine SAR Team - Water Air Scent","Debris Collection Supervisor"]
[null,"Paramedic","Type I","Type I",null,null,"Public Health and Medical Team in a Shelter","Type I","Debris Removal Manager"]
[null,"Type I","Type II","Type II",null,null,"Type I","Type II","Debris Site Supervisor"]
[null,null,"Type III","Type III",null,null,"Medical/Public Health System Assessment Team","Type III","Engineering Branch Manager"]
[null,null,"Strike Team, Engine (Fire)","Type IV",null,null,"Type I","Type IV","Engineering Division Manager"]
[null,null,"Type I","EOC Finance/Administration Section Chief/Coordinator",null,null,"Advanced Practice Registered Nurse ","Canine SAR Team - Wilderness Air Scent","Equipment Operator"]
[null,null,"Type II","Type I",null,null,"Type I","Type I","Public Works Director"]
[null,null,"Type III","Type II",null,null,"Assessment Team Leader ","Type II","Quality Assurance Personnel"]
[null,null,"Type IV","Type III",null,null,"Type I","Type III","Structural Engineer"]
[null,null,"U.S. Coast Guard National Strike Force","EOC Operations Section Chief",null,null,"Behavioral Health Specialist, Licensed ","Type IV","Utility Systems Reconstruction Manager"]
[null,null,"N/A","Type I",null,null,"Type I","Canine SAR Team -  Wilderness Tracking/Trailing","Wastewater Collection Manager"]
[null,null,"Water Tender, Firefighting (Tanker)","Type II",null,null,"Behavioral Health Specialist, Unlicensed ","Type I","Wastewater System Manager"]
[null,null,"Type I","Type III",null,null,"Type I","Type II","Wastewater Treatment Manager"]
[null,null,"Type II","EOC Planning Section Chief",null,null,"Dental Assistant/Hygienist ","Type III"]
[null,null,"Type III","Type I",null,null,"Type I","Type IV","Aerial Lift - Articulating Boom"]
[null,null,"Type IV","Type II",null,null,"Dentist ","Cave SAR Team","Type I"]
[null,null,"Airport Firefighter","Type III",null,null,"Type I","Type I","Type II"]
[null,null,"Type I","Individual Assistance Disaster Assessment Team Leader",null,null,"Dialysis Technician ","Type II","Type III"]
[null,null,"Emergency Vehicle Technician","Type I",null,null,"Type I","Type III","Type IV"]
[null,null,"Type I","Type II",null,null,"Dietician/Nutritionist ","Type IV","Aerial Lift, Self Propelled, Scissor, Rough Terrain"]
[null,null,"Fire Apparatus Driver/Operator","Type III",null,null,"Type I","Collapse SAR Team","Type I"]
[null,null,"Type I","Type IV",null,null,"Environmental Health Generalist ","Type I","Type II"]
[null,null,"Firefighter","Public Assistance Coordinator",null,null,"Type I","Type II","Type III"]
[null,null,"Type I","Type I",null,null,"Environmental Health Specialist ","Type III","Type IV"]
[null,null,"Type II","Type II",null,null,"Type I","Type IV","Aerial Lift - Telescopic Boom"]
[null,null,"Fire Inspector","Type III",null,null,"Environmental Health Team Leader ","Mine and Tunnel SAR Team","Type I"]
[null,null,"Type I","Type IV",null,null,"Type I","Type I","Type II"]
[null,null,"Type II","Volunteer Agency Liaison",null,null,"Epidemiologist ","Type II","Type III"]
[null,null,"Type III","Type I",null,null,"Type I","Mountain SAR Team","Type IV"]
[null,null,"Fire Officer","Type II",null,null,"Epidemiology Interviewer ","Type I","Aerial Lift - Truck Mounted"]
[null,null,"Type I","Type III",null,null,"Type I","Type II","Type I"]
[null,null,"Type II","Type IV",null,null,"Epidemiology Team Leader ","Type III","Type II"]
[null,null,"Type III","Liaison Officer",null,null,"Type I","Type IV","Type III"]
[null,null,"Type IV","Type I",null,null,"Laboratory Technologist/Technician ","Radio Direction Finding Team","Type IV"]
[null,null,"HazMat Officer","Type II",null,null,"Type I","Type I","Air Compressor"]
[null,null,"Type I","Type III",null,null,"Mass Dispensing Team Leader ","Type II","Type I"]
[null,null,"HazMat Safety Officer","Finance/Administration Section Chief ",null,null,"Type I","Type III","Type II"]
[null,null,"Type I","Type I",null,null,"Mass Dispensing, Consultant ","Swiftwater/Flood SAR Team","Type III"]
[null,null,"HazMat Technician","Incident Commander ",null,null,"Type I","Type I","Type IV"]
[null,null,"Type I","Type I",null,null,"Mass Dispensing, Dispenser ","Type II","Air Conditioner/Heater"]
[null,null,"Plans Examiner","Logistics Section Chief ",null,null,"Type I","Type III","Type I"]
[null,null,"Type I","Type I",null,null,"Mass Dispensing, Operations Team Consultant ","Type IV","Type II"]
[null,null,"Type II","Operations Section Chief ",null,null,"Type I","US&R Incident Support Team","Type III"]
[null,null,"Public Safety Telecommunicator","Type I",null,null,"Mass Dispensing, Patient Intake/Line Flow Consultant ","Type I","Type IV"]
[null,null,"Type I","Planning Section Chief ",null,null,"Type I","Type II","Air Curtain Burners (Fire Box-Above Ground, Refractory Walled)"]
[null,null,"Type II","Type I",null,null,"Mass Dispensing, Public Information Consultant ","US&R Task Forces","Type I"]
[null,null,"Wildland Firefighter","Public Information Officer ",null,null,"Type I","Type I","Type II"]
[null,null,"Type I","Type I",null,null,"Mass Dispensing, Vaccinator ","Type II","Type III"]
[null,null,"Type II","Safety Officer",null,null,"Type I","Wilderness SAR Team","Type IV"]
[null,null,"Wildland Fire Officer","Type I",null,null,"Medical Unit Team Leader ","Type I","Type V"]
[null,null,"Type I","Type II",null,null,"Type I","Type II","Type VI"]
[null,null,"Type II","Type III",null,null,"Patient Care Technician ","Type III","Air Curtain Burners (Trench Burner, In-Ground)"]
[null,null,"Wildland/Urban Interface Protection Specialist",null,null,null,"Type I","Type IV","Type I"]
[null,null,"Type I",null,null,null,"Pharmacist ","Technical Squad Officer","Type II"]
[null,null,null,null,null,null,"Type I","Type I","Type III"]
[null,null,null,null,null,null,"Pharmacy Technician ","Technical Rescue Squad Technician","Buses"]
[null,null,null,null,null,null,"Type I","Type I","Type I"]
[null,null,null,null,null,null,"Phlebotomist ","Search and Rescue Branch Director","Type II"]
[null,null,null,null,null,null,"Type I","Type I","Type III"]
[null,null,null,null,null,null,"Physician ","Helicopter Search and Rescue Crew Chief","Type IV"]
[null,null,null,null,null,null,"Type I","Type I","Chillers & Air Handlers (500 Ton to 50 Ton)"]
[null,null,null,null,null,null,"Physician Assistant ","Helicopter Search and Rescue Pilot","Type I"]
[null,null,null,null,null,null,"Type I","Type I","Type II"]
[null,null,null,null,null,null,"Public Health Data Entry Staff ","Helicopter Search and Rescue Technician","Type III"]
[null,null,null,null,null,null,"Type I","Type I","Type IV"]
[null,null,null,null,null,null,"Public Health Disaster Assessor ","Structural Collapse Technical Search Technician","Type V"]
[null,null,null,null,null,null,"Type I","Type I","Concrete Cutter/Multi-Procesor for Hydraulic Excavator"]
[null,null,null,null,null,null,"Public Health Information Technology Specialist ","Structural Collapse Rescue Squad Officer","Type I"]
[null,null,null,null,null,null,"Type I","Type I","Type II"]
[null,null,null,null,null,null,"Public Health and Medical Support Team Leader in a Shelter","Structural Collapse Search Squad Officer","Type III"]
[null,null,null,null,null,null,"Type I","Type I","Type IV"]
[null,null,null,null,null,null,"Radiologic Technician ","Disaster Collapsed Structure Canine Search Manager","Cranes, All Terain & Rough Terrain"]
[null,null,null,null,null,null,"Type I","Type I","Type I"]
[null,null,null,null,null,null,"RSS Distribution Leader ","Disaster Collapsed Structure Canine Search Technical Specialist (Advisor)","Type II"]
[null,null,null,null,null,null,"Type I","Type I","Type III"]
[null,null,null,null,null,null,"RSS Finance and Administrative Team Lead ","Disaster Collapsed Structure Canine Search Technician","Type IV"]
[null,null,null,null,null,null,"Type I","Type I","Cranes, Crawler (Lattice)"]
[null,null,null,null,null,null,"RSS Logistics Team Lead ","Helicopter Search and/or Rescue Crew Chief (Disaster, Mountain, Stillwater, Swiftwater, Wilderness, Urban, et al)","Type I"]
[null,null,null,null,null,null,"Type I","Type I","Type II"]
[null,null,null,null,null,null,"RSS Operations Team Lead ","Helicopter Search and/or Rescue Pilot (Disaster, Mountain, Stillwater, Swiftwater, Wilderness, Urban, et al)","Type III"]
[null,null,null,null,null,null,"Type I","Type I","Electronic Boards, Arrow Boards"]
[null,null,null,null,null,null,"RSS Tactical Communications Leader ","Helicopter Search and/or Rescue Technician (Disaster, Mountain, Stillwater, Swiftwater, Wilderness, Urban, et al)","Type I"]
[null,null,null,null,null,null,"Type I","Type I","Type II"]
[null,null,null,null,null,null,"RSS Task Force Leader ","Human Remains Canine Search Manager","Type III"]
[null,null,null,null,null,null,"Type I","Type I","Type IV"]
[null,null,null,null,null,null,"Registered Nurse ","Human Remains Canine Search Technical Specialist (Advisor)","Electronic Boards, Variable Message Signs (VMS)"]
[null,null,null,null,null,null,"Type I","Type I","Type I"]
[null,null,null,null,null,null,"Respiratory Therapist ","Human Remains Canine Search Technician","Type II"]
[null,null,null,null,null,null,"Type I","Type I","Type III"]
[null,null,null,null,null,null,"Social Worker ","Mountain Search and/or Rescue Manager","Type IV"]
[null,null,null,null,null,null,"Type I","Type I","Floodlights"]
[null,null,null,null,null,null,"Surgical Technician ","Mountain Search and/or Rescue Technical Specialist (Advisor)","Type I"]
[null,null,null,null,null,null,"Type I","Type I","Type II"]
[null,null,null,null,null,null,null,"Mountain Search and/or Rescue Technician","Type III"]
[null,null,null,null,null,null,null,"Type I","Generators"]
[null,null,null,null,null,null,null,"Mountain Search and/or Rescue Unit Leader","Type I"]
[null,null,null,null,null,null,null,"Type I","Type II"]
[null,null,null,null,null,null,null,"Emergency Services Technical SAR Manager","Type III"]
[null,null,null,null,null,null,null,"Type I","Type IV"]
[null,null,null,null,null,null,null,"Emergency Services Technical SAR Technician","Type V"]
[null,null,null,null,null,null,null,"Type I","Grader"]
[null,null,null,null,null,null,null,"Logistics Search and/or Rescue Technician (Disaster, Mountain, Stillwater, Swiftwater, Wilderness, Urban, et al)","Type I"]
[null,null,null,null,null,null,null,"Type I","Type II"]
[null,null,null,null,null,null,null,"Medical Search and/or Rescue Technician (Disaster, Mountain, Stillwater, Swiftwater, Wilderness, Urban, et al)","Type III"]
[null,null,null,null,null,null,null,"Type I","Hydraulic Excavator (Large Mass Excavation 13cy to 3cy buckets)"]
[null,null,null,null,null,null,null,"Structural Collapse Rescue Manager","Type I"]
[null,null,null,null,null,null,null,"Type I","Type II"]
[null,null,null,null,null,null,null,"Structural Collapse Rescue Technician","Type III"]
[null,null,null,null,null,null,null,"Type I","Type IV"]
[null,null,null,null,null,null,null,"Structural Collapse Search Manager","Hydraulic Excavator (Medium Mass Excavation 4cy to 1.75cy buckets)"]
[null,null,null,null,null,null,null,"Type I","Type I"]
[null,null,null,null,null,null,null,"Structural Collapse Search Technician","Type II"]
[null,null,null,null,null,null,null,"Type I","Type III"]
["Animal Health Emergency","AnHlth",null,null,null,null,null,"Swiftwater/Flood Rescue Manager","Type IV"]
["Emergency Medical Services","EmMed",null,null,null,null,null,"Type I","Hydraulic Excavator (Compact - Short Radius 1.75cy to 0.62cy buckets)"]
["Fire and Hazardous Materials","FireHaz",null,null,null,null,null,"Swiftwater/Flood Rescue Technician","Type I"]
["Geospatial Information Systems","GIS",null,null,null,null,null,"Type I","Type II"]
["Incident Management","IncMgmt",null,null,null,null,null,"Swiftwater/Flood Rescue Technician- Boat Bowman","Type III"]
["Law Enforcement","LawEnf",null,null,null,null,null,"Type I","Type IV"]
["Mass Care","MassCare",null,null,null,null,null,"Swiftwater/Flood Rescue Technician- Boat Operator","Hydraulic Excavator Truck Mounted"]
["Medical and Public Health","MedPub",null,null,null,null,null,"Type I","Type I"]
["Public Works","PubWks",null,null,null,null,null,"Swiftwater/Flood Rescue Technical Specialist (Advisor)","Type II"]
["Search and Rescue","SAR",{"$f":"MAX(C246:C1148)","v":580},null,null,null,null,"Type I","Road Sweeper"]
["Large Animal Rescue Strike Team","AnHlth_1",{"$f":"ROW()","v":246},null,null,null,null,"Swiftwater/Flood Rescue Technician- Animal Rescue","Type I"]
["Large Animal Sheltering Team","AnHlth_2",{"$f":"ROW()","v":247},null,null,null,null,"Type I","Type II"]
["Large Animal Transport Team","AnHlth_3",{"$f":"ROW()","v":248},null,null,null,null,"Swiftwater/Flood Rescue Unit Leader","Type III"]
["Small Animal Rescue Strike Team","AnHlth_4",{"$f":"ROW()","v":249},null,null,null,null,"Type I","Type IV"]
["Small Animal Sheltering Team","AnHlth_5",{"$f":"ROW()","v":250},null,null,null,null,"Water Canine Search Manager","Scraper, Earth Moving"]
["Small Animal Transport Team","AnHlth_6",{"$f":"ROW()","v":251},null,null,null,null,"Type I","Type I"]
["Incident Management Team Animal Protection","AnHlth_7",{"$f":"ROW()","v":252},null,null,null,null,"Water Canine Search Technician","Type II"]
["Animal Case Manager","AnHlth_8",{"$f":"ROW()","v":253},null,null,null,null,"Type I","Type III"]
["Animal Control Specialist ","AnHlth_9",{"$f":"ROW()","v":254},null,null,null,null,"Wilderness Air Scent Canine Search Manager","Snow Blower (Chassis Mounted)"]
["Animal Disease Epidemiologist ","AnHlth_10",{"$f":"ROW()","v":255},null,null,null,null,"Type I","Type I"]
["Animal Handling Specialist ","AnHlth_11",{"$f":"ROW()","v":256},null,null,null,null,"Wilderness Air Scent Canine Search Technician","Type II"]
["Animal Industry Specialist ","AnHlth_12",{"$f":"ROW()","v":257},null,null,null,null,"Type I","Type III"]
["Animal Premises Site Manager ","AnHlth_13",{"$f":"ROW()","v":258},null,null,null,null,"Wilderness Search and/or Rescue Manager","Snow Blower (Loader Mounted)"]
["Animal Shelter Manager ","AnHlth_14",{"$f":"ROW()","v":259},null,null,null,null,"Type I","Type I"]
["Animal Technician ","AnHlth_15",{"$f":"ROW()","v":260},null,null,null,null,"Wilderness Search and/or Rescue Technical Specialist (Advisor)","Type II"]
["Livestock Agriculture Economist ","AnHlth_16",{"$f":"ROW()","v":261},null,null,null,null,"Type I","Type III"]
["Permit Specialist ","AnHlth_17",{"$f":"ROW()","v":262},null,null,null,null,"Wilderness Search and/or Rescue Technician","Type IV"]
["Risk Assessment Specialist ","AnHlth_18",{"$f":"ROW()","v":263},null,null,null,null,"Type I","Snow Cat"]
["Species Specialist ","AnHlth_19",{"$f":"ROW()","v":264},null,null,null,null,"Wilderness Search and/or Rescue Unit Leader","Type I"]
["Vector Control Specialist ","AnHlth_20",{"$f":"ROW()","v":265},null,null,null,null,"Type I","Type II"]
["Veterinarian ","AnHlth_21",{"$f":"ROW()","v":266},null,null,null,null,null,"Type III"]
["Wildlife Control Specialist ","AnHlth_22",{"$f":"ROW()","v":267},null,null,null,null,null,"Type IV"]
["Air Ambulance (Fixed-Wing)","EmMed_1",{"$f":"ROW()","v":268},null,null,null,null,null,"Track Dozer"]
["Air Ambulance (Rotary-Wing)","EmMed_2",{"$f":"ROW()","v":269},null,null,null,null,null,"Type I"]
["Ambulances (Ground)","EmMed_3",{"$f":"ROW()","v":270},null,null,null,null,null,"Type II"]
["Ambulance Strike Team","EmMed_4",{"$f":"ROW()","v":271},null,null,null,null,null,"Type III"]
["Ambulance Strike Force","EmMed_5",{"$f":"ROW()","v":272},null,null,null,null,null,"Type IV"]
["Emergency Medical Task Force","EmMed_6",{"$f":"ROW()","v":273},null,null,null,null,null,"Track Loader"]
["Mass Casulaty Support Vehicle","EmMed_7",{"$f":"ROW()","v":274},null,null,null,null,null,"Type I"]
["Multi-Patient Medical Transport Vehicle","EmMed_8",{"$f":"ROW()","v":275},null,null,null,null,null,"Type II"]
["Advanced Emergency Medical Technician ","EmMed_9",{"$f":"ROW()","v":276},null,null,null,null,null,"Type III"]
["Air Medical Transport Manager or Administrator ","EmMed_10",{"$f":"ROW()","v":277},null,null,null,null,null,"Type IV"]
["Air Medical Transport Mechanic ","EmMed_11",{"$f":"ROW()","v":278},null,null,null,null,null,"Trailer, Equipment Tag-Trailer"]
["Air Medical Transport Paramedic ","EmMed_12",{"$f":"ROW()","v":279},null,null,null,null,null,"Type I"]
["Air Medical Transport Physician ","EmMed_13",{"$f":"ROW()","v":280},null,null,null,null,null,"Type II"]
["Air Medical Transport Pilot (Rotorcraft) ","EmMed_14",{"$f":"ROW()","v":281},null,null,null,null,null,"Type III"]
["Air Medical Transport Registered Nurse ","EmMed_15",{"$f":"ROW()","v":282},null,null,null,null,null,"Trailer, Dump (one type/example only)"]
["Ambulance Strike Team / Ambulance Task Force Leader ","EmMed_16",{"$f":"ROW()","v":283},null,null,null,null,null,"Type I"]
["Emergency Medical Responder ","EmMed_17",{"$f":"ROW()","v":284},null,null,null,null,null,"Trailer, Flat Bed Truck (two types/example only)"]
["Emergency Medical Task Force Leader ","EmMed_18",{"$f":"ROW()","v":285},null,null,null,null,null,"Type I"]
["Emergency Medical Technician ","EmMed_19",{"$f":"ROW()","v":286},null,null,null,null,null,"Type II"]
["Emergency Vehicle Operator ","EmMed_20",{"$f":"ROW()","v":287},null,null,null,null,null,"Trailer, Gooseneck Trailer"]
["Emergency Vehicle Operator- Heavy ","EmMed_21",{"$f":"ROW()","v":288},null,null,null,null,null,"Type I"]
["EMS Physician ","EmMed_22",{"$f":"ROW()","v":289},null,null,null,null,null,"Type II"]
["Medical Supply Coordinator ","EmMed_23",{"$f":"ROW()","v":290},null,null,null,null,null,"Type III"]
["Paramedic","EmMed_24",{"$f":"ROW()","v":291},null,null,null,null,null,"Trailer, Small Equipment"]
["Area Command Team, Firefighting","FireHaz_1",{"$f":"ROW()","v":292},null,null,null,null,null,"Type I"]
["Brush Patrol, Firefighting (Type VI Engine)","FireHaz_2",{"$f":"ROW()","v":293},null,null,null,null,null,"Type II"]
["Crew Transport (Firefighting Crew)","FireHaz_3",{"$f":"ROW()","v":294},null,null,null,null,null,"Truck, Off-Road Dump"]
["Engine, Fire (Pumper)","FireHaz_4",{"$f":"ROW()","v":295},null,null,null,null,null,"Type I"]
["Fire Boat","FireHaz_5",{"$f":"ROW()","v":296},null,null,null,null,null,"Type II"]
["Fire Truck - Aerial (Ladder or Platform)","FireHaz_6",{"$f":"ROW()","v":297},null,null,null,null,null,"Type III"]
["Foam Tender, Firefighting","FireHaz_7",{"$f":"ROW()","v":298},null,null,null,null,null,"Type IV"]
["Fuel Tender (Gasoline, Diesel, AvGas, aka Gas Tanker)","FireHaz_8",{"$f":"ROW()","v":299},null,null,null,null,null,"Truck, On-Road Dump"]
["Hand Crew","FireHaz_9",{"$f":"ROW()","v":300},null,null,null,null,null,"Type I"]
["HazMat Entry Team","FireHaz_10",{"$f":"ROW()","v":301},null,null,null,null,null,"Type II"]
["Helicopters, Firefighting","FireHaz_11",{"$f":"ROW()","v":302},null,null,null,null,null,"Type III"]
["Helitanker (Firefighting Helicopter)","FireHaz_12",{"$f":"ROW()","v":303},null,null,null,null,null,"Type IV"]
["Incident Management Team, Firefighting","FireHaz_13",{"$f":"ROW()","v":304},null,null,null,null,null,"Truck, Plow"]
["Interagency Buying Team, Firefighting","FireHaz_14",{"$f":"ROW()","v":305},null,null,null,null,null,"Type I"]
["Mobile Communications Unit (Law/Fire)","FireHaz_15",{"$f":"ROW()","v":306},null,null,null,null,null,"Type II"]
["Portable Pump","FireHaz_16",{"$f":"ROW()","v":307},null,null,null,null,null,"Type III"]
["Strike Team, Engine (Fire)","FireHaz_17",{"$f":"ROW()","v":308},null,null,null,null,null,"Type IV"]
["U.S. Coast Guard National Strike Force","FireHaz_18",{"$f":"ROW()","v":309},null,null,null,null,null,"Truck, Sewer Flusher"]
["Water Tender, Firefighting (Tanker)","FireHaz_19",{"$f":"ROW()","v":310},null,null,null,null,null,"Type I"]
["Airport Firefighter","FireHaz_20",{"$f":"ROW()","v":311},null,null,null,null,null,"Type II"]
["Emergency Vehicle Technician","FireHaz_21",{"$f":"ROW()","v":312},null,null,null,null,null,"Type III"]
["Fire Apparatus Driver/Operator","FireHaz_22",{"$f":"ROW()","v":313},null,null,null,null,null,"Type IV"]
["Firefighter","FireHaz_23",{"$f":"ROW()","v":314},null,null,null,null,null,"Truck, Tractor Trailer"]
["Fire Inspector","FireHaz_24",{"$f":"ROW()","v":315},null,null,null,null,null,"Type I"]
["Fire Officer","FireHaz_25",{"$f":"ROW()","v":316},null,null,null,null,null,"Type II"]
["HazMat Officer","FireHaz_26",{"$f":"ROW()","v":317},null,null,null,null,null,"Type III"]
["HazMat Safety Officer","FireHaz_27",{"$f":"ROW()","v":318},null,null,null,null,null,"Tug Boat (general)"]
["HazMat Technician","FireHaz_28",{"$f":"ROW()","v":319},null,null,null,null,null,"Type I"]
["Plans Examiner","FireHaz_29",{"$f":"ROW()","v":320},null,null,null,null,null,"Type II"]
["Public Safety Telecommunicator","FireHaz_30",{"$f":"ROW()","v":321},null,null,null,null,null,"Type III"]
["Wildland Firefighter","FireHaz_31",{"$f":"ROW()","v":322},null,null,null,null,null,"Water Pumps, De-Watering"]
["Wildland Fire Officer","FireHaz_32",{"$f":"ROW()","v":323},null,null,null,null,null,"Type I"]
["Wildland/Urban Interface Protection Specialist","FireHaz_33",{"$f":"ROW()","v":324},null,null,null,null,null,"Type II"]
["Air Search Team (Fixed-Wing)","SAR_1",{"$f":"ROW()","v":325},null,null,null,null,null,"Type III"]
["Airborne Reconnaissance (Fixed-Wing)","SAR_2",{"$f":"ROW()","v":326},null,null,null,null,null,"Type IV"]
["Canine SAR Team - Avalanche Snow Air Scent","SAR_3",{"$f":"ROW()","v":327},null,null,null,null,null,"Water Pumps, Drinking Water Supply - Auxillary Pump"]
["Canine SAR Team - Disaster Response","SAR_4",{"$f":"ROW()","v":328},null,null,null,null,null,"Type I"]
["Canine SAR Team - Land Cadaver Air Scent","SAR_5",{"$f":"ROW()","v":329},null,null,null,null,null,"Type II"]
["Canine SAR Team - Water Air Scent","SAR_6",{"$f":"ROW()","v":330},null,null,null,null,null,"Type III"]
["Canine SAR Team - Wilderness Air Scent","SAR_7",{"$f":"ROW()","v":331},null,null,null,null,null,"Type IV"]
["Canine SAR Team -  Wilderness Tracking/Trailing","SAR_8",{"$f":"ROW()","v":332},null,null,null,null,null,"Water Pumps, Water Distribution"]
["Cave SAR Team","SAR_9",{"$f":"ROW()","v":333},null,null,null,null,null,"Type I"]
["Collapse SAR Team","SAR_10",{"$f":"ROW()","v":334},null,null,null,null,null,"Type II"]
["Mine and Tunnel SAR Team","SAR_11",{"$f":"ROW()","v":335},null,null,null,null,null,"Type III"]
["Mountain SAR Team","SAR_12",{"$f":"ROW()","v":336},null,null,null,null,null,"Type IV"]
["Radio Direction Finding Team","SAR_13",{"$f":"ROW()","v":337},null,null,null,null,null,"Water Pumps, Wastewater"]
["Swiftwater/Flood SAR Team","SAR_14",{"$f":"ROW()","v":338},null,null,null,null,null,"Type I"]
["US&R Incident Support Team","SAR_15",{"$f":"ROW()","v":339},null,null,null,null,null,"Type II"]
["US&R Task Forces","SAR_16",{"$f":"ROW()","v":340},null,null,null,null,null,"Type III"]
["Wilderness SAR Team","SAR_17",{"$f":"ROW()","v":341},null,null,null,null,null,"Type IV"]
["Technical Rescue Squad Officer","SAR_18",{"$f":"ROW()","v":342},null,null,null,null,null,"Water Truck (example only)"]
["Technical Rescue Squad Technician","SAR_19",{"$f":"ROW()","v":343},null,null,null,null,null,"Type I"]
["Search and Rescue Branch Director","SAR_20",{"$f":"ROW()","v":344},null,null,null,null,null,"Wheel Dozer"]
["Helicopter Search and Rescue Crew Chief","SAR_21",{"$f":"ROW()","v":345},null,null,null,null,null,"Type I"]
["Helicopter Search and Rescue Pilot","SAR_22",{"$f":"ROW()","v":346},null,null,null,null,null,"Type II"]
["Helicopter Search and Rescue Technician","SAR_23",{"$f":"ROW()","v":347},null,null,null,null,null,"Wheel Loader Backhoe"]
["Structural Collapse Search Technician","SAR_24",{"$f":"ROW()","v":348},null,null,null,null,null,"Type I"]
["Structural Collapse Rescue Squad Officer","SAR_25",{"$f":"ROW()","v":349},null,null,null,null,null,"Type II"]
["Structural Collapse Search Squad Officer","SAR_26",{"$f":"ROW()","v":350},null,null,null,null,null,"Type III"]
["Disaster Collapsed Structure Canine Search Manager","SAR_27",{"$f":"ROW()","v":351},null,null,null,null,null,"Type IV"]
["Disaster Collapsed Structure Canine Search Technical Specialist (Advisor)","SAR_28",{"$f":"ROW()","v":352},null,null,null,null,null,"Wheel Loaders (Large 41cy to 8cy)"]
["Disaster Collapsed Structure Canine Search Technician","SAR_29",{"$f":"ROW()","v":353},null,null,null,null,null,"Type I"]
["Helicopter Search and/or Rescue Crew Chief (Disaster, Mountain, Stillwater, Swiftwater, Wilderness, Urban, et al)","SAR_30",{"$f":"ROW()","v":354},null,null,null,null,null,"Type II"]
["Helicopter Search and/or Rescue Pilot (Disaster, Mountain, Stillwater, Swiftwater, Wilderness, Urban, et al)","SAR_31",{"$f":"ROW()","v":355},null,null,null,null,null,"Type III"]
["Helicopter Search and/or Rescue Technician (Disaster, Mountain, Stillwater, Swiftwater, Wilderness, Urban, et al)","SAR_32",{"$f":"ROW()","v":356},null,null,null,null,null,"Type IV"]
["Human Remains Canine Search Manager","SAR_33",{"$f":"ROW()","v":357},null,null,null,null,null,"Wheel Loaders (Medium 7cy to 3cy)"]
["Human Remains Canine Search Technical Specialist (Advisor)","SAR_34",{"$f":"ROW()","v":358},null,null,null,null,null,"Type I"]
["Human Remains Canine Search Technician","SAR_35",{"$f":"ROW()","v":359},null,null,null,null,null,"Type II"]
["Mountain Search and/or Rescue Manager","SAR_36",{"$f":"ROW()","v":360},null,null,null,null,null,"Type III"]
["Mountain Search and/or Rescue Technical Specialist (Advisor)","SAR_37",{"$f":"ROW()","v":361},null,null,null,null,null,"Type IV"]
["Mountain Search and/or Rescue Technician","SAR_38",{"$f":"ROW()","v":362},null,null,null,null,null,"Wheel Loaders (Small 7cy to 2cy)"]
["Mountain Search and/or Rescue Unit Leader","SAR_39",{"$f":"ROW()","v":363},null,null,null,null,null,"Type I"]
["Emergency Services Technical SAR Manager","SAR_40",{"$f":"ROW()","v":364},null,null,null,null,null,"Type II"]
["Emergency Services Technical SAR Technician","SAR_41",{"$f":"ROW()","v":365},null,null,null,null,null,"Type III"]
["Logistics Search and/or Rescue Technician (Disaster, Mountain, Stillwater, Swiftwater, Wilderness, Urban, et al)","SAR_42",{"$f":"ROW()","v":366},null,null,null,null,null,"Wheel Loaders, Skid Steer (Small)"]
["Medical Search and/or Rescue Technician (Disaster, Mountain, Stillwater, Swiftwater, Wilderness, Urban, et al)","SAR_43",{"$f":"ROW()","v":367},null,null,null,null,null,"Type I"]
["Structural Collapse Rescue Manager","SAR_44",{"$f":"ROW()","v":368},null,null,null,null,null,"Type II"]
["Structural Collapse Rescue Technician","SAR_45",{"$f":"ROW()","v":369},null,null,null,null,null,"Type III"]
["Structural Collapse Search Manager","SAR_46",{"$f":"ROW()","v":370},null,null,null,null,null,"Wheel Loaders, Telescopic Handler"]
["Structural Collapse Search Technician","SAR_47",{"$f":"ROW()","v":371},null,null,null,null,null,"Type I"]
["Swiftwater/Flood Rescue Manager","SAR_48",{"$f":"ROW()","v":372},null,null,null,null,null,"Type II"]
["Swiftwater/Flood Rescue Technician","SAR_49",{"$f":"ROW()","v":373},null,null,null,null,null,"Type III"]
["Swiftwater/Flood Rescue Technician- Boat Bowman","SAR_50",{"$f":"ROW()","v":374},null,null,null,null,null,"Type IV"]
["Swiftwater/Flood Rescue Technician- Boat Operator","SAR_51",{"$f":"ROW()","v":375},null,null,null,null,null,"Wood Chipper"]
["Swiftwater/Flood Rescue Technical Specialist (Advisor)","SAR_52",{"$f":"ROW()","v":376},null,null,null,null,null,"Type I"]
["Swiftwater/Flood Rescue Technician- Animal Rescue","SAR_53",{"$f":"ROW()","v":377},null,null,null,null,null,"Wood Tub Grinder"]
["Swiftwater/Flood Rescue Unit Leader","SAR_54",{"$f":"ROW()","v":378},null,null,null,null,null,"Type I"]
["Water Canine Search Manager","SAR_55",{"$f":"ROW()","v":379},null,null,null,null,null,"Type II"]
["Water Canine Search Technician","SAR_56",{"$f":"ROW()","v":380},null,null,null,null,null,"Type III"]
["Wilderness Air Scent Canine Search Manager","SAR_57",{"$f":"ROW()","v":381},null,null,null,null,null,"Type IV"]
["Wilderness Air Scent Canine Search Technician","SAR_58",{"$f":"ROW()","v":382},null,null,null,null,null,"Damage Assessment, Repair and Start-Up Team - Water Production Facilities"]
["Wilderness Search and/or Rescue Manager","SAR_59",{"$f":"ROW()","v":383},null,null,null,null,null,"Type I"]
["Wilderness Search and/or Rescue Technical Specialist (Advisor)","SAR_60",{"$f":"ROW()","v":384},null,null,null,null,null,"Damage Assessment, Repair and Start-Up Team - Wastewater Treatment Facilities"]
["Wilderness Search and/or Rescue Technician","SAR_61",{"$f":"ROW()","v":385},null,null,null,null,null,"Type I"]
["Wilderness Search and/or Rescue Unit Leader","SAR_62",{"$f":"ROW()","v":386},null,null,null,null,null,"Maintenance and Repair Team – Light Equipment Public Works"]
["Field Kitchen Unit","MC_1",{"$f":"ROW()","v":387},null,null,null,null,null,"Type I"]
["Laundry Unit","MC_2",{"$f":"ROW()","v":388},null,null,null,null,null,"Damage Assessment, Repair and Start-Up Team – Wastewater Lift and Pump Station"]
["Mobile Kitchen Unit","MC_3",{"$f":"ROW()","v":389},null,null,null,null,null,"Type I"]
["Shelter Management Team","MC_4",{"$f":"ROW()","v":390},null,null,null,null,null,"Type II"]
["Shower Unit","MC_5",{"$f":"ROW()","v":391},null,null,null,null,null,"Damage Assessment and Repair Team – Sewer Mains"]
["Temporary Child Care Support Services Team","MC_6",{"$f":"ROW()","v":392},null,null,null,null,null,"Type I"]
["State Mass Care Coordinator","MC_7",{"$f":"ROW()","v":393},null,null,null,null,null,"Damage Assessment and Repair Team – Water Pump Facilities"]
["Shelter Manager","MC_8",{"$f":"ROW()","v":394},null,null,null,null,null,"Type I"]
["Field Kitchen Manager","MC_9",{"$f":"ROW()","v":395},null,null,null,null,null,"Emergency Management Support Team – Water/Wastewater"]
["Temporary Child Care Support Services Team Leader","MC_10",{"$f":"ROW()","v":396},null,null,null,null,null,"Type I"]
["Shelter Function Leader","MC_11",{"$f":"ROW()","v":397},null,null,null,null,null,"Damage Assessment Team - Debris"]
["Shelter Registration Leader","MC_12",{"$f":"ROW()","v":398},null,null,null,null,null,"Type I"]
["Shelter Dormitory Leader","MC_13",{"$f":"ROW()","v":399},null,null,null,null,null,"Repair Restoration Team – Communications"]
["Airborne Communications Relay Team (Fixed-Wing)","IncMgmt_1",{"$f":"ROW()","v":400},null,null,null,null,null,"Type I"]
["Airborne Communications Relay (Fixed-Wing) (CAP)","IncMgmt_2",{"$f":"ROW()","v":401},null,null,null,null,null,"Public Works Emergency Management Support Team"]
["Airborne Transport Team (Fixed-Wing)","IncMgmt_3",{"$f":"ROW()","v":402},null,null,null,null,null,"Type I"]
["Communications Support Team (CAP)","IncMgmt_4",{"$f":"ROW()","v":403},null,null,null,null,null,"Disaster Management Recovery Team – Public Works"]
["Crisis Incident Stress Management Team","IncMgmt_5",{"$f":"ROW()","v":404},null,null,null,null,null,"Type I"]
["Donations Management Personnel/Team","IncMgmt_7",{"$f":"ROW()","v":405},null,null,null,null,null,"Repair and Restoration Team – SCADA"]
["EOC Management Support Team","IncMgmt_9",{"$f":"ROW()","v":406},null,null,null,null,null,"Type I"]
["Event Coordination Team","IncMgmt_12",{"$f":"ROW()","v":407},null,null,null,null,null,"Tire Repair Team"]
["Evacuation Liaison Team (ELT)","IncMgmt_13",{"$f":"ROW()","v":408},null,null,null,null,null,"Type I"]
["Incident Management Team","IncMgmt_14",{"$f":"ROW()","v":409},null,null,null,null,null,"Maintenance and Repair Team - Heavy Equipment"]
["Individual Assistance Disaster Assessment Team","IncMgmt_15",{"$f":"ROW()","v":410},null,null,null,null,null,"Type I"]
["Mobile Communications Center (Mobile EOC)","IncMgmt_17",{"$f":"ROW()","v":411},null,null,null,null,null,"Damage Assessment, Repair and Start-Up Team - Water Production Facilities"]
["Mobile Feeding Kitchen (Mobile Field Kitchen)","IncMgmt_18",{"$f":"ROW()","v":412},null,null,null,null,null,"Type I"]
["Rapid Needs Assessment Team","IncMgmt_20",{"$f":"ROW()","v":413},null,null,null,null,null,"Damage Assessment, Repair and Start-Up Team - Wastewater Treatment Facilities"]
["Donations Coordinator","IncMgmt_21",{"$f":"ROW()","v":414},null,null,null,null,null,"Type I"]
["EOC Finance/Administration Section Chief/Coordinator","IncMgmt_22",{"$f":"ROW()","v":415},null,null,null,null,null,"Maintenance and Repair Team – Light Equipment Public Works"]
["EOC Operations Section Chief","IncMgmt_23",{"$f":"ROW()","v":416},null,null,null,null,null,"Type I"]
["EOC Planning Section Chief","IncMgmt_24",{"$f":"ROW()","v":417},null,null,null,null,null,"Damage Assessment, Repair and Start-Up Team – Wastewater Lift and Pump Station"]
["Individual Assistance Disaster Assessment Team Leader","IncMgmt_25",{"$f":"ROW()","v":418},null,null,null,null,null,"Type I"]
["Public Assistance Coordinator","IncMgmt_26",{"$f":"ROW()","v":419},null,null,null,null,null,"Type II"]
["Volunteer Agency Liaison","IncMgmt_27",{"$f":"ROW()","v":420},null,null,null,null,null,"Damage Assessment and Repair Team – Sewer Mains"]
["Liaison Officer","IncMgmt_28",{"$f":"ROW()","v":421},null,null,null,null,null,"Type I"]
["Finance/Administration Section Chief ","IncMgmt_29",{"$f":"ROW()","v":422},null,null,null,null,null,"Damage Assessment and Repair Team – Water Pump Facilities"]
["Incident Commander ","IncMgmt_30",{"$f":"ROW()","v":423},null,null,null,null,null,"Type I"]
["Logistics Section Chief ","IncMgmt_31",{"$f":"ROW()","v":424},null,null,null,null,null,"Emergency Management Support Team – Water/Wastewater"]
["Operations Section Chief ","IncMgmt_32",{"$f":"ROW()","v":425},null,null,null,null,null,"Type I"]
["Planning Section Chief ","IncMgmt_33",{"$f":"ROW()","v":426},null,null,null,null,null,"Damage Assessment Team - Debris"]
["Public Information Officer","IncMgmt_34",{"$f":"ROW()","v":427},null,null,null,null,null,"Type I"]
["Safety Officer","IncMgmt_35",{"$f":"ROW()","v":428},null,null,null,null,null,"Repair Restoration Team – Communications"]
["Bomb Squad/Explosives Team","LawEnf_1",{"$f":"ROW()","v":429},null,null,null,null,null,"Type I"]
["Law Enforcement Aviation-Helicopters-Patrol & Surveillance","LawEnf_2",{"$f":"ROW()","v":430},null,null,null,null,null,"Public Works Emergency Management Support Team"]
["Law Enforcement Observation Aircraft (Fixed-Wing)","LawEnf_3",{"$f":"ROW()","v":431},null,null,null,null,null,"Type I"]
["Law Enforcement Strike Team (Patrol Team)","LawEnf_7",{"$f":"ROW()","v":432},null,null,null,null,null,"Disaster Management Recovery Team – Public Works"]
["Mobile Field Force Law Enforcement (Crowd Control Teams)","LawEnf_4",{"$f":"ROW()","v":433},null,null,null,null,null,"Type I"]
["Public Safety Dive Team","LawEnf_5",{"$f":"ROW()","v":434},null,null,null,null,null,"Repair and Restoration Team – SCADA"]
["SWAT/Tactical Teams","LawEnf_6",{"$f":"ROW()","v":435},null,null,null,null,null,"Type I"]
["Public Health: Epidemiology (Surveillance and Investigation)","MedPub_1",{"$f":"ROW()","v":436},null,null,null,null,null,"Tire Repair Team"]
["Public Health: Isolation and Quarantine","MedPub_2",{"$f":"ROW()","v":437},null,null,null,null,null,"Type I"]
["Public Health: Environmental Health","MedPub_3",{"$f":"ROW()","v":438},null,null,null,null,null,"Maintenance and Repair Team - Heavy Equipment"]
["Public Health: Mass Dispensing Consultant Team","MedPub_4",{"$f":"ROW()","v":439},null,null,null,null,null,"Type I"]
["Public Health: Receiving, Staging, and Storing (RSS) Task Force","MedPub_5",{"$f":"ROW()","v":440},null,null,null,null,null,"Structure Condition Evaluator"]
["Ancillary Support Team (Laboratory, Pharmacy, or Radiology  Services)","MedPub_6",{"$f":"ROW()","v":441},null,null,null,null,null,"Type I"]
["Emergency/Critical Care Team","MedPub_7",{"$f":"ROW()","v":442},null,null,null,null,null,"Type II"]
["Mobile Field Medical Team","MedPub_8",{"$f":"ROW()","v":443},null,null,null,null,null,"Assistant Public Works Director - Logistics"]
["Specialty Services Team","MedPub_9",{"$f":"ROW()","v":444},null,null,null,null,null,"Type I"]
["Palliative Care/Hospice Team","MedPub_10",{"$f":"ROW()","v":445},null,null,null,null,null,"Assistant Public Works Director - Operations"]
["Public Health and Medical Team in a Shelter","MedPub_11",{"$f":"ROW()","v":446},null,null,null,null,null,"Type I"]
["Medical/Public Health System Assessment Team","MedPub_12",{"$f":"ROW()","v":447},null,null,null,null,null,"Civil/Field Engineer"]
["Advanced Practice Registered Nurse ","MedPub_13",{"$f":"ROW()","v":448},null,null,null,null,null,"Type I"]
["Assessment Team Leader ","MedPub_14",{"$f":"ROW()","v":449},null,null,null,null,null,"Debris Collection Supervisor"]
["Behavioral Health Specialist, Licensed ","MedPub_15",{"$f":"ROW()","v":450},null,null,null,null,null,"Type I"]
["Behavioral Health Specialist, Unlicensed ","MedPub_16",{"$f":"ROW()","v":451},null,null,null,null,null,"Debris Removal Manager"]
["Dental Assistant/Hygienist ","MedPub_17",{"$f":"ROW()","v":452},null,null,null,null,null,"Type I"]
["Dentist ","MedPub_18",{"$f":"ROW()","v":453},null,null,null,null,null,"Debris Site Supervisor"]
["Dialysis Technician ","MedPub_19",{"$f":"ROW()","v":454},null,null,null,null,null,"Type I"]
["Dietician/Nutritionist ","MedPub_20",{"$f":"ROW()","v":455},null,null,null,null,null,"Engineering Branch Manager"]
["Environmental Health Generalist ","MedPub_21",{"$f":"ROW()","v":456},null,null,null,null,null,"Type I"]
["Environmental Health Specialist ","MedPub_22",{"$f":"ROW()","v":457},null,null,null,null,null,"Engineering Division Manager"]
["Environmental Health Team Leader ","MedPub_23",{"$f":"ROW()","v":458},null,null,null,null,null,"Type I"]
["Epidemiologist ","MedPub_24",{"$f":"ROW()","v":459},null,null,null,null,null,"Equipment Operator"]
["Epidemiology Interviewer ","MedPub_25",{"$f":"ROW()","v":460},null,null,null,null,null,"Type I"]
["Epidemiology Team Leader ","MedPub_26",{"$f":"ROW()","v":461},null,null,null,null,null,"Public Works Director"]
["Laboratory Technologist/Technician ","MedPub_27",{"$f":"ROW()","v":462},null,null,null,null,null,"Type I"]
["Mass Dispensing Team Leader ","MedPub_28",{"$f":"ROW()","v":463},null,null,null,null,null,"Quality Assurance Personnel"]
["Mass Dispensing, Consultant ","MedPub_29",{"$f":"ROW()","v":464},null,null,null,null,null,"Type I"]
["Mass Dispensing, Dispenser ","MedPub_30",{"$f":"ROW()","v":465},null,null,null,null,null,"Structural Engineer"]
["Mass Dispensing, Operations Team Consultant ","MedPub_31",{"$f":"ROW()","v":466},null,null,null,null,null,"Type I"]
["Mass Dispensing, Patient Intake/Line Flow Consultant ","MedPub_32",{"$f":"ROW()","v":467},null,null,null,null,null,"Utility Systems Reconstruction Manager"]
["Mass Dispensing, Public Information Consultant ","MedPub_33",{"$f":"ROW()","v":468},null,null,null,null,null,"Type I"]
["Mass Dispensing, Vaccinator ","MedPub_34",{"$f":"ROW()","v":469},null,null,null,null,null,"Wastewater Collection Manager"]
["Medical Unit Team Leader ","MedPub_35",{"$f":"ROW()","v":470},null,null,null,null,null,"Type I"]
["Patient Care Technician ","MedPub_36",{"$f":"ROW()","v":471},null,null,null,null,null,"Wastewater System Manager"]
["Pharmacist ","MedPub_37",{"$f":"ROW()","v":472},null,null,null,null,null,"Type I"]
["Pharmacy Technician ","MedPub_38",{"$f":"ROW()","v":473},null,null,null,null,null,"Wastewater Treatment Manager"]
["Phlebotomist ","MedPub_39",{"$f":"ROW()","v":474},null,null,null,null,null,"Type I"]
["Physician ","MedPub_40",{"$f":"ROW()","v":475}]
["Physician Assistant ","MedPub_41",{"$f":"ROW()","v":476}]
["Public Health Data Entry Staff ","MedPub_42",{"$f":"ROW()","v":477}]
["Public Health Disaster Assessor ","MedPub_43",{"$f":"ROW()","v":478}]
["Public Health Information Technology Specialist ","MedPub_44",{"$f":"ROW()","v":479}]
["Public Health and Medical Support Team Leader in a Shelter","MedPub_45",{"$f":"ROW()","v":480}]
["Radiologic Technician ","MedPub_46",{"$f":"ROW()","v":481}]
["RSS Distribution Leader ","MedPub_47",{"$f":"ROW()","v":482}]
["RSS Finance and Administrative Team Lead ","MedPub_48",{"$f":"ROW()","v":483}]
["RSS Logistics Team Lead ","MedPub_49",{"$f":"ROW()","v":484}]
["RSS Operations Team Lead ","MedPub_50",{"$f":"ROW()","v":485}]
["RSS Tactical Communications Leader ","MedPub_51",{"$f":"ROW()","v":486}]
["RSS Task Force Leader ","MedPub_52",{"$f":"ROW()","v":487}]
["Registered Nurse ","MedPub_53",{"$f":"ROW()","v":488}]
["Respiratory Therapist ","MedPub_54",{"$f":"ROW()","v":489}]
["Social Worker ","MedPub_55",{"$f":"ROW()","v":490}]
["Surgical Technician ","MedPub_56",{"$f":"ROW()","v":491}]
["Aerial Lift - Articulating Boom","PubWks_1",{"$f":"ROW()","v":492}]
["Aerial Lift, Self Propelled, Scissor, Rough Terrain","PubWks_2",{"$f":"ROW()","v":493}]
["Aerial Lift - Telescopic Boom","PubWks_3",{"$f":"ROW()","v":494}]
["Aerial Lift - Truck Mounted","PubWks_4",{"$f":"ROW()","v":495}]
["Air Compressor","PubWks_5",{"$f":"ROW()","v":496}]
["Air Conditioner/Heater","PubWks_6",{"$f":"ROW()","v":497}]
["Air Curtain Burners (Fire Box-Above Ground, Refractory Walled)","PubWks_7",{"$f":"ROW()","v":498}]
["Air Curtain Burners (Trench Burner, In-Ground)","PubWks_8",{"$f":"ROW()","v":499}]
["Buses","PubWks_9",{"$f":"ROW()","v":500}]
["Chillers & Air Handlers (500 Ton to 50 Ton)","PubWks_10",{"$f":"ROW()","v":501}]
["Concrete Cutter/Multi-Procesor for Hydraulic Excavator","PubWks_11",{"$f":"ROW()","v":502}]
["Cranes, All Terain & Rough Terrain","PubWks_12",{"$f":"ROW()","v":503}]
["Cranes, Crawler (Lattice)","PubWks_13",{"$f":"ROW()","v":504}]
["Electronic Boards, Arrow Boards","PubWks_14",{"$f":"ROW()","v":505}]
["Electronic Boards, Variable Message Signs (VMS)","PubWks_15",{"$f":"ROW()","v":506}]
["Floodlights","PubWks_16",{"$f":"ROW()","v":507}]
["Generators","PubWks_17",{"$f":"ROW()","v":508}]
["Grader","PubWks_18",{"$f":"ROW()","v":509}]
["Hydraulic Excavator (Large Mass Excavation 13cy to 3cy buckets)","PubWks_19",{"$f":"ROW()","v":510}]
["Hydraulic Excavator (Medium Mass Excavation 4cy to 1.75cy buckets)","PubWks_20",{"$f":"ROW()","v":511}]
["Hydraulic Excavator (Compact - Short Radius 1.75cy to 0.62cy buckets)","PubWks_21",{"$f":"ROW()","v":512}]
["Hydraulic Excavator Truck Mounted","PubWks_22",{"$f":"ROW()","v":513}]
["Road Sweeper","PubWks_23",{"$f":"ROW()","v":514}]
["Scraper, Earth Moving","PubWks_24",{"$f":"ROW()","v":515}]
["Snow Blower (Chassis Mounted)","PubWks_25",{"$f":"ROW()","v":516}]
["Snow Blower (Loader Mounted)","PubWks_26",{"$f":"ROW()","v":517}]
["Snow Cat","PubWks_27",{"$f":"ROW()","v":518}]
["Track Dozer","PubWks_28",{"$f":"ROW()","v":519}]
["Track Loader","PubWks_29",{"$f":"ROW()","v":520}]
["Trailer, Equipment Tag-Trailer","PubWks_30",{"$f":"ROW()","v":521}]
["Trailer, Dump (one type/example only)","PubWks_31",{"$f":"ROW()","v":522}]
["Trailer, Flat Bed Truck (two types/example only)","PubWks_32",{"$f":"ROW()","v":523}]
["Trailer, Gooseneck Trailer","PubWks_33",{"$f":"ROW()","v":524}]
["Trailer, Small Equipment","PubWks_34",{"$f":"ROW()","v":525}]
["Truck, Off-Road Dump","PubWks_35",{"$f":"ROW()","v":526}]
["Truck, On-Road Dump","PubWks_36",{"$f":"ROW()","v":527}]
["Truck, Plow","PubWks_37",{"$f":"ROW()","v":528}]
["Truck, Sewer Flusher","PubWks_38",{"$f":"ROW()","v":529}]
["Truck, Tractor Trailer","PubWks_39",{"$f":"ROW()","v":530}]
["Tug Boat (general)","PubWks_40",{"$f":"ROW()","v":531}]
["Water Pumps, De-Watering","PubWks_41",{"$f":"ROW()","v":532}]
["Water Pumps, Drinking Water Supply - Auxillary Pump","PubWks_42",{"$f":"ROW()","v":533}]
["Water Pumps, Water Distribution","PubWks_43",{"$f":"ROW()","v":534}]
["Water Pumps, Wastewater","PubWks_44",{"$f":"ROW()","v":535}]
["Water Truck (example only)","PubWks_45",{"$f":"ROW()","v":536}]
["Wheel Dozer","PubWks_46",{"$f":"ROW()","v":537}]
["Wheel Loader Backhoe","PubWks_47",{"$f":"ROW()","v":538}]
["Wheel Loaders (Large 41cy to 8cy)","PubWks_48",{"$f":"ROW()","v":539}]
["Wheel Loaders (Medium 7cy to 3cy)","PubWks_49",{"$f":"ROW()","v":540}]
["Wheel Loaders (Small 7cy to 2cy)","PubWks_50",{"$f":"ROW()","v":541}]
["Wheel Loaders, Skid Steer (Small)","PubWks_51",{"$f":"ROW()","v":542}]
["Wheel Loaders, Telescopic Handler","PubWks_52",{"$f":"ROW()","v":543}]
["Wood Chipper","PubWks_53",{"$f":"ROW()","v":544}]
["Wood Tub Grinder","PubWks_54",{"$f":"ROW()","v":545}]
["Damage Assessment, Repair and Start-Up Team - Water Production Facilities","PubWks_55",{"$f":"ROW()","v":546}]
["Damage Assessment, Repair and Start-Up Team - Wastewater Treatment Facilities","PubWks_56",{"$f":"ROW()","v":547}]
["Maintenance and Repair Team – Light Equipment Public Works","PubWks_57",{"$f":"ROW()","v":548}]
["Damage Assessment, Repair and Start-Up Team – Wastewater Lift and Pump Station","PubWks_58",{"$f":"ROW()","v":549}]
["Damage Assessment and Repair Team – Sewer Mains","PubWks_59",{"$f":"ROW()","v":550}]
["Damage Assessment and Repair Team – Water Pump Facilities","PubWks_60",{"$f":"ROW()","v":551}]
["Emergency Management Support Team – Water/Wastewater","PubWks_61",{"$f":"ROW()","v":552}]
["Damage Assessment Team - Debris","PubWks_62",{"$f":"ROW()","v":553}]
["Repair Restoration Team – Communications","PubWks_63",{"$f":"ROW()","v":554}]
["Public Works Emergency Management Support Team","PubWks_64",{"$f":"ROW()","v":555}]
["Disaster Management Recovery Team – Public Works","PubWks_65",{"$f":"ROW()","v":556}]
["Repair and Restoration Team – SCADA","PubWks_66",{"$f":"ROW()","v":557}]
["Tire Repair Team","PubWks_67",{"$f":"ROW()","v":558}]
["Maintenance and Repair Team - Heavy Equipment","PubWks_68",{"$f":"ROW()","v":559}]
["Structure Condition Evaluator","PubWks_69",{"$f":"ROW()","v":560}]
["Assistant Public Works Director - Logistics","PubWks_70",{"$f":"ROW()","v":561}]
["Assistant Public Works Director - Operations","PubWks_71",{"$f":"ROW()","v":562}]
["Civil/Field Engineer","PubWks_72",{"$f":"ROW()","v":563}]
["Debris Collection Supervisor","PubWks_73",{"$f":"ROW()","v":564}]
["Debris Removal Manager","PubWks_74",{"$f":"ROW()","v":565}]
["Debris Site Supervisor","PubWks_75",{"$f":"ROW()","v":566}]
["Engineering Branch Manager","PubWks_76",{"$f":"ROW()","v":567}]
["Engineering Division Manager","PubWks_77",{"$f":"ROW()","v":568}]
["Equipment Operator","PubWks_78",{"$f":"ROW()","v":569}]
["Public Works Director","PubWks_79",{"$f":"ROW()","v":570}]
["Quality Assurance Personnel","PubWks_80",{"$f":"ROW()","v":571}]
["Structural Engineer","PubWks_81",{"$f":"ROW()","v":572}]
["Utility Systems Reconstruction Manager","PubWks_82",{"$f":"ROW()","v":573}]
["Wastewater Collection Manager","PubWks_83",{"$f":"ROW()","v":574}]
["Wastewater System Manager","PubWks_84",{"$f":"ROW()","v":575}]
["Wastewater Treatment Manager","PubWks_85",{"$f":"ROW()","v":576}]
["GIS Analyst","GIS_1",{"$f":"ROW()","v":577}]
["GIS Supervisor","GIS_2",{"$f":"ROW()","v":578}]
["GIS Team Leader","GIS_3",{"$f":"ROW()","v":579}]
["GIS Field Data Entry Technician","GIS_4",{"$f":"ROW()","v":580}]

{"sheet":"Data","index":76,"n_rows":33,"n_cols":13,"rows_kept":33,"cut":false,"hidden":true,"merged":[]}
[]
["Core Capability","Priority","Planning","Organization","Equipment","Training","Exercises","Planning","Organization","Equipment","Training","Exercises","Responsibility"]
["Planning"]
["Public Information and Warning"]
["Operational Coordination"]
["Forensics and Attribution"]
["Intelligence and Information Sharing"]
["Interdiction and Disruption"]
["Screening, Search, and Detection"]
["Access Control and Identity Verification"]
["Cybersecurity"]
["Physical Protective Measures"]
["Risk Management for Protection Programs and Activities"]
["Supply Chain Integrity and Security"]
["Community Resilience"]
["Long-term Vulnerability Reduction"]
["Risk and Disaster Resilience Assessment"]
["Threats and Hazard Identification"]
["Critical Transportation"]
["Environmental Response/Health and Safety"]
["Fatality Management Services"]
["Infrastructure Systems"]
["Mass Care Services",{"$f":"LOOKUP('SPR #1 Planning'!P9, Lists!$R$1:$R$4, Lists!$S$1:$S$4)","v":"Blank"},{"$f":"'SPR #1 Planning'!P14-1","v":0},{"$f":"'SPR #1 Planning'!P18-1","v":0},{"$f":"'SPR #1 Planning'!P21-1","v":0},{"$f":"'SPR #1 Planning'!P24-1","v":0},{"$f":"'SPR #1 Planning'!P28-1","v":0},{"$f":"'SPR #1 Planning'!Q14-1","v":0},{"$f":"'SPR #1 Planning'!Q18-1","v":0},{"$f":"'SPR #1 Planning'!Q21-1","v":0},{"$f":"'SPR #1 Planning'!Q24-1","v":0},{"$f":"'SPR #1 Planning'!Q28-1","v":0},{"$f":"LOOKUP('SPR #1 Planning'!P34-1,Lists!$T$1:$T$6,Lists!$U$1:$U$6)","v":{"$error":"#N/A"}}]
["Mass Search and Rescue Operations"]
["On-scene Security and Protection"]
["Operational  Communications"]
["Public and Private Services and Resources"]
["Public Health and Medical Services"]
["Situational Assessment"]
["Economic Recovery"]
["Health and Social Services"]
["Housing"]
["Natural and Cultural Resources"]